{"text_format":"1","workbook":"xlsx","n_sheets":32,"sheets":["Spielberichte-Blanko","Anhang Blanko","Start","PANA-Rangliste","Mannschaftsübersicht","Spielbogen 10er","Übersicht der Klasse B4","Annegret S.","Ilona W.","Michael W.","Mario J.","Kai R.","Frank N.","Jörg F.","Matthias N.","Deniz H.","Hilfstabelle","Hilfstabelle Spieler","Hilfstabelle Mannschaften","Anhang zum Spielbericht","Spielberichte","Spielereinteilung","Abschlusstabelle  23-24","Spielbogen 7er","BSG-Schnittliste Saison 23-24","\"Alters\"-Übersicht","Ergebnisse nach BVH","10er","Spielbogen 8er","Rangliste PANA-Spieler","Anmeldegruppen Turniere","BSG-Kürzel 2023"],"not_rendered":{"charts":0,"images":25,"macros":1,"external_links":0,"defined_names":97,"comments":1,"pivot_tables":0},"unopened":[],"bounds":{"document_bytes":16777216,"sheet_cells":100000,"rows_first":2000,"rows_last":500,"rows_between":2000,"halvings":0,"cell_chars":16384,"cell_head_chars":4096},"cells_cut":0,"cells_raw":0,"read":"whole","date_system":"1900"}

{"sheet":"Spielberichte-Blanko","index":0,"n_rows":30,"n_cols":12,"rows_kept":30,"cut":false,"hidden":true,"merged":[]}
[]
[null," Spielbericht BOWLING"]
[null,"Betriebssportverband Hamburg e.V.",null,null,null,null,null,null,null,null,null,"Punktspielserie"]
[null,"alle Felder sind unbedingt auszufüllen,da sonst der Spielbericht ungültig ist "]
[]
[null,"Klasse","Herren",null,"     Antritt     Nr.",null,null,"Datum",null,"BSG"]
[]
[null,null,"X)","Pass-Nr.",null,null,"Vor-und Zuname",null,"I","II","III","Gesamt"]
[null,1]
[null,2]
[null,3]
[null,4]
[null,5]
[null,"Bitte mit einem x) versehen",null,null,"     Unterschrift des Spiel-"]
[null,"wenn Ersatzspieler/in",null,null,"     partners"]
[]
[null," Spielbericht BOWLING"]
[null,"Betriebssportverband Hamburg e.V.",null,null,null,null,null,null,null,null,null,"Punktspielserie"]
[null,"alle Felder sind unbedingt auszufüllen,da sonst der Spielbericht ungültig ist "]
[]
[null,"Klasse","  Herren",null,"     Antritt     Nr.",null,null,"Datum",null,"BSG"]
[]
[null,null,"X)","Pass-Nr.",null,null,"Vor-und Zuname",null,"I","II","III","Gesamt"]
[null,1]
[null,2]
[null,3]
[null,4]
[null,5]
[null,"Bitte mit einem x) versehen",null,null,"     Unterschrift des Spiel-"]
[null,"wenn Ersatzspieler/in",null,null,"     partners"]

{"sheet":"Anhang Blanko","index":1,"n_rows":19,"n_cols":14,"rows_kept":19,"cut":false,"hidden":true,"merged":[[18,0,18,1],[4,0,4,1],[4,6,4,7],[6,3,6,4],[8,0,10,1],[11,0,11,1],[12,0,12,1],[13,0,13,1],[14,0,14,1],[15,0,15,1],[16,0,16,1],[17,0,17,1]]}
["Anhang zum Spielbericht  B O W L I N G"]
[null,null,null,null,null,null,null,null,null,null,null,"Punktspielserie"]
["alle Felder sind unbedingt auszufüllen und mit dem Original-Spielbericht einzusenden."]
[]
["Klasse:",null,null,"Antritt-Nr. :",null,"Datum :",null,null,"Halle :"]
[]
[null,null,"Ausrichter BSG:",null,null,"Mannschaftsführer: ",null,null,null,"Telefon:"]
[]
["Durch-\ngänge",null,"BSG","BSG","BSG","BSG","BSG","BSG","BSG","BSG","BSG","BSG","BSG","BSG"]
[null,null,null,null,null,null,null,null,null,null,null,null,{"$f":"VLOOKUP(M11,Hilfstabelle!$L$5:$M$16,2,0)","v":"SGS 1"},{"$f":"VLOOKUP(N11,Hilfstabelle!$L$5:$M$16,2,0)","v":"JUS 2"}]
[null,null,null,null,null,null,null,null,null,null,null,null,{"$f":"+Hilfstabelle!$L15","v":"SG Stern Hamburg 1"},{"$f":"+Hilfstabelle!$L16","v":"Justitzbehörde 2"}]
[1]
[2]
["1 + 2",null,{"$f":"+C13+C12","v":0},{"$f":"+D13+D12","v":0},0,0,0,0,0,0,0,0,0,0]
[3]
["Pins\nGesamt",null,{"$f":"+C15+C14","v":0},{"$f":"+D15+D14","v":0},0,0,0,0,0,0,0,0,0,0]
["Punkte\nAntritt",null,{"$f":"IF(C12>0,RANK(C16,$C$16:$N$16,12),\" \")","v":" "},{"$f":"IF(D12>0,RANK(D16,$C$16:$N$16,12),\" \")","v":" "}," "," "," "," "," "," "," "," "," "," "]
["Punkte\nA L T"]
["Punkte\nN E U",null," "," "," "," "," "," "," "," "," "," "," "," "]

{"sheet":"Start","index":2,"n_rows":22,"n_cols":9,"rows_kept":22,"cut":false,"hidden":false,"merged":[[14,7,14,8],[15,7,15,8],[13,7,13,8],[20,1,20,3],[21,1,21,3],[13,1,13,3],[11,1,11,3],[18,1,18,3],[14,1,14,3],[15,1,15,3],[16,1,16,3],[8,5,8,6],[10,5,10,6],[9,5,9,6],[4,5,4,8],[2,1,2,8],[4,1,4,3],[5,1,5,3],[6,1,6,3],[7,1,7,3],[8,1,8,3],[10,1,10,3],[9,1,9,3]]}
[]
[]
[null,{"$f":"\"PUNKTSPIELSAISON \"&+'Hilfstabelle Mannschaften'!I8","v":"PUNKTSPIELSAISON 2024/2025"}]
[]
[null,"PANA-Rangliste",null,null,null,"Mannschaft"]
[null,"Mannschaftsübersicht",null,null,null,"Annegret Schmidt",null,null,"Kai Roßberg"]
[null,"Übersicht aller Spiele der Klasse B4",null,null,null,"Ilona Wetzel",null,null,"Deniz Hagelstein"]
[null,"Spielereinteilung",null,null,null,null,null,null,"Frank Nijholt"]
[null,"Spielberichte",null,null,null,"Abschlusstabelle  23-24",null,null,"Jörg Frahm"]
[null,"Anhang zum Spielbericht",null,null,null,"BSG-Schnittliste Saison 23-24",null,null,"Mario Jurk"]
[null,"Spielsystembogen 1. Mannschaft",null,null,null,"\"Alters\"-Übersicht (Nur mal so)",null,null,"Matthias Nolte"]
[null,"Ergebnisse nach BVH",null,null,null,null,null,null,"Michael Wetzel"]
[]
[null,{"$f":"+B3","v":"PUNKTSPIELSAISON 2024/2025"},null,null,null,null,null,"Zuletzt aktualisiert am:"]
[null,"Anmeldegruppen / Turnierplanung",null,null,null,null,null,{"$f":"NOW()","v":"2025-05-13T21:35:45.910"}]
[null,"Turniere und Meisterschaften",null,null,null,null,null,{"$f":"NOW()","v":45790.899836921293}]
[null,"Rangliste PANA-Spieler Saison"]
[]
[null,"BSG-Kürzel 2023/24"]
[]
[null,"Achtung: Neue Berechnung der Schnitteinteilung"]
[null,"für Herbst- und Frühjarsmixed"]

{"sheet":"PANA-Rangliste","index":3,"n_rows":30,"n_cols":18,"rows_kept":30,"cut":false,"hidden":false,"merged":[[20,2,20,10],[21,8,21,9],[22,8,22,9],[23,8,23,9],[24,8,24,9],[21,6,21,7],[22,6,22,7],[23,6,23,7],[24,6,24,7],[11,11,11,17],[15,11,15,17],[3,3,3,8],[1,2,1,16],[3,11,3,17],[7,11,7,17],[9,3,9,8]]}
[]
[null,"Start",{"$f":"+\"Rangliste Saison  \"&+'Hilfstabelle Mannschaften'!I8","v":"Rangliste Saison  2024/2025"}]
[]
[null,null,null,"DAMEN                        NEU",null,null,null,null,null,null,null,"Höchstes Einzel"]
[null,null,"Name","Pass.-Nr.","Pins","Spiele","Schnitt","+/-",{"$f":"\"Ø \"&+'Hilfstabelle Mannschaften'!$I$9","v":"Ø 23/24"},null,"D.",{"$f":"+IF('Hilfstabelle Spieler'!$E$18,'Hilfstabelle Spieler'!$F$18,\"\")","v":"Ilona Wetzel"},{"$f":"+IF('Hilfstabelle Spieler'!$E$18,\":\",\"\")","v":":"},{"$f":"+IF('Hilfstabelle Spieler'!$E$18,'Hilfstabelle Spieler'!$E$18,\"\")","v":202},{"$f":"+IF('Hilfstabelle Spieler'!$E$18,\"Pins\",\"\")","v":"Pins"}]
[null,null,"Ilona Wetzel",{"$f":"VLOOKUP(C6,Rangliste_Mannschaften_Passnummern,2,0)","v":22115},{"$f":"+'Ilona W.'!G8","v":7534},{"$f":"+'Ilona W.'!H8","v":49},{"$f":"+'Ilona W.'!I8","v":153.75510204081633},{"$f":"IF(I6>0,+G6-I6,\"\")","v":10.636054421768705},{"$f":"VLOOKUP(D6,'Anmeldegruppen Turniere'!$F$7:$W$31,2,0)","v":143.11904761904762},null,"H.",{"$f":"+IF('Hilfstabelle Spieler'!E13,'Hilfstabelle Spieler'!F13,\"\")","v":"Kai Roßberg"},{"$f":"+IF('Hilfstabelle Spieler'!$E$13,\":\",\"\")","v":":"},{"$f":"+IF('Hilfstabelle Spieler'!E13,'Hilfstabelle Spieler'!E13,\"\")","v":246},{"$f":"+IF('Hilfstabelle Spieler'!$E$13,\"Pins\",\"\")","v":"Pins"}]
[null,null,"Annegret Schmidt",{"$f":"VLOOKUP(C7,Rangliste_Mannschaften_Passnummern,2,0)","v":19222},{"$f":"+'Annegret S.'!G8","v":8663},{"$f":"+'Annegret S.'!H8","v":63},{"$f":"+'Annegret S.'!I8","v":137.50793650793651},{"$f":"+G7-I7","v":-3.0081925243215721},{"$f":"VLOOKUP(D7,'Anmeldegruppen Turniere'!$F$7:$W$31,2,0)","v":140.51612903225808}]
[null,null,null,null,{"$f":"SUM(E6:E7)","v":16197},{"$f":"SUM(F6:F7)","v":112},{"$f":"IF(E8>1,+E8/F8,\"\")","v":144.61607142857142},null,null,null,null,"Höchste 3.er Serie"]
[null,null,null,null,null,null,null,null,null,null,"D.",{"$f":"+IF('Hilfstabelle Spieler'!G18,'Hilfstabelle Spieler'!H18,\"\")","v":"Ilona Wetzel"},{"$f":"+IF(+'Hilfstabelle Spieler'!$G$18>1,\":\",\"\")","v":":"},{"$f":"+IF('Hilfstabelle Spieler'!G18,'Hilfstabelle Spieler'!G18,\"\")","v":509},{"$f":"+IF(+'Hilfstabelle Spieler'!$G$18>1,\"Pins\",\"\")","v":"Pins"},{"$f":"+IF(+'Hilfstabelle Spieler'!$G$18>1,\"=\",\"\")","v":"="},{"$f":"+IF(+'Hilfstabelle Spieler'!G18>1,'Hilfstabelle Spieler'!G19,\"\")","v":169.66666666666666},{"$f":"+IF(+'Hilfstabelle Spieler'!G18>1,\"Schnitt\",\"\")","v":"Schnitt"}]
[null,null,null,"HERREN                       NEU",null,null,"Schnitt",null,null,null,"H.",{"$f":"+IF('Hilfstabelle Spieler'!G13,'Hilfstabelle Spieler'!H13,\"\")","v":"Mario Jurk"},{"$f":"+IF(+'Hilfstabelle Spieler'!$G$13>1,\":\",\"\")","v":":"},{"$f":"+IF(+'Hilfstabelle Spieler'!G13>1,'Hilfstabelle Spieler'!G13,\"\")","v":628},{"$f":"+IF(+'Hilfstabelle Spieler'!$G$13>1,\"Pins\",\"\")","v":"Pins"},{"$f":"+IF(+'Hilfstabelle Spieler'!$G$13>1,\"=\",\"\")","v":"="},{"$f":"+IF(+'Hilfstabelle Spieler'!G13>1,'Hilfstabelle Spieler'!G14,\"\")","v":209.33333333333334},{"$f":"+IF(+'Hilfstabelle Spieler'!G13>1,\"Schnitt\",\"\")","v":"Schnitt"}]
[null,null,"Name","Pass.-Nr.","Pins","Spiele","Schnitt","+/-",{"$f":"+I5","v":"Ø 23/24"}]
[null,null,"Mario Jurk",{"$f":"VLOOKUP(C12,Rangliste_Mannschaften_Passnummern,2,0)","v":23302},{"$f":"+'Mario J.'!G8","v":3245},{"$f":"+'Mario J.'!H8","v":18},{"$f":"+'Mario J.'!I8","v":180.27777777777777},{"$f":"+G12-I12","v":-5.1388888888888857},{"$f":"VLOOKUP(D12,'Anmeldegruppen Turniere'!$F$7:$G$15,2,0)","v":185.41666666666666},null,null,"Höchste 4.er Serie"]
[null,null,"Kai Roßberg",21889,{"$f":"+'Kai R.'!$G$8","v":6459},{"$f":"+'Kai R.'!$H$8","v":36},{"$f":"+'Kai R.'!$I$8","v":179.41666666666666},-14.416666666666686,{"$f":"VLOOKUP(D13,'Anmeldegruppen Turniere'!$F$7:$G$15,2,0)","v":193.83333333333334},null,"D.",{"$f":"+IF(+'Hilfstabelle Spieler'!$I$18>1,+'Hilfstabelle Spieler'!$J$18,\"\")","v":"Annegret Schmidt"},{"$f":"+IF(+'Hilfstabelle Spieler'!$I$18>1,\":\",\"\")","v":":"},{"$f":"+IF(+'Hilfstabelle Spieler'!$I$18>1,'Hilfstabelle Spieler'!$I$18,\"\")","v":574},{"$f":"+IF(+'Hilfstabelle Spieler'!$I$18>1,\"Pins\",\"\")","v":"Pins"},{"$f":"+IF(+'Hilfstabelle Spieler'!$I$18>1,\"=\",\"\")","v":"="},{"$f":"+IF(+'Hilfstabelle Spieler'!$I$18>1,'Hilfstabelle Spieler'!$I$19,\"\")","v":143.5},{"$f":"+IF(+'Hilfstabelle Spieler'!$I$18>1,\"Schnitt\",\"\")","v":"Schnitt"}]
[null,null,"Michael Wetzel",22113,{"$f":"+'Michael W.'!G8","v":4950},{"$f":"+'Michael W.'!H8","v":28},{"$f":"+'Michael W.'!I8","v":176.78571428571428},2.5044642857142776,{"$f":"VLOOKUP(D14,'Anmeldegruppen Turniere'!$F$7:$G$15,2,0)","v":174.28125},null,"H.",{"$f":"+IF('Hilfstabelle Spieler'!I13,'Hilfstabelle Spieler'!J13,\"\")","v":"Jörg Frahm"},{"$f":"+IF('Hilfstabelle Spieler'!$I$13,\":\",\"\")","v":":"},{"$f":"+IF('Hilfstabelle Spieler'!I13,'Hilfstabelle Spieler'!I13,\"\")","v":742},{"$f":"+IF('Hilfstabelle Spieler'!$I$13,\"Pins\",\"\")","v":"Pins"},{"$f":"+IF('Hilfstabelle Spieler'!$I$13,\"=\",\"\")","v":"="},{"$f":"+IF('Hilfstabelle Spieler'!I13,'Hilfstabelle Spieler'!I14,\"\")","v":185.5},{"$f":"+IF('Hilfstabelle Spieler'!I13,\"Schnitt\",\"\")","v":"Schnitt"}]
[null,null,"Jörg Frahm",19221,{"$f":"+'Jörg F.'!G8","v":5300},{"$f":"+'Jörg F.'!H8","v":31},{"$f":"+'Jörg F.'!I8","v":170.96774193548387},-1.4140762463343037,{"$f":"VLOOKUP(D15,'Anmeldegruppen Turniere'!$F$7:$G$15,2,0)","v":172.38181818181818}]
[null,null,"Frank Nijholt",24774,{"$f":"+'Frank N.'!G8","v":2051},{"$f":"+'Frank N.'!H8","v":15},{"$f":"+'Frank N.'!I8","v":136.73333333333332},0.39999999999997726,{"$f":"VLOOKUP(D16,'Anmeldegruppen Turniere'!$F$7:$G$15,2,0)","v":136.33333333333334},null,null,"Höchste 6.er Serie"]
[null,null,"Deniz Hagelstein",24775,{"$f":"+'Deniz H.'!G8","v":2818},{"$f":"+'Deniz H.'!H8","v":21},{"$f":"+'Deniz H.'!I8","v":134.1904761904762},-5.3809523809523796,{"$f":"VLOOKUP(D17,'Anmeldegruppen Turniere'!$F$7:$G$15,2,0)","v":139.57142857142858},null,"D.",{"$f":"+IF('Hilfstabelle Spieler'!K18,'Hilfstabelle Spieler'!L18,\"\")","v":"Ilona Wetzel"},{"$f":"+IF(+'Hilfstabelle Spieler'!$K$18>1,\":\",\"\")","v":":"},{"$f":"+IF(+'Hilfstabelle Spieler'!K18>1,'Hilfstabelle Spieler'!K18,\"\")","v":1024},{"$f":"+IF(+'Hilfstabelle Spieler'!$K$18>1,\"Pins\",\"\")","v":"Pins"},{"$f":"+IF(+'Hilfstabelle Spieler'!$K$18>1,\"=\",\"\")","v":"="},{"$f":"+IF(+'Hilfstabelle Spieler'!K18>1,'Hilfstabelle Spieler'!K19,\"\")","v":170.66666666666666},{"$f":"+IF(+'Hilfstabelle Spieler'!K18>1,\"Schnitt\",\"\")","v":"Schnitt"}]
[null,null,"Matthias Nolte",20137,{"$f":"+'Matthias N.'!G8","v":2000},{"$f":"+'Matthias N.'!H8","v":15},{"$f":"+'Matthias N.'!I8","v":133.33333333333334},-1.3333333333333144,{"$f":"VLOOKUP(D18,'Anmeldegruppen Turniere'!$F$7:$G$15,2,0)","v":134.66666666666666},null,"H.",{"$f":"+IF('Hilfstabelle Spieler'!K13,'Hilfstabelle Spieler'!L13,\"\")","v":"Michael Wetzel"},{"$f":"+IF(+'Hilfstabelle Spieler'!$K$13>1,\":\",\"\")","v":":"},{"$f":"+IF(+'Hilfstabelle Spieler'!K13>1,'Hilfstabelle Spieler'!K13,\"\")","v":1090},{"$f":"+IF(+'Hilfstabelle Spieler'!$K$13>1,\"Pins\",\"\")","v":"Pins"},{"$f":"+IF(+'Hilfstabelle Spieler'!$K$13>1,\"=\",\"\")","v":"="},{"$f":"+IF(+'Hilfstabelle Spieler'!K13>1,'Hilfstabelle Spieler'!K14,\"\")","v":181.66666666666666},{"$f":"+IF(+'Hilfstabelle Spieler'!K13>1,\"Schnitt\",\"\")","v":"Schnitt"}]
[null,null,null,null,{"$f":"SUM(E12:E18)","v":26823},{"$f":"SUM(F12:F18)","v":164},{"$f":"IF(E19>1,+E19/F19,\"\")","v":163.55487804878049}]
[]
[null,null,"Gesamter PANA-Schnitt"]
[null,null,{"$f":"\"Ø \"&+'Hilfstabelle Mannschaften'!$I$10","v":"Ø 2024/2025"},"Ø Damen:","Ø Herren:","Ø Liga:","Ø Sonstige:",null,"Ø Gesamt:"]
[null,null,"Spiele",{"$f":"+F8","v":112},{"$f":"+F19","v":164},{"$f":"+Mannschaftsübersicht!G13","v":168},{"$f":"+'Hilfstabelle Spieler'!BH11","v":108},null,{"$f":"SUM(E23,D23)","v":276}]
[null,null,"Pins",{"$f":"+E8","v":16197},{"$f":"+E19","v":26823},{"$f":"+Mannschaftsübersicht!E14","v":24763},{"$f":"+'Hilfstabelle Spieler'!BI11","v":16766},null,{"$f":"SUM(E24,D24)","v":43020}]
[null,null,"Schnitt",{"$f":"IF(D24>1,+D24/D23,\" \")","v":144.61607142857142},{"$f":"IF(E24>1,+E24/E23,\" \")","v":163.55487804878049},{"$f":"+F24/F23","v":147.39880952380952},{"$f":"+G24/G23","v":155.24074074074073},null,{"$f":"IF(I24>1,+I24/I23,\" \")","v":155.86956521739131}]
[]
[null,null,{"$f":"\"Ø \"&+'Hilfstabelle Mannschaften'!$I$11","v":"Ø 2023/2024"},"Ø Damen:","Ø Herren:","Ø Gesamt:"]
[null,null,"Spiele",{"$f":"+'Rangliste PANA-Spieler'!S12","v":104},{"$f":"+'Rangliste PANA-Spieler'!S24","v":185},{"$f":"+E28+D28","v":289}]
[null,null,"Pins",{"$f":"+'Rangliste PANA-Spieler'!R12","v":14723},{"$f":"+'Rangliste PANA-Spieler'!R24","v":30970},{"$f":"+E29+D29","v":45693}]
[null,null,"Schnitt",{"$f":"+'Rangliste PANA-Spieler'!T12","v":141.56730769230768},{"$f":"+'Rangliste PANA-Spieler'!T24","v":167.40540540540542},{"$f":"+F29/F28","v":158.10726643598616}]

{"sheet":"Mannschaftsübersicht","index":4,"n_rows":17,"n_cols":8,"rows_kept":17,"cut":false,"hidden":false,"merged":[[3,2,3,7],[5,2,5,7]]}
[]
[null,"Start"]
[null,"Rangliste"]
[null,null,"Übersicht"]
[]
[null,null,{"$f":"\"1. Mannschaft, \"&+'Hilfstabelle Mannschaften'!I3&\" \"&+'Hilfstabelle Mannschaften'!I4","v":"1. Mannschaft, Klasse B4"}]
[null,null,"Platz","Mannschaft","Pins","Pkt.","Spiele","Schnitt"]
[null,null,"1.",{"$f":"+'Hilfstabelle Mannschaften'!L10","v":"Körber Sports 2"},{"$f":"VLOOKUP(D8,'Hilfstabelle Mannschaften'!$L$4:$M$11,2,0)","v":25432},{"$f":"VLOOKUP(D8,'Übersicht der Klasse B4'!$D$8:$E$27,2,0)","v":72},{"$f":"VLOOKUP(D8,'Hilfstabelle Mannschaften'!$L$34:$M$45,2,0)","v":168},{"$f":"IF(F8>=1,+E8/G8,\"\")","v":151.38095238095238}]
[null,null,"2.",{"$f":"+'Hilfstabelle Mannschaften'!L4","v":"Panasonic 1"},{"$f":"VLOOKUP(D9,'Hilfstabelle Mannschaften'!$L$4:$M$11,2,0)","v":26254},{"$f":"VLOOKUP(D9,'Übersicht der Klasse B4'!$D$8:$E$27,2,0)","v":68},{"$f":"VLOOKUP(D9,'Hilfstabelle Mannschaften'!$L$34:$M$45,2,0)","v":168},156.27380952380952]
[null,null,"3.",{"$f":"+'Hilfstabelle Mannschaften'!L5","v":"Dataport 2"},{"$f":"VLOOKUP(D10,'Hilfstabelle Mannschaften'!$L$4:$M$11,2,0)","v":25261},{"$f":"VLOOKUP(D10,'Übersicht der Klasse B4'!$D$8:$E$27,2,0)","v":58},{"$f":"VLOOKUP(D10,'Hilfstabelle Mannschaften'!$L$34:$M$45,2,0)","v":168},150.36309523809524]
[null,null,"4.",{"$f":"+'Hilfstabelle Mannschaften'!L7","v":"SG Stern Hamburg 1"},{"$f":"VLOOKUP(D11,'Hilfstabelle Mannschaften'!$L$4:$M$11,2,0)","v":24600},{"$f":"VLOOKUP(D11,'Übersicht der Klasse B4'!$D$8:$E$27,2,0)","v":50},{"$f":"VLOOKUP(D11,'Hilfstabelle Mannschaften'!$L$34:$M$45,2,0)","v":168},146.42857142857142]
[null,null,"5.",{"$f":"+'Hilfstabelle Mannschaften'!L6","v":"Still 3"},{"$f":"VLOOKUP(D12,'Hilfstabelle Mannschaften'!$L$4:$M$11,2,0)","v":24708},{"$f":"VLOOKUP(D12,'Übersicht der Klasse B4'!$D$8:$E$27,2,0)","v":49},{"$f":"VLOOKUP(D12,'Hilfstabelle Mannschaften'!$L$34:$M$45,2,0)","v":168},147.07142857142858]
[null,null,"6.",{"$f":"+'Hilfstabelle Mannschaften'!L8","v":"Justitzbehörde 2"},{"$f":"VLOOKUP(D13,'Hilfstabelle Mannschaften'!$L$4:$M$11,2,0)","v":24257},{"$f":"VLOOKUP(D13,'Übersicht der Klasse B4'!$D$8:$E$27,2,0)","v":49},{"$f":"VLOOKUP(D13,'Hilfstabelle Mannschaften'!$L$34:$M$45,2,0)","v":168},144.38690476190476]
[null,null,"7.",{"$f":"+'Hilfstabelle Mannschaften'!L9","v":"Postamt 2"},{"$f":"VLOOKUP(D14,'Hilfstabelle Mannschaften'!$L$4:$M$11,2,0)","v":24763},{"$f":"VLOOKUP(D14,'Übersicht der Klasse B4'!$D$8:$E$27,2,0)","v":46},{"$f":"VLOOKUP(D14,'Hilfstabelle Mannschaften'!$L$34:$M$45,2,0)","v":168},147.39880952380952]
[null,null,"8.",{"$f":"+'Hilfstabelle Mannschaften'!L11","v":"Panasonic 1"},{"$f":"VLOOKUP(D15,'Hilfstabelle Mannschaften'!$L$4:$M$11,2,0)","v":26254},{"$f":"VLOOKUP(D15,'Übersicht der Klasse B4'!$D$8:$E$27,2,0)","v":68},{"$f":"VLOOKUP(D15,'Hilfstabelle Mannschaften'!$L$34:$M$45,2,0)","v":168},156.27380952380952]
[null,null,"9.",{"$f":"+'Hilfstabelle Mannschaften'!L12","v":"Dataport 2"},{"$f":"VLOOKUP(D16,'Hilfstabelle Mannschaften'!$L$4:$M$15,2,0)","v":25261},{"$f":"VLOOKUP(D16,'Übersicht der Klasse B4'!$D$8:$E$27,2,0)","v":58},{"$f":"VLOOKUP(D16,'Hilfstabelle Mannschaften'!$L$34:$M$45,2,0)","v":168},150.36309523809524]
[null,null,"10.",{"$f":"+'Hilfstabelle Mannschaften'!L13","v":"Still 3"},{"$f":"VLOOKUP(D17,'Hilfstabelle Mannschaften'!$L$4:$M$15,2,0)","v":24708},{"$f":"VLOOKUP(D17,'Übersicht der Klasse B4'!$D$8:$E$27,2,0)","v":49},{"$f":"VLOOKUP(D17,'Hilfstabelle Mannschaften'!$L$34:$M$45,2,0)","v":168},147.07142857142858]

{"sheet":"Spielbogen 10er","index":5,"n_rows":49,"n_cols":26,"rows_kept":49,"cut":false,"hidden":true,"merged":[[3,11,3,12],[14,3,14,5],[15,3,15,5],[0,2,0,12],[1,2,1,6],[1,8,1,12],[8,3,8,5],[9,3,9,5],[10,16,10,18],[10,3,10,5],[11,3,11,5],[13,16,13,18],[13,3,13,5],[15,16,15,18],[16,3,16,5],[12,3,12,5],[17,3,17,5],[19,16,19,18]]}
["Start",null," Betriebssportverband Hamburg e.V."]
["Rangliste",null,"-  Sparte Bowling  -",null,null,null,null,null,"-  Spielsystembogen  -"]
[]
[null,null,"Klasse       ",null,null,{"$f":"+'Hilfstabelle Mannschaften'!I4","v":"B4"},null,null,"Antritt","Bahn","Datum","    Ausrichter"]
[null,null,null,null,null,null,null,null,"1.","???","???",1,"???"]
[null,null,null,null,null,null,null,null,"2.","???","???",2,"???"]
[null,null,null,null,null,null," ",null,"3.","???","???",3,"???"]
[null,null,null,"BSG",null,null,"Kurzf.",null,"4.","???","???",4,"???"]
[null,null,1,"???",null,null,{"$f":"+M5","v":"???"},null,"5.","???","???",5,"???"]
[null,null,2,"???",null,null,{"$f":"+M6","v":"???"},null,"6.","???","???",6,"???"]
[null,null,3,"???",null,null,"???",null,"7.","???","???",7,"???"]
[null,null,4,"???",null,null,"???",null,"8.","???","???",8,"???"]
[null,null,5,"???",null,null,"???",null,"9.","???","???",9,"???"]
[null,null,6,"???",null,null,"???",null,"10.","???","???",10,"???"]
[null,null,7,"???",null,null,"???",null,"11.","???","???",1,"???"]
[null,null,8,"???",null,null,"???",null,"12.","???","???",2,"???"]
[null,null,9,"???",null,null,"???",null,"13.","???","???",3,"???"]
[null,null,10,"???",null,null,"???",null,"14.","???","???",4,"???"]
[null,null,null,null,null,null,null,null," "]
[null,null,"Antritt"]
[null,null,"Halle"]
[null,null,"1 . A.",1,6,8,3,7,10,9,4,5,2,null,null,"1 . A.",{"$f":"+D23","v":"???"},{"$f":"+E23","v":"???"},"???","???","???","???","???","???","???","???"]
[null,null,{"$f":"+J5","v":"???"},{"$f":"VLOOKUP(D22,$C$7:$G$18,5,0)","v":"???"},"???","???","???","???","???","???","???","???","???",null,null,{"$f":"+C23","v":"???"},1,2,3,4,5,6,7,8,9,10]
[null,null,"2 . A.",5,8,10,1,9,2,4,7,3,6,null,null,"2 . A.",{"$f":"+D25","v":"???"},{"$f":"+E25","v":"???"},"???","???","???","???","???","???","???","???"]
[null,null,{"$f":"+J6","v":"???"},{"$f":"VLOOKUP(D24,$C$7:$G$18,5,0)","v":"???"},"???","???","???","???","???","???","???","???","???",null,null,{"$f":"+C25","v":"???"},1,2,3,4,5,6,7,8,9,10]
[null,null,"3 . A.",3,1,7,5,10,8,6,9,2,4,null,null,"3 . A.",{"$f":"+D27","v":"???"},{"$f":"+E27","v":"???"},"???","???","???","???","???","???","???","???"]
[null,null,{"$f":"+J7","v":"???"},{"$f":"VLOOKUP(D26,$C$7:$G$18,5,0)","v":"???"},"???","???","???","???","???","???","???","???","???",null,null,{"$f":"+C27","v":"???"},1,2,3,4,5,6,7,8,9,10]
[null,null,"4 . A.",2,7,5,9,8,1,4,6,10,3,null,null,"4 . A.",{"$f":"+D29","v":"???"},{"$f":"+E29","v":"???"},"???","???","???","???","???","???","???","???"]
[null,null,{"$f":"+J8","v":"???"},{"$f":"VLOOKUP(D28,$C$7:$G$18,5,0)","v":"???"},"???","???","???","???","???","???","???","???","???",null,null,{"$f":"+C29","v":"???"},1,2,3,4,5,6,7,8,9,10]
[null,null,"5 . A.",8,4,10,2,1,9,5,3,6,7,null,null,"5 . A.",{"$f":"+D31","v":"???"},{"$f":"+E31","v":"???"},"???","???","???","???","???","???","???","???"]
[null,null,{"$f":"+J9","v":"???"},{"$f":"VLOOKUP(D30,$C$7:$G$18,5,0)","v":"???"},"???","???","???","???","???","???","???","???","???",null,null,{"$f":"+C31","v":"???"},1,2,3,4,5,6,7,8,9,10]
[null,null,"6 . A.",6,2,4,10,3,7,1,5,8,9,null,null,"6 . A.",{"$f":"+D33","v":"???"},{"$f":"+E33","v":"???"},"???","???","???","???","???","???","???","???"]
[null,null,{"$f":"+J10","v":"???"},{"$f":"VLOOKUP(D32,$C$7:$G$18,5,0)","v":"???"},"???","???","???","???","???","???","???","???","???",null,null,{"$f":"+C33","v":"???"},1,2,3,4,5,6,7,8,9,10]
[null,null,"7 . A.",7,9,6,8,10,5,3,2,4,1,null,null,"7 . A.",{"$f":"+D35","v":"???"},{"$f":"+E35","v":"???"},"???","???","???","???","???","???","???","???"]
[null,null,{"$f":"+J11","v":"???"},{"$f":"VLOOKUP(D34,$C$7:$G$18,5,0)","v":"???"},"???","???","???","???","???","???","???","???","???",null,null,{"$f":"+C35","v":"???"},1,2,3,4,5,6,7,8,9,10]
[null,null,"8 . A.",4,5,1,7,2,8,10,6,9,3,null,null,"8 . A.",{"$f":"+D37","v":"???"},{"$f":"+E37","v":"???"},"???","???","???","???","???","???","???","???"]
[null,null,{"$f":"+J12","v":"???"},{"$f":"VLOOKUP(D36,$C$7:$G$18,5,0)","v":"???"},"???","???","???","???","???","???","???","???","???",null,null,{"$f":"+C37","v":"???"},1,2,3,4,5,6,7,8,9,10]
[null,null,"9 . A.",9,10,3,4,5,6,2,1,7,8,null,null,"9 . A.",{"$f":"+D39","v":"???"},{"$f":"+E39","v":"???"},"???","???","???","???","???","???","???","???"]
[null,null,{"$f":"+J13","v":"???"},{"$f":"VLOOKUP(D38,$C$7:$G$18,5,0)","v":"???"},"???","???","???","???","???","???","???","???","???",null,null,{"$f":"+C39","v":"???"},1,2,3,4,5,6,7,8,9,10]
[null,null,"10 . A.",3,7,2,6,9,4,8,10,1,5,null,null,"10 . A.",{"$f":"+D41","v":"???"},{"$f":"+E41","v":"???"},"???","???","???","???","???","???","???","???"]
[null,null,{"$f":"+J14","v":"???"},{"$f":"VLOOKUP(D40,$C$7:$G$18,5,0)","v":"???"},"???","???","???","???","???","???","???","???","???",null,null,{"$f":"+C41","v":"???"},1,2,3,4,5,6,7,8,9,10]
[null,null,"11 . A.",4,8,9,5,6,3,7,1,2,10,null,null,"11 . A.",{"$f":"+D43","v":"???"},{"$f":"+E43","v":"???"},"???","???","???","???","???","???","???","???"]
[null,null,{"$f":"+J15","v":"???"},{"$f":"VLOOKUP(D42,$C$7:$G$18,5,0)","v":"???"},"???","???","???","???","???","???","???","???","???",null,null,{"$f":"+C43","v":"???"},1,2,3,4,5,6,7,8,9,10]
[null,null,"12 . A.",10,3,1,2,4,6,5,8,9,7,null,null,"12 . A.",{"$f":"+D45","v":"???"},{"$f":"+E45","v":"???"},"???","???","???","???","???","???","???","???"]
[null,null,{"$f":"+J16","v":"???"},{"$f":"VLOOKUP(D44,$C$7:$G$18,5,0)","v":"???"},"???","???","???","???","???","???","???","???","???",null,null,{"$f":"+C45","v":"???"},1,2,3,4,5,6,7,8,9,10]
[null,null,"13 . A.",2,5,4,7,3,1,10,9,8,6,null,null,"13 . A.",{"$f":"+D47","v":"???"},{"$f":"+E47","v":"???"},"???","???","???","???","???","???","???","???"]
[null,null,{"$f":"+J17","v":"???"},{"$f":"VLOOKUP(D46,$C$7:$G$18,5,0)","v":"???"},"???","???","???","???","???","???","???","???","???",null,null,{"$f":"+C47","v":"???"},1,2,3,4,5,6,7,8,9,10]
[null,null,"14 . A.","7.","8.","3.","4.","1.","2.","5.","6.","9.","10.",null,null,{"$f":"+C48","v":"14 . A."},{"$f":"+D49","v":0},{"$f":"+E49","v":0},0,0,0,0,0,0,0,0]
[null,null,{"$f":"+J18","v":"???"},null,null,null,null,null,null,null,null,null,null,null,null,{"$f":"+C49","v":"???"},1,2,3,4,5,6,7,8,9,10]

{"sheet":"Übersicht der Klasse B4","index":6,"n_rows":31,"n_cols":21,"rows_kept":31,"cut":false,"hidden":false,"merged":[[13,4,14,4],[11,4,12,4],[9,4,10,4],[7,4,8,4],[25,1,26,1],[17,1,18,1],[19,1,20,1],[21,1,22,1],[23,3,24,3],[21,3,22,3],[19,3,20,3],[17,3,18,3],[7,1,8,1],[9,1,10,1],[11,1,12,1],[13,1,14,1],[32,6,32,14],[15,1,16,1],[23,1,24,1],[1,6,1,20],[15,3,16,3],[13,3,14,3],[11,3,12,3],[9,3,10,3],[7,3,8,3],[5,3,6,3],[5,6,6,6],[5,5,6,5],[5,4,6,4],[15,5,16,5],[13,5,14,5],[11,5,12,5],[27,3,28,3],[29,3,30,3],[25,3,26,3],[7,5,8,5],[15,4,16,4],[25,4,26,4],[25,5,26,5],[9,5,10,5],[23,5,24,5],[21,5,22,5],[19,5,20,5],[17,5,18,5],[23,4,24,4],[21,4,22,4],[19,4,20,4],[17,4,18,4]]}
[]
[null,"Start",null,null,null,null,{"$f":"\"Übersicht aller Spiele der Klasse \"&+'Hilfstabelle Mannschaften'!I4&\" der 1. Mannschaft in der Saison \"&+'Hilfstabelle Mannschaften'!I8","v":"Übersicht aller Spiele der Klasse B4 der 1. Mannschaft in der Saison 2024/2025"}]
[null,"Rangliste"]
[null,null,null,null,null,null,"Datum","2024-09-12","2024-09-16","2024-10-10","2024-10-24","2024-11-07","2025-01-16","2025-01-30","2025-02-13","2025-02-27","2025-03-13","2025-03-27","2025-04-10","2025-04-24","2025-05-08"]
[null,null,null,null,null,null,"Bahn","OT","OT","WB","OT","WB","WB","OT","WB","OT","WB","OT","WB","OT","WB"]
[null,null,null,"Mannschaften","Punkte","Pins",null,"Antritt","Antritt","Antritt","Antritt","Antritt","Antritt","Antritt","Antritt","Antritt","Antritt","Antritt","Antritt","Antritt","Antritt"]
[null,"Kurzf.",null,null,null,null,null,1,{"$f":"+H7+1","v":2},3,4,5,6,7,8,9,10,11,12,13,14]
[null,{"$f":"+'Spielbogen 7er'!I10","v":"PAN 1"},null,{"$f":"+'Spielbogen 7er'!D10","v":"Panasonic 1"},{"$f":"SUM(H9:U9)","v":68},{"$f":"SUM(H8:U8)","v":26254},"Pins",{"$f":"VLOOKUP(B8,'Hilfstabelle Mannschaften'!$AE$53:$AF$62,2,0)","v":1914},{"$f":"VLOOKUP(B8,'Hilfstabelle Mannschaften'!$AE$53:$AG$62,3,0)","v":1912},{"$f":"VLOOKUP(B8,'Hilfstabelle Mannschaften'!$AE$53:$AH$62,4,0)","v":1975},{"$f":"VLOOKUP(B8,'Hilfstabelle Mannschaften'!$AE$53:$AJ$62,5,0)","v":1777},{"$f":"VLOOKUP(B8,'Hilfstabelle Mannschaften'!$AE$53:$AJ$62,6,0)","v":1907},{"$f":"VLOOKUP(B8,'Hilfstabelle Mannschaften'!$AE$53:$AK$62,7,0)","v":1880},{"$f":"VLOOKUP(B8,'Hilfstabelle Mannschaften'!$AE$53:$AL$62,8,0)","v":1686},{"$f":"VLOOKUP(B8,'Hilfstabelle Mannschaften'!$AE$53:$AM$62,9,0)","v":1817},{"$f":"VLOOKUP(B8,'Hilfstabelle Mannschaften'!$AE$53:$AN$62,10,0)","v":1832},{"$f":"VLOOKUP(B8,'Hilfstabelle Mannschaften'!$AE$53:$AO$62,11,0)","v":2017},{"$f":"VLOOKUP(B8,'Hilfstabelle Mannschaften'!$AE$53:$AP$62,12,0)","v":1867},{"$f":"VLOOKUP(B8,'Hilfstabelle Mannschaften'!$AE$53:$AQ$62,13,0)","v":1845},{"$f":"VLOOKUP(B8,'Hilfstabelle Mannschaften'!$AE$53:$AR$62,14,0)","v":1900},{"$f":"VLOOKUP(B8,'Hilfstabelle Mannschaften'!$AE$53:$AS$62,15,0)","v":1925}]
[null,null,null,null,null,null,"Punkte",{"$f":"IF(H8<1,\"\",'Hilfstabelle Mannschaften'!Q24)","v":7},{"$f":"IF(I8<1,\"\",+'Hilfstabelle Mannschaften'!$Q29)","v":7},{"$f":"IF(J8<1,\"\",+'Hilfstabelle Mannschaften'!$Q34)","v":7},{"$f":"IF(K8<1,\"\",+'Hilfstabelle Mannschaften'!$Q39)","v":5},{"$f":"IF(L8<1,\"\",+'Hilfstabelle Mannschaften'!$Q44)","v":6},{"$f":"IF(M8<1,\"\",+'Hilfstabelle Mannschaften'!$Q49)","v":4},{"$f":"IF(N8<1,\"\",+'Hilfstabelle Mannschaften'!$Q54)","v":1},{"$f":"IF(O8<1,\"\",+'Hilfstabelle Mannschaften'!$Q59)","v":2},{"$f":"IF(P8<1,\"\",+'Hilfstabelle Mannschaften'!$Q64)","v":5},{"$f":"IF(Q8<1,\"\",+'Hilfstabelle Mannschaften'!$Q69)","v":7},{"$f":"IF(R8<1,\"\",+'Hilfstabelle Mannschaften'!$Q74)","v":4},{"$f":"IF(S8<1,\"\",+'Hilfstabelle Mannschaften'!$Q79)","v":3},{"$f":"IF(T8<1,\"\",+'Hilfstabelle Mannschaften'!$Q84)","v":5},{"$f":"IF(U8<1,\"\",'Hilfstabelle Mannschaften'!Q89)","v":5}]
[null,{"$f":"+'Spielbogen 7er'!I11","v":"DAT 2"},null,{"$f":"+'Spielbogen 7er'!D11","v":"Dataport 2"},{"$f":"SUM(H11:U11)","v":58},{"$f":"SUM(H10:U10)","v":25261},"Pins",{"$f":"VLOOKUP(B10,'Hilfstabelle Mannschaften'!$AE$53:$AF$62,2,0)","v":1586},{"$f":"VLOOKUP(B10,'Hilfstabelle Mannschaften'!$AE$53:$AG$62,3,0)","v":1748},{"$f":"VLOOKUP(B10,'Hilfstabelle Mannschaften'!$AE$53:$AH$62,4,0)","v":1606},{"$f":"VLOOKUP(B10,'Hilfstabelle Mannschaften'!$AE$53:$AJ$62,5,0)","v":1733},{"$f":"VLOOKUP(B10,'Hilfstabelle Mannschaften'!$AE$53:$AJ$62,6,0)","v":1849},{"$f":"VLOOKUP(B10,'Hilfstabelle Mannschaften'!$AE$53:$AK$62,7,0)","v":1968},{"$f":"VLOOKUP(B10,'Hilfstabelle Mannschaften'!$AE$53:$AL$62,8,0)","v":1822},{"$f":"VLOOKUP(B10,'Hilfstabelle Mannschaften'!$AE$53:$AM$62,9,0)","v":1940},{"$f":"VLOOKUP(B10,'Hilfstabelle Mannschaften'!$AE$53:$AN$62,10,0)","v":1762},{"$f":"VLOOKUP(B10,'Hilfstabelle Mannschaften'!$AE$53:$AO$62,11,0)","v":1842},{"$f":"VLOOKUP(B10,'Hilfstabelle Mannschaften'!$AE$53:$AP$62,12,0)","v":1952},{"$f":"VLOOKUP(B10,'Hilfstabelle Mannschaften'!$AE$53:$AQ$62,13,0)","v":1888},{"$f":"VLOOKUP(B10,'Hilfstabelle Mannschaften'!$AE$53:$AR$62,14,0)","v":1733},{"$f":"VLOOKUP(B10,'Hilfstabelle Mannschaften'!$AE$53:$AS$62,15,0)","v":1832}]
[null,null,null,null,null,null,"Punkte",{"$f":"IF(H10<1,\"\",+'Hilfstabelle Mannschaften'!$R24)","v":4},{"$f":"IF(I10<1,\"\",+'Hilfstabelle Mannschaften'!$R29)","v":5},{"$f":"IF(J10<1,\"\",+'Hilfstabelle Mannschaften'!$R34)","v":2},{"$f":"IF(K10<1,\"\",+'Hilfstabelle Mannschaften'!$R39)","v":3},{"$f":"IF(L10<1,\"\",+'Hilfstabelle Mannschaften'!$R44)","v":4},{"$f":"IF(M10<1,\"\",+'Hilfstabelle Mannschaften'!$R49)","v":6},{"$f":"IF(N10<1,\"\",+'Hilfstabelle Mannschaften'!$R54)","v":6},{"$f":"IF(O10<1,\"\",+'Hilfstabelle Mannschaften'!$R59)","v":5},{"$f":"IF(P10<1,\"\",+'Hilfstabelle Mannschaften'!$R64)","v":4},{"$f":"IF(Q10<1,\"\",+'Hilfstabelle Mannschaften'!$R69)","v":5},{"$f":"IF(R10<1,\"\",+'Hilfstabelle Mannschaften'!$R74)","v":5},{"$f":"IF(S10<1,\"\",+'Hilfstabelle Mannschaften'!$R79)","v":4},{"$f":"IF(T10<1,\"\",+'Hilfstabelle Mannschaften'!$R84)","v":2},{"$f":"IF(U10<1,\"\",'Hilfstabelle Mannschaften'!R89)","v":3}]
[null,{"$f":"+'Spielbogen 7er'!I12","v":"STI 3"},null,{"$f":"+'Spielbogen 7er'!D12","v":"Still 3"},{"$f":"SUM(H13:U13)","v":49},24708,"Pins",{"$f":"VLOOKUP(B12,'Hilfstabelle Mannschaften'!$AE$53:$AF$62,2,0)","v":1732},{"$f":"VLOOKUP(B12,'Hilfstabelle Mannschaften'!$AE$53:$AG$62,3,0)","v":1572},{"$f":"VLOOKUP(B12,'Hilfstabelle Mannschaften'!$AE$53:$AH$62,4,0)","v":1805},{"$f":"VLOOKUP(B12,'Hilfstabelle Mannschaften'!$AE$53:$AJ$62,5,0)","v":1788},{"$f":"VLOOKUP(B12,'Hilfstabelle Mannschaften'!$AE$53:$AJ$62,6,0)","v":1806},{"$f":"VLOOKUP(B12,'Hilfstabelle Mannschaften'!$AE$53:$AK$62,7,0)","v":1853},{"$f":"VLOOKUP(B12,'Hilfstabelle Mannschaften'!$AE$53:$AL$62,8,0)","v":1724},{"$f":"VLOOKUP(B12,'Hilfstabelle Mannschaften'!$AE$53:$AM$62,9,0)","v":1778},{"$f":"VLOOKUP(B12,'Hilfstabelle Mannschaften'!$AE$53:$AN$62,10,0)","v":1835},{"$f":"VLOOKUP(B12,'Hilfstabelle Mannschaften'!$AE$53:$AO$62,11,0)","v":1718},{"$f":"VLOOKUP(B12,'Hilfstabelle Mannschaften'!$AE$53:$AP$62,12,0)","v":1639},{"$f":"VLOOKUP(B12,'Hilfstabelle Mannschaften'!$AE$53:$AQ$62,13,0)","v":1899},{"$f":"VLOOKUP(B12,'Hilfstabelle Mannschaften'!$AE$53:$AR$62,14,0)","v":1906},{"$f":"VLOOKUP(B12,'Hilfstabelle Mannschaften'!$AE$53:$AS$62,15,0)","v":1653}]
[null,null,null,null,null,null,"Punkte",{"$f":"IF(H12<1,\"\",'Hilfstabelle Mannschaften'!$S24)","v":5},{"$f":"IF(I12<1,\"\",'Hilfstabelle Mannschaften'!$S29)","v":2},{"$f":"IF(J12<1,\"\",'Hilfstabelle Mannschaften'!$S34)","v":5},{"$f":"IF(K12<1,\"\",'Hilfstabelle Mannschaften'!$S39)","v":6},{"$f":"IF(L12<1,\"\",'Hilfstabelle Mannschaften'!$S44)","v":2},{"$f":"IF(M12<1,\"\",'Hilfstabelle Mannschaften'!$S49)","v":3},{"$f":"IF(N12<1,\"\",'Hilfstabelle Mannschaften'!$S54)","v":2},{"$f":"IF(O12<1,\"\",'Hilfstabelle Mannschaften'!$S59)","v":1},{"$f":"IF(P12<1,\"\",'Hilfstabelle Mannschaften'!$S64)","v":6},{"$f":"IF(Q12<1,\"\",'Hilfstabelle Mannschaften'!$S69)","v":3},{"$f":"IF(R12<1,\"\",'Hilfstabelle Mannschaften'!$S74)","v":2},{"$f":"IF(S12<1,\"\",'Hilfstabelle Mannschaften'!$S79)","v":5},{"$f":"IF(T12<1,\"\",'Hilfstabelle Mannschaften'!$S84)","v":6},{"$f":"IF(U12<1,\"\",'Hilfstabelle Mannschaften'!S89)","v":1}]
[null,{"$f":"+'Spielbogen 7er'!I13","v":"SGS 1"},null,{"$f":"+'Spielbogen 7er'!D13","v":"SG Stern Hamburg 1"},{"$f":"SUM(H15:U15)","v":50},{"$f":"SUM(H14:U14)","v":24600},"Pins",{"$f":"VLOOKUP(B14,'Hilfstabelle Mannschaften'!$AE$53:$AF$62,2,0)","v":1528},{"$f":"VLOOKUP(B14,'Hilfstabelle Mannschaften'!$AE$53:$AG$62,3,0)","v":1637},{"$f":"VLOOKUP(B14,'Hilfstabelle Mannschaften'!$AE$53:$AH$62,4,0)","v":1502},{"$f":"VLOOKUP(B14,'Hilfstabelle Mannschaften'!$AE$53:$AJ$62,5,0)","v":1714},{"$f":"VLOOKUP(B14,'Hilfstabelle Mannschaften'!$AE$53:$AJ$62,6,0)","v":1897},{"$f":"VLOOKUP(B14,'Hilfstabelle Mannschaften'!$AE$53:$AK$62,7,0)","v":2011},{"$f":"VLOOKUP(B14,'Hilfstabelle Mannschaften'!$AE$53:$AL$62,8,0)","v":1830},{"$f":"VLOOKUP(B14,'Hilfstabelle Mannschaften'!$AE$53:$AM$62,9,0)","v":1822},{"$f":"VLOOKUP(B14,'Hilfstabelle Mannschaften'!$AE$53:$AN$62,10,0)","v":1661},{"$f":"VLOOKUP(B14,'Hilfstabelle Mannschaften'!$AE$53:$AO$62,11,0)","v":1706},{"$f":"VLOOKUP(B14,'Hilfstabelle Mannschaften'!$AE$53:$AP$62,12,0)","v":1953},{"$f":"VLOOKUP(B14,'Hilfstabelle Mannschaften'!$AE$53:$AQ$62,13,0)","v":1984},{"$f":"VLOOKUP(B14,'Hilfstabelle Mannschaften'!$AE$53:$AR$62,14,0)","v":1542},{"$f":"VLOOKUP(B14,'Hilfstabelle Mannschaften'!$AE$53:$AS$62,15,0)","v":1813}]
[null,null,null,null,null,null,"Punkte",{"$f":"IF(H14<1,\"\",'Hilfstabelle Mannschaften'!$T24)","v":3},{"$f":"IF(I14<1,\"\",'Hilfstabelle Mannschaften'!$T29)","v":3},{"$f":"IF(J14<1,\"\",'Hilfstabelle Mannschaften'!$T34)","v":1},{"$f":"IF(K14<1,\"\",'Hilfstabelle Mannschaften'!$T39)","v":2},{"$f":"IF(L14<1,\"\",'Hilfstabelle Mannschaften'!$T44)","v":5},{"$f":"IF(M14<1,\"\",'Hilfstabelle Mannschaften'!$T49)","v":7},{"$f":"IF(N14<1,\"\",'Hilfstabelle Mannschaften'!$T54)","v":7},{"$f":"IF(O14<1,\"\",'Hilfstabelle Mannschaften'!$T59)","v":3},{"$f":"IF(P14<1,\"\",'Hilfstabelle Mannschaften'!$T64)","v":2},{"$f":"IF(Q14<1,\"\",'Hilfstabelle Mannschaften'!$T69)","v":2},{"$f":"IF(R14<1,\"\",'Hilfstabelle Mannschaften'!$T74)","v":6},{"$f":"IF(S14<1,\"\",'Hilfstabelle Mannschaften'!$T79)","v":6},{"$f":"IF(T14<1,\"\",'Hilfstabelle Mannschaften'!$T84)","v":1},{"$f":"IF(U14<1,\"\",'Hilfstabelle Mannschaften'!T89)","v":2}]
[null,{"$f":"+'Spielbogen 7er'!I14","v":"JUS 2"},null,{"$f":"+'Spielbogen 7er'!D14","v":"Justitzbehörde 2"},{"$f":"SUM(H17:U17)","v":49},24257,"Pins",{"$f":"VLOOKUP(B16,'Hilfstabelle Mannschaften'!$AE$53:$AF$62,2,0)","v":1349},{"$f":"VLOOKUP(B16,'Hilfstabelle Mannschaften'!$AE$53:$AG$62,3,0)","v":1664},{"$f":"VLOOKUP(B16,'Hilfstabelle Mannschaften'!$AE$53:$AH$62,4,0)","v":1609},{"$f":"VLOOKUP(B16,'Hilfstabelle Mannschaften'!$AE$53:$AJ$62,5,0)","v":1734},{"$f":"VLOOKUP(B16,'Hilfstabelle Mannschaften'!$AE$53:$AJ$62,6,0)","v":1811},{"$f":"VLOOKUP(B16,'Hilfstabelle Mannschaften'!$AE$53:$AK$62,7,0)","v":1961},{"$f":"VLOOKUP(B16,'Hilfstabelle Mannschaften'!$AE$53:$AL$62,8,0)","v":1754},{"$f":"VLOOKUP(B16,'Hilfstabelle Mannschaften'!$AE$53:$AM$62,9,0)","v":1958},{"$f":"VLOOKUP(B16,'Hilfstabelle Mannschaften'!$AE$53:$AN$62,10,0)","v":1555},{"$f":"VLOOKUP(B16,'Hilfstabelle Mannschaften'!$AE$53:$AO$62,11,0)","v":1756},{"$f":"VLOOKUP(B16,'Hilfstabelle Mannschaften'!$AE$53:$AP$62,12,0)","v":1418},{"$f":"VLOOKUP(B16,'Hilfstabelle Mannschaften'!$AE$53:$AQ$62,13,0)","v":1802},{"$f":"VLOOKUP(B16,'Hilfstabelle Mannschaften'!$AE$53:$AR$62,14,0)","v":1841},{"$f":"VLOOKUP(B16,'Hilfstabelle Mannschaften'!$AE$53:$AS$62,15,0)","v":2045}]
[null,null,null,null,null,null,"Punkte",{"$f":"IF(H16<1,\"\",'Hilfstabelle Mannschaften'!$U24)","v":2},{"$f":"IF(I16<1,\"\",'Hilfstabelle Mannschaften'!$U29)","v":4},{"$f":"IF(J16<1,\"\",'Hilfstabelle Mannschaften'!$U34)","v":3},{"$f":"IF(K16<1,\"\",'Hilfstabelle Mannschaften'!$U39)","v":4},{"$f":"IF(L16<1,\"\",'Hilfstabelle Mannschaften'!$U44)","v":3},{"$f":"IF(M16<1,\"\",'Hilfstabelle Mannschaften'!$U49)","v":5},{"$f":"IF(N16<1,\"\",'Hilfstabelle Mannschaften'!$U54)","v":4},{"$f":"IF(O16<1,\"\",'Hilfstabelle Mannschaften'!$U59)","v":6},{"$f":"IF(P16<1,\"\",'Hilfstabelle Mannschaften'!$U64)","v":1},{"$f":"IF(Q16<1,\"\",'Hilfstabelle Mannschaften'!$U69)","v":4},{"$f":"IF(R16<1,\"\",'Hilfstabelle Mannschaften'!$U74)","v":1},{"$f":"IF(S16<1,\"\",'Hilfstabelle Mannschaften'!$U79)","v":2},{"$f":"IF(T16<1,\"\",'Hilfstabelle Mannschaften'!$U84)","v":4},{"$f":"IF(U16<1,\"\",'Hilfstabelle Mannschaften'!U89)","v":6}]
[null,{"$f":"+'Spielbogen 7er'!I15","v":"P2 2"},null,{"$f":"+'Spielbogen 7er'!D15","v":"Postamt 2"},{"$f":"SUM(H19:U19)","v":46},24763,"Pins",{"$f":"VLOOKUP(B18,'Hilfstabelle Mannschaften'!$AE$53:$AF$62,2,0)","v":1740},{"$f":"VLOOKUP(B18,'Hilfstabelle Mannschaften'!$AE$53:$AG$62,3,0)","v":1761},{"$f":"VLOOKUP(B18,'Hilfstabelle Mannschaften'!$AE$53:$AH$62,4,0)","v":1781},{"$f":"VLOOKUP(B18,'Hilfstabelle Mannschaften'!$AE$53:$AJ$62,5,0)","v":1659},{"$f":"VLOOKUP(B18,'Hilfstabelle Mannschaften'!$AE$53:$AJ$62,6,0)","v":1759},{"$f":"VLOOKUP(B18,'Hilfstabelle Mannschaften'!$AE$53:$AK$62,7,0)","v":1692},{"$f":"VLOOKUP(B18,'Hilfstabelle Mannschaften'!$AE$53:$AL$62,8,0)","v":1749},{"$f":"VLOOKUP(B18,'Hilfstabelle Mannschaften'!$AE$53:$AM$62,9,0)","v":1824},{"$f":"VLOOKUP(B18,'Hilfstabelle Mannschaften'!$AE$53:$AN$62,10,0)","v":1751},{"$f":"VLOOKUP(B18,'Hilfstabelle Mannschaften'!$AE$53:$AO$62,11,0)","v":1633},{"$f":"VLOOKUP(B18,'Hilfstabelle Mannschaften'!$AE$53:$AP$62,12,0)","v":2062},{"$f":"VLOOKUP(B18,'Hilfstabelle Mannschaften'!$AE$53:$AQ$62,13,0)","v":1718},{"$f":"VLOOKUP(B18,'Hilfstabelle Mannschaften'!$AE$53:$AR$62,14,0)","v":1793},{"$f":"VLOOKUP(B18,'Hilfstabelle Mannschaften'!$AE$53:$AS$62,15,0)","v":1841}]
[null,null,null,null,null,null,"Punkte",{"$f":"IF(H18<1,\"\",'Hilfstabelle Mannschaften'!$V24)","v":6},{"$f":"IF(I18<1,\"\",'Hilfstabelle Mannschaften'!$V29)","v":6},{"$f":"IF(J18<1,\"\",'Hilfstabelle Mannschaften'!$V34)","v":4},{"$f":"IF(K18<1,\"\",'Hilfstabelle Mannschaften'!$V39)","v":1},{"$f":"IF(L18<1,\"\",'Hilfstabelle Mannschaften'!$V44)","v":1},{"$f":"IF(M18<1,\"\",'Hilfstabelle Mannschaften'!$V49)","v":2},{"$f":"IF(N18<1,\"\",'Hilfstabelle Mannschaften'!$V54)","v":3},{"$f":"IF(O18<1,\"\",'Hilfstabelle Mannschaften'!$V59)","v":4},{"$f":"IF(P18<1,\"\",'Hilfstabelle Mannschaften'!$V64)","v":3},{"$f":"IF(Q18<1,\"\",'Hilfstabelle Mannschaften'!$V69)","v":1},{"$f":"IF(R18<1,\"\",'Hilfstabelle Mannschaften'!$V74)","v":7},{"$f":"IF(S18<1,\"\",'Hilfstabelle Mannschaften'!$V79)","v":1},{"$f":"IF(T18<1,\"\",'Hilfstabelle Mannschaften'!$V84)","v":3},{"$f":"IF(U18<1,\"\",'Hilfstabelle Mannschaften'!V89)","v":4}]
[null,{"$f":"+'Spielbogen 7er'!I16","v":"KS 2"},null,{"$f":"+'Spielbogen 7er'!D16","v":"Körber Sports 2"},{"$f":"SUM(H21:U21)","v":72},25432,"Pins",{"$f":"VLOOKUP(B20,'Hilfstabelle Mannschaften'!$AE$53:$AF$62,2,0)","v":1229},{"$f":"VLOOKUP(B20,'Hilfstabelle Mannschaften'!$AE$53:$AG$62,3,0)","v":1282},{"$f":"VLOOKUP(B20,'Hilfstabelle Mannschaften'!$AE$53:$AH$62,4,0)","v":1909},{"$f":"VLOOKUP(B20,'Hilfstabelle Mannschaften'!$AE$53:$AJ$62,5,0)","v":1952},{"$f":"VLOOKUP(B20,'Hilfstabelle Mannschaften'!$AE$53:$AJ$62,6,0)","v":1914},{"$f":"VLOOKUP(B20,'Hilfstabelle Mannschaften'!$AE$53:$AK$62,7,0)","v":1445},{"$f":"VLOOKUP(B20,'Hilfstabelle Mannschaften'!$AE$53:$AL$62,8,0)","v":1777},{"$f":"VLOOKUP(B20,'Hilfstabelle Mannschaften'!$AE$53:$AM$62,9,0)","v":2149},{"$f":"VLOOKUP(B20,'Hilfstabelle Mannschaften'!$AE$53:$AN$62,10,0)","v":2014},{"$f":"VLOOKUP(B20,'Hilfstabelle Mannschaften'!$AE$53:$AO$62,11,0)","v":1974},{"$f":"VLOOKUP(B20,'Hilfstabelle Mannschaften'!$AE$53:$AP$62,12,0)","v":1757},{"$f":"VLOOKUP(B20,'Hilfstabelle Mannschaften'!$AE$53:$AQ$62,13,0)","v":2017},{"$f":"VLOOKUP(B20,'Hilfstabelle Mannschaften'!$AE$53:$AR$62,14,0)","v":1922},{"$f":"VLOOKUP(B20,'Hilfstabelle Mannschaften'!$AE$53:$AS$62,15,0)","v":2091}]
[null,null,null,null,null,null,"Punkte",{"$f":"IF(H20<1,\"\",'Hilfstabelle Mannschaften'!$W$24)","v":1},{"$f":"IF(I20<1,\"\",'Hilfstabelle Mannschaften'!$W29)","v":1},{"$f":"IF(J20<1,\"\",'Hilfstabelle Mannschaften'!$W34)","v":6},{"$f":"IF(K20<1,\"\",'Hilfstabelle Mannschaften'!$W39)","v":7},{"$f":"IF(L20<1,\"\",'Hilfstabelle Mannschaften'!$W44)","v":7},{"$f":"IF(M20<1,\"\",'Hilfstabelle Mannschaften'!$W49)","v":1},{"$f":"IF(N20<1,\"\",'Hilfstabelle Mannschaften'!$W54)","v":5},{"$f":"IF(O20<1,\"\",'Hilfstabelle Mannschaften'!$W59)","v":7},{"$f":"IF(P20<1,\"\",'Hilfstabelle Mannschaften'!$W64)","v":7},{"$f":"IF(Q20<1,\"\",'Hilfstabelle Mannschaften'!$W69)","v":6},{"$f":"IF(R20<1,\"\",'Hilfstabelle Mannschaften'!$W74)","v":3},{"$f":"IF(S20<1,\"\",'Hilfstabelle Mannschaften'!$W79)","v":7},{"$f":"IF(T20<1,\"\",'Hilfstabelle Mannschaften'!$W84)","v":7},{"$f":"IF(U20<1,\"\",'Hilfstabelle Mannschaften'!W89)","v":7}]
[null,{"$f":"+'Spielbogen 7er'!I16","v":"KS 2"},null,{"$f":"+'Spielbogen 7er'!D16","v":"Körber Sports 2"},{"$f":"SUM(H23:U23)","v":72.5},{"$f":"SUM(H22:U22)","v":25432},"Pins",{"$f":"VLOOKUP(B22,'Hilfstabelle Mannschaften'!$AE$53:$AF$62,2,0)","v":1229},{"$f":"VLOOKUP(B22,'Hilfstabelle Mannschaften'!$AE$53:$AG$62,3,0)","v":1282},{"$f":"VLOOKUP(B22,'Hilfstabelle Mannschaften'!$AE$53:$AH$62,4,0)","v":1909},{"$f":"VLOOKUP(B22,'Hilfstabelle Mannschaften'!$AE$53:$AJ$62,5,0)","v":1952},{"$f":"VLOOKUP(B22,'Hilfstabelle Mannschaften'!$AE$53:$AJ$62,6,0)","v":1914},{"$f":"VLOOKUP(B22,'Hilfstabelle Mannschaften'!$AE$53:$AK$62,7,0)","v":1445},{"$f":"VLOOKUP(B22,'Hilfstabelle Mannschaften'!$AE$53:$AL$62,8,0)","v":1777},{"$f":"VLOOKUP(B22,'Hilfstabelle Mannschaften'!$AE$53:$AM$62,9,0)","v":2149},{"$f":"VLOOKUP(B22,'Hilfstabelle Mannschaften'!$AE$53:$AN$62,10,0)","v":2014},{"$f":"VLOOKUP(B22,'Hilfstabelle Mannschaften'!$AE$53:$AO$62,11,0)","v":1974},{"$f":"VLOOKUP(B22,'Hilfstabelle Mannschaften'!$AE$53:$AP$62,12,0)","v":1757},{"$f":"VLOOKUP(B22,'Hilfstabelle Mannschaften'!$AE$53:$AQ$62,13,0)","v":2017},{"$f":"VLOOKUP(B22,'Hilfstabelle Mannschaften'!$AE$53:$AR$62,14,0)","v":1922},{"$f":"VLOOKUP(B22,'Hilfstabelle Mannschaften'!$AE$53:$AS$62,15,0)","v":2091}]
[null,null,null,null,null,null,"Punkte",{"$f":"IF(H22<1,\"\",'Hilfstabelle Mannschaften'!$X$24)","v":1},{"$f":"IF(I22<1,\"\",'Hilfstabelle Mannschaften'!$X$29)","v":1},{"$f":"IF(J22<1,\"\",'Hilfstabelle Mannschaften'!$X$34)","v":6},{"$f":"IF(K22<1,\"\",'Hilfstabelle Mannschaften'!$X$39)","v":7},{"$f":"IF(L22<1,\"\",'Hilfstabelle Mannschaften'!$X$44)","v":7.5},{"$f":"IF(M22<1,\"\",'Hilfstabelle Mannschaften'!$X$49)","v":1},{"$f":"IF(N22<1,\"\",'Hilfstabelle Mannschaften'!$X$54)","v":5},{"$f":"IF(O22<1,\"\",'Hilfstabelle Mannschaften'!$X$59)","v":7},{"$f":"IF(P22<1,\"\",'Hilfstabelle Mannschaften'!$X$64)","v":7},{"$f":"IF(Q22<1,\"\",'Hilfstabelle Mannschaften'!$X$69)","v":6},{"$f":"IF(R22<1,\"\",'Hilfstabelle Mannschaften'!$X$74)","v":3},{"$f":"IF(S22<1,\"\",'Hilfstabelle Mannschaften'!$X$79)","v":7},{"$f":"IF(T22<1,\"\",'Hilfstabelle Mannschaften'!$X$84)","v":7},{"$f":"IF(U22<1,\"\",'Hilfstabelle Mannschaften'!X$89)","v":7}]
[null,{"$f":"+'Spielbogen 10er'!G17","v":"???"},null,{"$f":"+'Spielbogen 10er'!D17","v":"???"},{"$f":"SUM(H25:U25)","v":{"$error":"#N/A"}},{"$error":"#N/A"},"Pins",{"$f":"VLOOKUP(B24,'Hilfstabelle Mannschaften'!$AE$53:$AF$62,2,0)","v":{"$error":"#N/A"}},{"$f":"VLOOKUP(B24,'Hilfstabelle Mannschaften'!$AE$53:$AG$62,3,0)","v":{"$error":"#N/A"}},{"$f":"VLOOKUP(B24,'Hilfstabelle Mannschaften'!$AE$53:$AH$62,4,0)","v":{"$error":"#N/A"}},{"$f":"VLOOKUP(B24,'Hilfstabelle Mannschaften'!$AE$53:$AJ$62,5,0)","v":{"$error":"#N/A"}},{"$f":"VLOOKUP(B24,'Hilfstabelle Mannschaften'!$AE$53:$AJ$62,6,0)","v":{"$error":"#N/A"}},{"$f":"VLOOKUP(B24,'Hilfstabelle Mannschaften'!$AE$53:$AK$62,7,0)","v":{"$error":"#N/A"}},{"$f":"VLOOKUP(B24,'Hilfstabelle Mannschaften'!$AE$53:$AL$62,8,0)","v":{"$error":"#N/A"}},{"$f":"VLOOKUP(B24,'Hilfstabelle Mannschaften'!$AE$53:$AM$62,9,0)","v":{"$error":"#N/A"}},{"$f":"VLOOKUP(B24,'Hilfstabelle Mannschaften'!$AE$53:$AN$62,10,0)","v":{"$error":"#N/A"}},{"$f":"VLOOKUP(B24,'Hilfstabelle Mannschaften'!$AE$53:$AO$62,11,0)","v":{"$error":"#N/A"}},{"$f":"VLOOKUP(B24,'Hilfstabelle Mannschaften'!$AE$53:$AP$62,12,0)","v":{"$error":"#N/A"}},{"$f":"VLOOKUP(B24,'Hilfstabelle Mannschaften'!$AE$53:$AQ$62,13,0)","v":{"$error":"#N/A"}},{"$f":"VLOOKUP(B24,'Hilfstabelle Mannschaften'!$AE$53:$AR$62,14,0)","v":{"$error":"#N/A"}},{"$f":"VLOOKUP(B24,'Hilfstabelle Mannschaften'!$AE$53:$AS$62,15,0)","v":{"$error":"#N/A"}}]
[null,null,null,null,null,null,"Punkte",{"$f":"IF(H24<1,\"\",'Hilfstabelle Mannschaften'!$Y24)","v":{"$error":"#N/A"}},{"$f":"IF(I24<1,\"\",'Hilfstabelle Mannschaften'!$Y29)","v":{"$error":"#N/A"}},{"$f":"IF(J24<1,\"\",'Hilfstabelle Mannschaften'!$Y34)","v":{"$error":"#N/A"}},{"$f":"IF(K24<1,\"\",'Hilfstabelle Mannschaften'!$Y39)","v":{"$error":"#N/A"}},{"$f":"IF(L24<1,\"\",'Hilfstabelle Mannschaften'!$Y44)","v":{"$error":"#N/A"}},{"$f":"IF(M24<1,\"\",'Hilfstabelle Mannschaften'!$Y49)","v":{"$error":"#N/A"}},{"$f":"IF(N24<1,\"\",'Hilfstabelle Mannschaften'!$Y54)","v":{"$error":"#N/A"}},{"$f":"IF(O24<1,\"\",'Hilfstabelle Mannschaften'!$Y59)","v":{"$error":"#N/A"}},{"$f":"IF(P24<1,\"\",'Hilfstabelle Mannschaften'!$Y64)","v":{"$error":"#N/A"}},{"$f":"IF(Q24<1,\"\",'Hilfstabelle Mannschaften'!$Y69)","v":{"$error":"#N/A"}},{"$f":"IF(R24<1,\"\",'Hilfstabelle Mannschaften'!$Y74)","v":{"$error":"#N/A"}},{"$f":"IF(S24<1,\"\",'Hilfstabelle Mannschaften'!$Y79)","v":{"$error":"#N/A"}},{"$f":"IF(T24<1,\"\",'Hilfstabelle Mannschaften'!$Y84)","v":{"$error":"#N/A"}},{"$f":"IF(U24<1,\"\",'Hilfstabelle Mannschaften'!Y89)","v":{"$error":"#N/A"}}]
[null,{"$f":"+'Spielbogen 10er'!G18","v":"???"},null,{"$f":"+'Spielbogen 10er'!D18","v":"???"},{"$f":"SUM(H27:U27)","v":{"$error":"#N/A"}},{"$error":"#N/A"},"Pins",{"$f":"VLOOKUP(B26,'Hilfstabelle Mannschaften'!$AE$53:$AF$62,2,0)","v":{"$error":"#N/A"}},{"$f":"VLOOKUP(B26,'Hilfstabelle Mannschaften'!$AE$53:$AG$62,3,0)","v":{"$error":"#N/A"}},{"$f":"VLOOKUP(B26,'Hilfstabelle Mannschaften'!$AE$53:$AH$62,4,0)","v":{"$error":"#N/A"}},{"$f":"VLOOKUP(B26,'Hilfstabelle Mannschaften'!$AE$53:$AJ$62,5,0)","v":{"$error":"#N/A"}},{"$f":"VLOOKUP(B26,'Hilfstabelle Mannschaften'!$AE$53:$AJ$62,6,0)","v":{"$error":"#N/A"}},{"$f":"VLOOKUP(B26,'Hilfstabelle Mannschaften'!$AE$53:$AK$62,7,0)","v":{"$error":"#N/A"}},{"$f":"VLOOKUP(B26,'Hilfstabelle Mannschaften'!$AE$53:$AL$62,8,0)","v":{"$error":"#N/A"}},{"$f":"VLOOKUP(B26,'Hilfstabelle Mannschaften'!$AE$53:$AM$62,9,0)","v":{"$error":"#N/A"}},{"$f":"VLOOKUP(B26,'Hilfstabelle Mannschaften'!$AE$53:$AN$62,10,0)","v":{"$error":"#N/A"}},{"$f":"VLOOKUP(B26,'Hilfstabelle Mannschaften'!$AE$53:$AO$62,11,0)","v":{"$error":"#N/A"}},{"$f":"VLOOKUP(B26,'Hilfstabelle Mannschaften'!$AE$53:$AP$62,12,0)","v":{"$error":"#N/A"}},{"$f":"VLOOKUP(B26,'Hilfstabelle Mannschaften'!$AE$53:$AQ$62,13,0)","v":{"$error":"#N/A"}},{"$f":"VLOOKUP(B26,'Hilfstabelle Mannschaften'!$AE$53:$AR$62,14,0)","v":{"$error":"#N/A"}},{"$f":"VLOOKUP(B26,'Hilfstabelle Mannschaften'!$AE$53:$AS$62,15,0)","v":{"$error":"#N/A"}}]
[null,null,null,null,null,null,"Punkte",{"$f":"IF(H26<1,\"\",'Hilfstabelle Mannschaften'!$Z$24)","v":{"$error":"#N/A"}},{"$f":"IF(I26<1,\"\",'Hilfstabelle Mannschaften'!$Z$29)","v":{"$error":"#N/A"}},{"$f":"IF(J26<1,\"\",'Hilfstabelle Mannschaften'!$Z$34)","v":{"$error":"#N/A"}},{"$f":"IF(K26<1,\"\",'Hilfstabelle Mannschaften'!$Z$39)","v":{"$error":"#N/A"}},{"$f":"IF(L26<1,\"\",'Hilfstabelle Mannschaften'!$Z$44)","v":{"$error":"#N/A"}},{"$f":"IF(M26<1,\"\",'Hilfstabelle Mannschaften'!$Z$49)","v":{"$error":"#N/A"}},{"$f":"IF(N26<1,\"\",'Hilfstabelle Mannschaften'!$Z$54)","v":{"$error":"#N/A"}},{"$f":"IF(O26<1,\"\",'Hilfstabelle Mannschaften'!$Z$59)","v":{"$error":"#N/A"}},{"$f":"IF(P26<1,\"\",'Hilfstabelle Mannschaften'!$Z$64)","v":{"$error":"#N/A"}},{"$f":"IF(Q26<1,\"\",'Hilfstabelle Mannschaften'!$Z$69)","v":{"$error":"#N/A"}},{"$f":"IF(R26<1,\"\",'Hilfstabelle Mannschaften'!$Z$74)","v":{"$error":"#N/A"}},{"$f":"IF(S26<1,\"\",'Hilfstabelle Mannschaften'!$Z$79)","v":{"$error":"#N/A"}},{"$f":"IF(T26<1,\"\",'Hilfstabelle Mannschaften'!$Z$84)","v":{"$error":"#N/A"}},{"$f":"IF(U26<1,\"\",'Hilfstabelle Mannschaften'!Z$89)","v":{"$error":"#N/A"}}]
[null,"=+'Spielbogen 1.'!F19",null,{"$f":"+#REF!","v":{"$error":"#REF!"}},null,{"$f":"SUM(H28:U28)","v":0},"Pins"]
[null,null,null,null,null,{"$f":"SUM(H29:U29)","v":0},"Punkte",{"$f":"IF(H28<1,\"\",'Hilfstabelle Mannschaften'!$AA$24)","v":""},{"$f":"IF(I28<1,\"\",'Hilfstabelle Mannschaften'!$AA$29)","v":""},{"$f":"IF(J28<1,\"\",'Hilfstabelle Mannschaften'!$AA$34)","v":""},{"$f":"IF(K28<1,\"\",'Hilfstabelle Mannschaften'!$AA$39)","v":""},{"$f":"IF(L28<1,\"\",'Hilfstabelle Mannschaften'!$AA$44)","v":""},{"$f":"IF(M28<1,\"\",'Hilfstabelle Mannschaften'!$AA$49)","v":""},{"$f":"IF(N28<1,\"\",'Hilfstabelle Mannschaften'!$AA$54)","v":""},{"$f":"IF(O28<1,\"\",'Hilfstabelle Mannschaften'!$AA$59)","v":""},{"$f":"IF(P28<1,\"\",'Hilfstabelle Mannschaften'!$AA$64)","v":""},{"$f":"IF(Q28<1,\"\",'Hilfstabelle Mannschaften'!$AA$69)","v":""},{"$f":"IF(R28<1,\"\",'Hilfstabelle Mannschaften'!$AA$74)","v":""},{"$f":"IF(S28<1,\"\",'Hilfstabelle Mannschaften'!$AA$79)","v":""},{"$f":"IF(T28<1,\"\",'Hilfstabelle Mannschaften'!$AA$84)","v":""},{"$f":"IF(U28<1,\"\",'Hilfstabelle Mannschaften'!AA$89)","v":""}]
[null,"=+'Spielbogen 1.'!F20",null,{"$f":"+#REF!","v":{"$error":"#REF!"}},null,{"$f":"SUM(H30:U30)","v":0},"Pins"]
[null,null,null,null,null,{"$f":"SUM(H31:U31)","v":0},"Punkte",{"$f":"IF(H30<1,\"\",'Hilfstabelle Mannschaften'!$AB$24)","v":""},{"$f":"IF(I30<1,\"\",'Hilfstabelle Mannschaften'!$AB$29)","v":""},{"$f":"IF(J30<1,\"\",'Hilfstabelle Mannschaften'!$AB$34)","v":""},{"$f":"IF(K30<1,\"\",'Hilfstabelle Mannschaften'!$AB$39)","v":""},{"$f":"IF(L30<1,\"\",'Hilfstabelle Mannschaften'!$AB$44)","v":""},{"$f":"IF(M30<1,\"\",'Hilfstabelle Mannschaften'!$AB$49)","v":""},{"$f":"IF(N30<1,\"\",'Hilfstabelle Mannschaften'!$AB$54)","v":""},{"$f":"IF(O30<1,\"\",'Hilfstabelle Mannschaften'!$AB$59)","v":""},{"$f":"IF(P30<1,\"\",'Hilfstabelle Mannschaften'!$AB$64)","v":""},{"$f":"IF(Q30<1,\"\",'Hilfstabelle Mannschaften'!$AB$69)","v":""},{"$f":"IF(R30<1,\"\",'Hilfstabelle Mannschaften'!$AB$74)","v":""},{"$f":"IF(S30<1,\"\",'Hilfstabelle Mannschaften'!$AB$79)","v":""},{"$f":"IF(T30<1,\"\",'Hilfstabelle Mannschaften'!$AB$84)","v":""},{"$f":"IF(U30<1,\"\",'Hilfstabelle Mannschaften'!AB$89)","v":""}]

{"sheet":"Annegret S.","index":7,"n_rows":25,"n_cols":23,"rows_kept":25,"cut":false,"hidden":false,"merged":[[1,6,1,18],[9,3,9,10],[7,3,7,5],[5,3,5,5],[6,3,6,5],[9,12,9,21],[4,16,4,21],[5,11,5,12],[6,11,6,12],[7,11,7,12],[6,16,6,17],[5,19,5,21],[7,16,7,17],[7,19,7,20],[6,19,6,20],[4,9,4,14],[22,14,22,16],[23,14,23,16],[24,14,24,16],[2,9,2,13],[4,4,4,5],[2,3,2,7],[5,16,5,18],[10,12,10,16],[11,12,11,16],[12,12,12,16],[13,12,13,16],[14,12,14,16],[15,12,15,16],[16,12,16,16],[17,12,17,16],[18,12,18,16],[19,12,19,16],[17,22,17,23],[18,22,18,23],[19,22,19,23],[12,22,12,23],[13,22,13,23],[14,22,14,23],[15,22,15,23],[16,22,16,23]]}
[null,"Start"]
[null,"Rangliste",null,null,null,null,{"$f":"+'Hilfstabelle Mannschaften'!H8&\" \"&+'Hilfstabelle Mannschaften'!I8","v":"PUNKTSPIELSAISON  2024/2025"}]
[null,null,null,{"$f":"+'Hilfstabelle Spieler'!A6","v":"Annegret Schmidt"}]
[]
[null,null,null,"Pass.-Nr.:",{"$f":"VLOOKUP(D3,'Hilfstabelle Spieler'!A6:B19,2,0)","v":19222},null,"Pins","Spiele","Schnitt","Ligaergebnisse",null,null,null,null,null,null,"Sonstige Antritte:"]
[null,null,null,"Ligaergebnisse:",null,null,{"$f":"IF(SUM(J12:J31)>1,SUM(J12:J31),\" \")","v":2834},{"$f":"COUNT(G12:I31)","v":21},{"$f":"IF(SUM(G12:I31)>1,SUM(G6/H6),\" \")","v":134.95238095238096},"MAX.","MIN.","MAX.",null,"MIN.","Schnitt",null,"4.er Serie:",null,null,"6.er Serie:"]
[null,null,null,"Sonstige Antritte:",null,null,{"$f":"IF(SUM(R12:S19)>1,SUM(R12:S20),\" \")","v":5829},{"$f":"IF(SUM(R12:S19)>1,SUM(V12:V20),\" \")","v":42},{"$f":"IF(SUM(R12:S20)>1,G7/H7,\" \")","v":138.78571428571428},"ERG.","ERG.","3.ER",null,"3.ER","3.ER",null,"Höchstes 4.er Erg. :",null,{"$f":"MAX(R13:R18)","v":574},"Höchstes 6.er Erg. :",null,{"$f":"MAX(S12:S20)","v":892}]
[null,null,null,"GESAMTSCHNITT:",null,null,{"$f":"IF(SUM(G6:G7)>1,SUM(G6:G7),\" \")","v":8663},{"$f":"IF(SUM(H6:H7)>1,SUM(H6:H7),\" \")","v":63},{"$f":"IF(SUM(G8)>1,SUM(G8/H8),\" \")","v":137.50793650793651},{"$f":"MAX(G12:I40)","v":162},{"$f":"IF(SUM(G12:I40)<1,\" \",MIN(G12:I40))","v":104},{"$f":"MAX(J12:J40)","v":426},null,{"$f":"IF(SUM(G12:J40)>1,MIN(J12:J40),\" \")","v":386},{"$f":"IF(J8>0,AVERAGE(J12:J30),\"\")","v":404.85714285714283},null,"Höchste Einzel-Erg. :",null,160,"Höchste Einzel-Erg. :",null,168]
[]
[null,null,null,"         Einzelspielergebnisse Liga",null,null,null,null,null,null,null,null,"Sonstige Antritte"]
[null,null,null," Datum","Antr.","Bahn","1. Spiel","2. Spiel","3. Spiel","3. er Serie","3. er Ø",null," Datum - Turnier",null,null,null,null,"4.er Erg.","6.er Erg.","Schnitt","Ges. Pins","Spiele"]
[null,null,null,{"$f":"+'Spielbogen 8er'!P4","v":"2024-09-12"},1,{"$f":"+'Spielbogen 8er'!N4","v":"OT"},121,142,123,{"$f":"IF(G12>1,+G12+H12+I12,\"\")","v":386},{"$f":"IF(G12>1,SUM(G12:I12)/3,\" \")","v":128.66666666666666},null,{"$f":"+'Anmeldegruppen Turniere'!T8&\" - \"&W12","v":"07. / 08. Sep. 24 - Eröffnungs Doppel"},null,null,null,null,null,802,{"$f":"IF(S12>1,+S12/V12,\"\")","v":133.66666666666666},{"$f":"IF(S12>1,SUM($R$12:S12),\" \")","v":802},{"$f":"IF(S12>0,6,0)","v":6},"Eröffnungs Doppel"]
[null,null,null,{"$f":"+'Spielbogen 8er'!P5","v":"2024-09-26"},2,{"$f":"+'Spielbogen 8er'!N5","v":"OT"},null,null,null,""," ",null,{"$f":"+'Anmeldegruppen Turniere'!T11&\" - \"&W13","v":"12. / 13. Nov. 24 - 1. Antritt HH-Cup"},null,null,null,null,524,null,{"$f":"IF(R13>1,+R13/V13,\"\")","v":131},{"$f":"IF(R13>1,SUM($R$12:S13),\" \")","v":1326},{"$f":"IF(R13,4,0)","v":4},"1. Antritt HH-Cup"]
[null,null,null,{"$f":"+'Spielbogen 8er'!P6","v":"2024-10-10"},3,{"$f":"+'Spielbogen 8er'!N6","v":"WB"},134,144,148,426,142,null,{"$f":"+'Anmeldegruppen Turniere'!T12&\" - \"&W14","v":"26. / 27. Nov .24 - 2. Antritt HH-Cup"},null,null,null,null,574,null,{"$f":"IF(R14>1,+R14/V14,\"\")","v":143.5},{"$f":"IF(R14>1,SUM($R$12:S14),\" \")","v":1900},{"$f":"IF(R14,4,0)","v":4},"2. Antritt HH-Cup"]
[null,null,null,{"$f":"+'Spielbogen 8er'!P7","v":"2024-10-24"},4,{"$f":"+'Spielbogen 8er'!N7","v":"OT"},null,null,null,""," ",null,{"$f":"+'Hilfstabelle Mannschaften'!J12&\" - \"&W15","v":"16. / 17. Nov. 24 - Herbst-Mix"},null,null,null,null,null,null,{"$f":"IF(R15>1,+R15/V15,\"\")","v":""},{"$f":"IF(R15>1,SUM($R$12:S15),\" \")","v":" "},{"$f":"IF(R15,4,0)","v":0},"Herbst-Mix"]
[null,null,null,{"$f":"+'Spielbogen 8er'!P8","v":"2024-11-07"},5,{"$f":"+'Spielbogen 8er'!N8","v":"WB"},null,null,null,""," ",null,{"$f":"+'Anmeldegruppen Turniere'!T21&\" - \"&W16","v":"18. / 19. Jan. 25 - 1. Antritt Einzel"},null,null,null,null,null,892,{"$f":"IF(S16>1,+S16/V16,\"\")","v":148.66666666666666},{"$f":"IF(S16>1,SUM($R$12:S16),\" \")","v":2792},{"$f":"IF(S16>0,6,0)","v":6},"1. Antritt Einzel"]
[null,null,null,{"$f":"+'Spielbogen 8er'!P9","v":"2025-01-16"},6,{"$f":"+'Spielbogen 8er'!N9","v":"WB"},140,125,140,405,135,null,{"$f":"+'Anmeldegruppen Turniere'!T22&\" - \"&W17","v":"01. / 02. Feb. 25 - 2. Antritt Einzel"},null,null,null,null,null,816,{"$f":"IF(S17>1,+S17/V17,\"\")","v":136},{"$f":"IF(S17>1,SUM($R$12:S17),\" \")","v":3608},{"$f":"IF(S17>0,6,0)","v":6},"2. Antritt Einzel"]
[null,null,null,{"$f":"+'Spielbogen 8er'!P10","v":"2025-01-30"},7,{"$f":"+'Spielbogen 8er'!N10","v":"OT"},null,null,null,""," ",null,{"$f":"+'Hilfstabelle Mannschaften'!J14&\" - \"&W18","v":"12. / 13. Mär, 25 - Frühjahrs-Mix"},null,null,null,null,541,null,{"$f":"IF(R18>1,+R18/V18,\"\")","v":135.25},{"$f":"IF(R18>1,SUM($R$12:S18),\" \")","v":4149},{"$f":"IF(R18,4,0)","v":4},"Frühjahrs-Mix"]
[null,null,null,{"$f":"+'Spielbogen 8er'!P11","v":"2025-02-13"},8,{"$f":"+'Spielbogen 8er'!N11","v":"WB"},134,136,146,416,138.66666666666666,null,{"$f":"+'Anmeldegruppen Turniere'!T29&\" - \"&W19","v":"12. / 13. Apr. 25 - 1. Antritt Doppel"},null,null,null,null,null,836,{"$f":"IF(S19>1,+S19/V19,\"\")","v":139.33333333333334},{"$f":"IF(S19>1,SUM($R$12:S19),\" \")","v":4985},{"$f":"IF(S19>0,6,0)","v":6},"1. Antritt Doppel"]
[null,null,null,{"$f":"+'Spielbogen 8er'!P12","v":"2025-02-27"},9,{"$f":"+'Spielbogen 8er'!N12","v":"OT"},104,162,130,396,{"$f":"IF(G20>1,SUM(G20:I20)/3,\" \")","v":132},null,{"$f":"+'Anmeldegruppen Turniere'!T30&\" - \"&W20","v":"10. / 11. Mai  25 - 2. Antritt Doppel"},null,null,null,null,null,844,{"$f":"IF(S20>1,+S20/V20,\"\")","v":140.66666666666666},{"$f":"IF(S20>1,SUM($R$12:S20),\" \")","v":5829},{"$f":"IF(S20>0,6,0)","v":6},"2. Antritt Doppel"]
[null,null,null,{"$f":"+'Spielbogen 8er'!P13","v":"2025-03-13"},10,{"$f":"+'Spielbogen 8er'!N13","v":"WB"},128,139,146,413,{"$f":"IF(G21>1,SUM(G21:I21)/3,\" \")","v":137.66666666666666}]
[null,null,null,{"$f":"+'Spielbogen 8er'!P14","v":"2025-03-27"},11,{"$f":"+'Spielbogen 8er'!N14","v":"OT"},null,null,null,""," ",null,null,null,null,null,null,"Ges. Pins","Spiele","Schnitt"]
[null,null,null,{"$f":"+'Spielbogen 8er'!P15","v":"2025-04-10"},12,{"$f":"+'Spielbogen 8er'!N15","v":"WB"},null,null,null,""," ",null,null,null,"Schnitt HH-Cup",null,null,{"$f":"IF(R13>0,SUM(R13:R14),\"\")","v":1098},{"$f":"IF(R13>0,SUM(V13:V14),\"\")","v":8},{"$f":"IF(R13>0,SUM(R13:R14)/SUM(V13:V14),\"\")","v":137.25}]
[null,null,null,{"$f":"+'Spielbogen 8er'!P16","v":"2025-04-24"},13,{"$f":"+'Spielbogen 8er'!N16","v":"OT"},null,null,null,""," ",null,null,null,"Schnitt Einzel",null,null,{"$f":"IF(S16>0,SUM(S16:S17),\"\")","v":1708},{"$f":"IF(S16>0,SUM(V16:V17),\"\")","v":12},{"$f":"IF(S16>0,SUM(S16:S17)/SUM(V16:V17),\"\")","v":142.33333333333334}]
[null,null,null,{"$f":"+'Spielbogen 8er'!P17","v":"2025-05-08"},14,{"$f":"+'Spielbogen 8er'!N17","v":"WB"},117,146,129,{"$f":"IF(G25>1,+G25+H25+I25,\"\")","v":392},{"$f":"IF(G25>1,SUM(G25:I25)/3,\" \")","v":130.66666666666666},null,null,null,"Schnitt Doppel",null,null,{"$f":"IF(S19>0,SUM(S19:S20),\"\")","v":1680},{"$f":"IF(S19>0,SUM(V19:V20),\"\")","v":12},{"$f":"IF(S19>0,SUM(S19:S20)/SUM(V19:V20),\"\")","v":140}]

{"sheet":"Ilona W.","index":8,"n_rows":31,"n_cols":23,"rows_kept":31,"cut":false,"hidden":false,"merged":[[1,6,1,18],[9,3,9,10],[7,3,7,5],[5,3,5,5],[6,3,6,5],[9,12,9,21],[4,16,4,21],[5,11,5,12],[6,11,6,12],[7,11,7,12],[6,16,6,17],[5,19,5,21],[7,16,7,17],[7,19,7,20],[6,19,6,20],[4,9,4,14],[22,14,22,16],[23,14,23,16],[24,14,24,16],[2,9,2,13],[4,4,4,5],[2,3,2,7],[5,16,5,18],[10,12,10,16],[11,12,11,16],[12,12,12,16],[13,12,13,16],[14,12,14,16],[15,12,15,16],[16,12,16,16],[17,12,17,16],[18,12,18,16],[19,12,19,16],[17,22,17,23],[18,22,18,23],[19,22,19,23],[12,22,12,23],[13,22,13,23],[14,22,14,23],[15,22,15,23],[16,22,16,23]]}
[null,"Start"]
[null,"Rangliste",null,null,null,null,{"$f":"+'Hilfstabelle Mannschaften'!H8&\" \"&+'Hilfstabelle Mannschaften'!I8","v":"PUNKTSPIELSAISON  2024/2025"}]
[null,null,null,{"$f":"+'Hilfstabelle Spieler'!A9","v":"Ilona Wetzel"}]
[]
[null,null,null,"Pass.-Nr.:",{"$f":"VLOOKUP(D3,'Hilfstabelle Spieler'!A6:B19,2,0)","v":22115},null,"Pins","Spiele","Schnitt","Ligaergebnisse",null,null,null,null,null,null,"Sonstige Antritte:"]
[null,null,null,"Ligaergebnisse:",null,null,{"$f":"IF(SUM(J12:J31)>1,SUM(J12:J31),\" \")","v":2240},{"$f":"COUNT(G12:I31)","v":15},{"$f":"IF(SUM(G12:I31)>1,SUM(G6/H6),\" \")","v":149.33333333333334},"MAX.","MIN.","MAX.",null,"MIN.","Schnitt",null,"4.er Serie:",null,null,"6.er Serie:"]
[null,null,null,"Sonstige Antritte:",null,null,{"$f":"IF(SUM(R12:S20)>1,SUM(R12:S20),\" \")","v":5294},{"$f":"IF(SUM(R12:S19)>1,SUM(V12:V20),\" \")","v":34},{"$f":"IF(SUM(R12:S20)>1,G7/H7,\" \")","v":155.70588235294119},"ERG.","ERG.","3.ER",null,"3.ER","3.ER",null,"Höchstes 4.er Erg. :",null,{"$f":"MAX(R13:R18)","v":557},"Höchstes 6.er Erg. :",null,{"$f":"MAX(S12:S20)","v":1024}]
[null,null,null,"GESAMTSCHNITT:",null,null,{"$f":"IF(SUM(G6:G7)>1,SUM(G6:G7),\" \")","v":7534},{"$f":"IF(SUM(H6:H7)>1,SUM(H6:H7),\" \")","v":49},{"$f":"IF(SUM(G8)>1,SUM(G8/H8),\"\")","v":153.75510204081633},{"$f":"MAX(G12:I40)","v":202},{"$f":"IF(SUM(G12:I40)<1,\" \",MIN(G12:I40))","v":109},{"$f":"MAX(J12:J40)","v":509},null,{"$f":"IF(SUM(G12:J40)>1,MIN(J12:J40),\" \")","v":379},{"$f":"IF(J8>0,AVERAGE(J12:J30),\"\")","v":448},null,"Höchste Einzel-Erg. :",null,null,"Höchste Einzel-Erg. :",null,195]
[]
[null,null,null,"         Einzelspielergebnisse Liga",null,null,null,null,null,null,null,null,"Sonstige Antritte"]
[null,null,null," Datum","Antr.","Bahn","1. Spiel","2. Spiel","3. Spiel","3. er Serie","3. er Ø",null," Datum - Turnier",null,null,null,null,"4.er Erg.","6.er Erg.","Schnitt","Ges. Pins","Spiele"]
[null,null,null,{"$f":"+'Spielbogen 8er'!P4","v":"2024-09-12"},1,{"$f":"+'Spielbogen 8er'!N4","v":"OT"},202,177,130,{"$f":"IF(G12>1,+G12+H12+I12,\"\")","v":509},{"$f":"IF(G12>1,SUM(G12:I12)/3,\" \")","v":169.66666666666666},null,{"$f":"+'Anmeldegruppen Turniere'!T8&\" - \"&W12","v":"07. / 08. Sep. 24 - Eröffnungs Doppel"},null,null,null,null,null,877,{"$f":"IF(S12>1,+S12/V12,\"\")","v":146.16666666666666},{"$f":"IF(S12>1,SUM($R$12:S12),\" \")","v":877},{"$f":"IF(S12>0,6,0)","v":6},"Eröffnungs Doppel"]
[null,null,null,{"$f":"+'Spielbogen 8er'!P5","v":"2024-09-26"},2,{"$f":"+'Spielbogen 8er'!N5","v":"OT"},null,null,null,""," ",null,{"$f":"+'Anmeldegruppen Turniere'!T11&\" - \"&W13","v":"12. / 13. Nov. 24 - 1. Antritt HH-Cup"},null,null,null,null,null,null,{"$f":"IF(R13>1,+R13/V13,\"\")","v":""},{"$f":"IF(R13>1,SUM($R$12:S13),\" \")","v":" "},{"$f":"IF(R13,4,0)","v":0},"1. Antritt HH-Cup"]
[null,null,null,{"$f":"+'Spielbogen 8er'!P6","v":"2024-10-10"},3,{"$f":"+'Spielbogen 8er'!N6","v":"WB"},133,135,155,423,141,null,{"$f":"+'Anmeldegruppen Turniere'!T12&\" - \"&W14","v":"26. / 27. Nov .24 - 2. Antritt HH-Cup"},null,null,null,null,null,null,{"$f":"IF(R14>1,+R14/V14,\"\")","v":""},{"$f":"IF(R14>1,SUM($R$12:S14),\" \")","v":" "},{"$f":"IF(R14,4,0)","v":0},"2. Antritt HH-Cup"]
[null,null,null,{"$f":"+'Spielbogen 8er'!P7","v":"2024-10-24"},4,{"$f":"+'Spielbogen 8er'!N7","v":"OT"},null,null,null,""," ",null,{"$f":"+'Hilfstabelle Mannschaften'!J12&\" - \"&W15","v":"16. / 17. Nov. 24 - Herbst-Mix"},null,null,null,null,null,null,{"$f":"IF(R15>1,+R15/V15,\"\")","v":""},{"$f":"IF(R15>1,SUM($R$12:S15),\" \")","v":" "},{"$f":"IF(R15,4,0)","v":0},"Herbst-Mix"]
[null,null,null,{"$f":"+'Spielbogen 8er'!P8","v":"2024-11-07"},5,{"$f":"+'Spielbogen 8er'!N8","v":"WB"},109,114,156,379,126.33333333333333,null,{"$f":"+'Anmeldegruppen Turniere'!T21&\" - \"&W16","v":"18. / 19. Jan. 25 - 1. Antritt Einzel"},null,null,null,null,null,931,{"$f":"IF(S16>1,+S16/V16,\"\")","v":155.16666666666666},{"$f":"IF(S16>1,SUM($R$12:S16),\" \")","v":1808},{"$f":"IF(S16>0,6,0)","v":6},"1. Antritt Einzel"]
[null,null,null,{"$f":"+'Spielbogen 8er'!P9","v":"2025-01-16"},6,{"$f":"+'Spielbogen 8er'!N9","v":"WB"},null,null,null,""," ",null,{"$f":"+'Anmeldegruppen Turniere'!T22&\" - \"&W17","v":"01. / 02. Feb. 25 - 2. Antritt Einzel"},null,null,null,null,null,931,{"$f":"IF(S17>1,+S17/V17,\"\")","v":155.16666666666666},{"$f":"IF(S17>1,SUM($R$12:S17),\" \")","v":2739},{"$f":"IF(S17>0,6,0)","v":6},"2. Antritt Einzel"]
[null,null,null,{"$f":"+'Spielbogen 8er'!P10","v":"2025-01-30"},7,{"$f":"+'Spielbogen 8er'!N10","v":"OT"},null,null,null,""," ",null,{"$f":"+'Hilfstabelle Mannschaften'!J14&\" - \"&W18","v":"12. / 13. Mär, 25 - Frühjahrs-Mix"},null,null,null,null,557,null,{"$f":"IF(R18>1,+R18/V18,\"\")","v":139.25},{"$f":"IF(R18>1,SUM($R$12:S18),\" \")","v":3296},{"$f":"IF(R18,4,0)","v":4},"Frühjahrs-Mix"]
[null,null,null,{"$f":"+'Spielbogen 8er'!P11","v":"2025-02-13"},8,{"$f":"+'Spielbogen 8er'!N11","v":"WB"},153,151,169,473,157.66666666666666,null,{"$f":"+'Anmeldegruppen Turniere'!T29&\" - \"&W19","v":"12. / 13. Apr. 25 - 1. Antritt Doppel"},null,null,null,null,null,1024,{"$f":"IF(S19>1,+S19/V19,\"\")","v":170.66666666666666},{"$f":"IF(S19>1,SUM($R$12:S19),\" \")","v":4320},{"$f":"IF(S19>0,6,0)","v":6},"1. Antritt Doppel"]
[null,null,null,{"$f":"+'Spielbogen 8er'!P12","v":"2025-02-27"},9,{"$f":"+'Spielbogen 8er'!N12","v":"OT"},161,140,155,456,{"$f":"IF(G20>1,SUM(G20:I20)/3,\" \")","v":152},null,{"$f":"+'Anmeldegruppen Turniere'!T30&\" - \"&W20","v":"10. / 11. Mai  25 - 2. Antritt Doppel"},null,null,null,null,null,974,{"$f":"IF(S20>1,+S20/V20,\"\")","v":162.33333333333334},{"$f":"IF(S20>1,SUM($R$12:S20),\" \")","v":5294},{"$f":"IF(S20>0,6,0)","v":6},"2. Antritt Doppel"]
[null,null,null,{"$f":"+'Spielbogen 8er'!P13","v":"2025-03-13"},10,{"$f":"+'Spielbogen 8er'!N13","v":"WB"},null,null,null,"",{"$f":"IF(G21>1,SUM(G21:I21)/3,\" \")","v":" "}]
[null,null,null,{"$f":"+'Spielbogen 8er'!P14","v":"2025-03-27"},11,{"$f":"+'Spielbogen 8er'!N14","v":"OT"},null,null,null,""," ",null,null,null,null,null,null,"Ges. Pins","Spiele","Schnitt"]
[null,null,null,{"$f":"+'Spielbogen 8er'!P15","v":"2025-04-10"},12,{"$f":"+'Spielbogen 8er'!N15","v":"WB"},null,null,null,""," ",null,null,null,"Schnitt HH-Cup",null,null,{"$f":"IF(R13>0,SUM(R13:R14),\"\")","v":""},{"$f":"IF(R13>0,SUM(V13:V14),\"\")","v":""},{"$f":"IF(R13>0,SUM(R13:R14)/SUM(V13:V14),\"\")","v":""}]
[null,null,null,{"$f":"+'Spielbogen 8er'!P16","v":"2025-04-24"},13,{"$f":"+'Spielbogen 8er'!N16","v":"OT"},null,null,null,""," ",null,null,null,"Schnitt Einzel",null,null,{"$f":"IF(S16>0,SUM(S16:S17),\"\")","v":1862},{"$f":"IF(S16>0,SUM(V16:V17),\"\")","v":12},{"$f":"IF(S16>0,SUM(S16:S17)/SUM(V16:V17),\"\")","v":155.16666666666666}]
[null,null,null,{"$f":"+'Spielbogen 8er'!P17","v":"2025-05-08"},14,{"$f":"+'Spielbogen 8er'!N17","v":"WB"},null,null,null,{"$f":"IF(G25>1,+G25+H25+I25,\"\")","v":""},{"$f":"IF(G25>1,SUM(G25:I25)/3,\" \")","v":" "},null,null,null,"Schnitt Doppel",null,null,{"$f":"IF(S19>0,SUM(S19:S20),\"\")","v":1998},{"$f":"IF(S19>0,SUM(V19:V20),\"\")","v":12},{"$f":"IF(S19>0,SUM(S19:S20)/SUM(V19:V20),\"\")","v":166.5}]
[null,null,null,{"$f":"+\"Ausgeholfen in der 1. Mannschaft                                                     Anzahl Spiele:\"&\" \"&+COUNT(G27:I30)","v":"Ausgeholfen in der 1. Mannschaft                                                     Anzahl Spiele: 0"}]
[null,null,null,null,null,null,null,null,null,{"$f":"IF(G27>1,+G27+H27+I27,\"\")","v":""},{"$f":"IF(G27>1,SUM(G27:I27)/3,\" \")","v":" "}]
[null,null,null,null,null,null,null,null,null,{"$f":"IF(G28>1,+G28+H28+I28,\"\")","v":""},{"$f":"IF(G28>1,SUM(G28:I28)/3,\" \")","v":" "}]
[null,null,null,null,null,null,null,null,null,{"$f":"IF(G29>1,+G29+H29+I29,\"\")","v":""},{"$f":"IF(G29>1,SUM(G29:I29)/3,\" \")","v":" "}]
[null,null,null,null,null,null,null,null,null,{"$f":"IF(G30>1,+G30+H30+I30,\"\")","v":""},{"$f":"IF(G30>1,SUM(G30:I30)/3,\" \")","v":" "}]
[null,null,null,null,null,null,null,null,null,{"$f":"IF(G31>1,+G31+H31+I31,\"\")","v":""},{"$f":"IF(G31>1,SUM(G31:I31)/3,\" \")","v":" "}]

{"sheet":"Michael W.","index":9,"n_rows":25,"n_cols":23,"rows_kept":25,"cut":false,"hidden":false,"merged":[[5,16,5,18],[15,12,15,16],[16,12,16,16],[17,12,17,16],[1,6,1,18],[6,16,6,17],[9,3,9,10],[7,3,7,5],[5,3,5,5],[6,3,6,5],[5,11,5,12],[4,9,4,14],[2,3,2,7],[22,14,22,16],[23,14,23,16],[24,14,24,16],[2,9,2,13],[4,4,4,5],[6,11,6,12],[7,11,7,12],[9,12,9,21],[4,16,4,21],[6,19,6,20],[5,19,5,21],[7,16,7,17],[7,19,7,20],[10,12,10,16],[11,12,11,16],[12,12,12,16],[18,12,18,16],[19,12,19,16],[12,22,12,23],[13,22,13,23],[14,22,14,23],[15,22,15,23],[16,22,16,23],[17,22,17,23],[18,22,18,23],[19,22,19,23],[13,12,13,16],[14,12,14,16]]}
[null,"Start"]
[null,"Rangliste",null,null,null,null,{"$f":"+'Hilfstabelle Mannschaften'!H8&\" \"&+'Hilfstabelle Mannschaften'!I8","v":"PUNKTSPIELSAISON  2024/2025"}]
[null,null,null,{"$f":"+'Hilfstabelle Spieler'!A14","v":"Michael Wetzel"}]
[]
[null,null,null,"Pass.-Nr.:",{"$f":"VLOOKUP(D3,'Hilfstabelle Spieler'!A6:B19,2,0)","v":22113},null,"Pins","Spiele","Schnitt","Ligaergebnisse",null,null,null,null,null,null,"Sonstige Antritte:"]
[null,null,null,"Ligaergebnisse:",null,null,{"$f":"IF(SUM(J12:J25)>1,SUM(J12:J25),\" \")","v":2099},{"$f":"COUNT(G12:I25)","v":12},{"$f":"IF(SUM(G12:I25)>1,SUM(G6/H6),\" \")","v":174.91666666666666},"MAX.","MIN.","MAX.",null,"MIN.","Schnitt",null,"4.er Serie:",null,null,"6.er Serie:"]
[null,null,null,"Sonstige Antritte:",null,null,{"$f":"IF(SUM(R12:S19)>1,SUM(R12:S20),\" \")","v":2851},{"$f":"IF(SUM(R12:S19)>1,SUM(V12:V20),\" \")","v":16},{"$f":"IF(SUM(R12:S19)>1,G7/H7,\" \")","v":178.1875},"ERG.","ERG.","3.ER",null,"3.ER","3.ER",null,"Höchstes 4.er Erg. :",null,{"$f":"MAX(R13:R18)","v":721},"Höchstes 6.er Erg. :",null,{"$f":"MAX(S12:S20)","v":1090}]
[null,null,null,"GESAMTSCHNITT:",null,null,{"$f":"IF(SUM(G6:G7)>1,SUM(G6:G7),\" \")","v":4950},{"$f":"IF(SUM(H6:H7)>1,SUM(H6:H7),\" \")","v":28},{"$f":"IF(SUM(G8)>1,SUM(G8/H8),\" \")","v":176.78571428571428},{"$f":"MAX(G12:I25)","v":227},{"$f":"IF(SUM(G12:I25)<1,\" \",MIN(G12:I25))","v":133},{"$f":"MAX(J12:J25)","v":600},null,{"$f":"IF(SUM(G12:J25)>1,MIN(J12:J25),\" \")","v":471},{"$f":"IF(J8>0,AVERAGE(J12:J30),\"\")","v":524.75},null,"Höchste Einzel-Erg. :",null,212,"Höchste Einzel-Erg. :",null,227]
[]
[null,null,null,"         Einzelspielergebnisse Liga",null,null,null,null,null,null,null,null,"Sonstige Antritte"]
[null,null,null," Datum","Antr.","Bahn","1. Spiel","2. Spiel","3. Spiel","3. er Serie","3. er Ø",null," Datum - Turnier",null,null,null,null,"4.er Erg.","6.er Erg.","Schnitt","Ges. Pins","Spiele"]
[null,null,null,{"$f":"+'Spielbogen 8er'!P4","v":"2024-09-12"},1,{"$f":"+'Spielbogen 8er'!N4","v":"OT"},168,171,167,{"$f":"IF(G12>1,+G12+H12+I12,\"\")","v":506},{"$f":"IF(G12>1,SUM(G12:I12)/3,\" \")","v":168.66666666666666},null,{"$f":"+'Anmeldegruppen Turniere'!T8&\" - \"&W12","v":"07. / 08. Sep. 24 - Eröffnungs Doppel"},null,null,null,null,null,null,{"$f":"IF(S12>1,+S12/V12,\"\")","v":""},{"$f":"IF(S12>1,SUM($R$12:S12),\" \")","v":" "},{"$f":"IF(S12>0,6,0)","v":0},"Eröffnungs Doppel"]
[null,null,null,{"$f":"+'Spielbogen 8er'!P5","v":"2024-09-26"},2,{"$f":"+'Spielbogen 8er'!N5","v":"OT"},null,null,null,""," ",null,{"$f":"+'Anmeldegruppen Turniere'!T11&\" - \"&W13","v":"12. / 13. Nov. 24 - 1. Antritt HH-Cup"},null,null,null,null,null,null,{"$f":"IF(R13>1,+R13/V13,\"\")","v":""},{"$f":"IF(R13>1,SUM($R$12:S13),\" \")","v":" "},{"$f":"IF(R13,4,0)","v":0},"1. Antritt HH-Cup"]
[null,null,null,{"$f":"+'Spielbogen 8er'!P6","v":"2024-10-10"},3,{"$f":"+'Spielbogen 8er'!N6","v":"WB"},194,179,227,600,200,null,{"$f":"+'Anmeldegruppen Turniere'!T12&\" - \"&W14","v":"26. / 27. Nov .24 - 2. Antritt HH-Cup"},null,null,null,null,null,null,{"$f":"IF(R14>1,+R14/V14,\"\")","v":""},{"$f":"IF(R14>1,SUM($R$12:S14),\" \")","v":" "},{"$f":"IF(R14,4,0)","v":0},"2. Antritt HH-Cup"]
[null,null,null,{"$f":"+'Spielbogen 8er'!P7","v":"2024-10-24"},4,{"$f":"+'Spielbogen 8er'!N7","v":"OT"},163,165,194,522,174,null,{"$f":"+'Hilfstabelle Mannschaften'!J12&\" - \"&W15","v":"16. / 17. Nov. 24 - Herbst-Mix"},null,null,null,null,null,null,{"$f":"IF(R15>1,+R15/V15,\"\")","v":""},{"$f":"IF(R15>1,SUM($R$12:S15),\" \")","v":" "},{"$f":"IF(R15,4,0)","v":0},"Herbst-Mix"]
[null,null,null,{"$f":"+'Spielbogen 8er'!P8","v":"2024-11-07"},5,{"$f":"+'Spielbogen 8er'!N8","v":"WB"},null,null,null,""," ",null,{"$f":"+'Anmeldegruppen Turniere'!T21&\" - \"&W16","v":"18. / 19. Jan. 25 - 1. Antritt Einzel"},null,null,null,null,null,null,{"$f":"IF(S16>1,+S16/V16,\"\")","v":""},{"$f":"IF(S16>1,SUM($R$12:S16),\" \")","v":" "},{"$f":"IF(S16>0,6,0)","v":0},"1. Antritt Einzel"]
[null,null,null,{"$f":"+'Spielbogen 8er'!P9","v":"2025-01-16"},6,{"$f":"+'Spielbogen 8er'!N9","v":"WB"},null,null,null,""," ",null,{"$f":"+'Anmeldegruppen Turniere'!T22&\" - \"&W17","v":"01. / 02. Feb. 25 - 2. Antritt Einzel"},null,null,null,null,null,null,{"$f":"IF(S17>1,+S17/V17,\"\")","v":""},{"$f":"IF(S17>1,SUM($R$12:S17),\" \")","v":" "},{"$f":"IF(S17>0,6,0)","v":0},"2. Antritt Einzel"]
[null,null,null,{"$f":"+'Spielbogen 8er'!P10","v":"2025-01-30"},7,{"$f":"+'Spielbogen 8er'!N10","v":"OT"},null,null,null,""," ",null,{"$f":"+'Hilfstabelle Mannschaften'!J14&\" - \"&W18","v":"12. / 13. Mär, 25 - Frühjahrs-Mix"},null,null,null,null,721,null,{"$f":"IF(R18>1,+R18/V18,\"\")","v":180.25},{"$f":"IF(R18>1,SUM($R$12:S18),\" \")","v":721},{"$f":"IF(R18,4,0)","v":4},"Frühjahrs-Mix"]
[null,null,null,{"$f":"+'Spielbogen 8er'!P11","v":"2025-02-13"},8,{"$f":"+'Spielbogen 8er'!N11","v":"WB"},null,null,null,""," ",null,{"$f":"+'Anmeldegruppen Turniere'!T29&\" - \"&W19","v":"12. / 13. Apr. 25 - 1. Antritt Doppel"},null,null,null,null,null,1090,{"$f":"IF(S19>1,+S19/V19,\"\")","v":181.66666666666666},{"$f":"IF(S19>1,SUM($R$12:S19),\" \")","v":1811},{"$f":"IF(S19>0,6,0)","v":6},"1. Antritt Doppel"]
[null,null,null,{"$f":"+'Spielbogen 8er'!P12","v":"2025-02-27"},9,{"$f":"+'Spielbogen 8er'!N12","v":"OT"},null,null,null,"",{"$f":"IF(G20>1,SUM(G20:I20)/3,\" \")","v":" "},null,{"$f":"+'Anmeldegruppen Turniere'!T30&\" - \"&W20","v":"10. / 11. Mai  25 - 2. Antritt Doppel"},null,null,null,null,null,1040,{"$f":"IF(S20>1,+S20/V20,\"\")","v":173.33333333333334},{"$f":"IF(S20>1,SUM($R$12:S20),\" \")","v":2851},{"$f":"IF(S20>0,6,0)","v":6},"2. Antritt Doppel"]
[null,null,null,{"$f":"+'Spielbogen 8er'!P13","v":"2025-03-13"},10,{"$f":"+'Spielbogen 8er'!N13","v":"WB"},null,null,null,"",{"$f":"IF(G21>1,SUM(G21:I21)/3,\" \")","v":" "}]
[null,null,null,{"$f":"+'Spielbogen 8er'!P14","v":"2025-03-27"},11,{"$f":"+'Spielbogen 8er'!N14","v":"OT"},null,null,null,""," ",null,null,null,null,null,null,"Ges. Pins","Spiele","Schnitt"]
[null,null,null,{"$f":"+'Spielbogen 8er'!P15","v":"2025-04-10"},12,{"$f":"+'Spielbogen 8er'!N15","v":"WB"},null,null,null,""," ",null,null,null,"Schnitt HH-Cup",null,null,{"$f":"IF(R13>0,SUM(R13:R14),\"\")","v":""},{"$f":"IF(R13>0,SUM(V13:V14),\"\")","v":""},{"$f":"IF(R13>0,SUM(R13:R14)/SUM(V13:V14),\"\")","v":""}]
[null,null,null,{"$f":"+'Spielbogen 8er'!P16","v":"2025-04-24"},13,{"$f":"+'Spielbogen 8er'!N16","v":"OT"},160,133,178,471,157,null,null,null,"Schnitt Einzel",null,null,{"$f":"IF(S16>0,SUM(S16:S17),\"\")","v":""},{"$f":"IF(S16>0,SUM(V16:V17),\"\")","v":""},{"$f":"IF(S16>0,SUM(S16:S17)/SUM(V16:V17),\"\")","v":""}]
[null,null,null,{"$f":"+'Spielbogen 8er'!P17","v":"2025-05-08"},14,{"$f":"+'Spielbogen 8er'!N17","v":"WB"},null,null,null,{"$f":"IF(G25>1,+G25+H25+I25,\"\")","v":""},{"$f":"IF(G25>1,SUM(G25:I25)/3,\" \")","v":" "},null,null,null,"Schnitt Doppel",null,null,{"$f":"IF(S19>0,SUM(S19:S20),\"\")","v":2130},{"$f":"IF(S19>0,SUM(V19:V20),\"\")","v":12},{"$f":"IF(S19>0,SUM(S19:S20)/SUM(V19:V20),\"\")","v":177.5}]

{"sheet":"Mario J.","index":10,"n_rows":25,"n_cols":23,"rows_kept":25,"cut":false,"hidden":false,"merged":[[1,6,1,18],[9,3,9,10],[7,3,7,5],[5,3,5,5],[6,3,6,5],[9,12,9,21],[4,16,4,21],[5,11,5,12],[6,11,6,12],[7,11,7,12],[6,16,6,17],[5,19,5,21],[7,16,7,17],[7,19,7,20],[6,19,6,20],[4,9,4,14],[22,14,22,16],[23,14,23,16],[24,14,24,16],[2,9,2,13],[4,4,4,5],[2,3,2,7],[5,16,5,18],[10,12,10,16],[11,12,11,16],[12,12,12,16],[13,12,13,16],[14,12,14,16],[15,12,15,16],[16,12,16,16],[17,12,17,16],[18,12,18,16],[19,12,19,16],[17,22,17,23],[18,22,18,23],[19,22,19,23],[12,22,12,23],[13,22,13,23],[14,22,14,23],[15,22,15,23],[16,22,16,23]]}
[null,"Start"]
[null,"Rangliste",null,null,null,null,{"$f":"+'Hilfstabelle Mannschaften'!H8&\" \"&+'Hilfstabelle Mannschaften'!I8","v":"PUNKTSPIELSAISON  2024/2025"}]
[null,null,null,{"$f":"+'Hilfstabelle Spieler'!A12","v":"Mario Jurk"}]
[]
[null,null,null,"Pass.-Nr.:",{"$f":"VLOOKUP(D3,'Hilfstabelle Spieler'!A6:B19,2,0)","v":23302},null,"Pins","Spiele","Schnitt","Ligaergebnisse",null,null,null,null,null,null,"Sonstige Antritte:"]
[null,null,null,"Ligaergebnisse:",null,null,{"$f":"IF(SUM(J12:J25)>1,SUM(J12:J25),\" \")","v":3245},{"$f":"COUNT(G12:I25)","v":18},{"$f":"IF(SUM(G12:I25)>1,SUM(G6/H6),\" \")","v":180.27777777777777},"MAX.","MIN.","MAX.",null,"MIN.","Schnitt",null,"4.er Serie:",null,null,"6.er Serie:"]
[null,null,null,"Sonstige Antritte:",null,null,{"$f":"IF(SUM(R12:S19)>1,SUM(R12:S20),\" \")","v":" "},{"$f":"IF(SUM(R12:S19)>1,SUM(V12:V20),\" \")","v":" "},{"$f":"IF(SUM(R12:S20)>1,G7/H7,\" \")","v":" "},"ERG.","ERG.","3.ER",null,"3.ER","3.ER",null,"Höchstes 4.er Erg. :",null,{"$f":"MAX(R13:R18)","v":0},"Höchstes 6.er Erg. :"]
[null,null,null,"GESAMTSCHNITT:",null,null,{"$f":"IF(SUM(G6:G7)>1,SUM(G6:G7),\" \")","v":3245},{"$f":"IF(SUM(H6:H7)>1,SUM(H6:H7),\" \")","v":18},{"$f":"IF(SUM(G8)>1,SUM(G8/H8),\" \")","v":180.27777777777777},{"$f":"MAX(G12:I25)","v":245},{"$f":"IF(SUM(G12:I25)<1,\" \",MIN(G12:I25))","v":154},{"$f":"MAX(J12:J25)","v":628},null,{"$f":"IF(SUM(G12:J25)>1,MIN(J12:J25),\" \")","v":478},{"$f":"IF(J8>0,AVERAGE(J12:J30),\"\")","v":540.83333333333337},null,"Höchste Einzel-Erg. :",null,null,"Höchste Einzel-Erg. :"]
[]
[null,null,null,"         Einzelspielergebnisse Liga",null,null,null,null,null,null,null,null,"Sonstige Antritte"]
[null,null,null," Datum","Antr.","Bahn","1. Spiel","2. Spiel","3. Spiel","3. er Serie","3. er Ø",null," Datum - Turnier",null,null,null,null,"4.er Erg.","6.er Erg.","Schnitt","Ges. Pins","Spiele"]
[null,null,null,{"$f":"+'Spielbogen 8er'!P4","v":"2024-09-12"},1,{"$f":"+'Spielbogen 8er'!N4","v":"OT"},null,null,null,{"$f":"IF(G12>1,+G12+H12+I12,\"\")","v":""},{"$f":"IF(G12>1,SUM(G12:I12)/3,\" \")","v":" "},null,{"$f":"+'Anmeldegruppen Turniere'!T8&\" - \"&W12","v":"07. / 08. Sep. 24 - Eröffnungs Doppel"},null,null,null,null,null,null,{"$f":"IF(S12>1,+S12/V12,\"\")","v":""},{"$f":"IF(S12>1,SUM($R$12:S12),\" \")","v":" "},{"$f":"IF(S12>0,6,0)","v":0},"Eröffnungs Doppel"]
[null,null,null,{"$f":"+'Spielbogen 8er'!P5","v":"2024-09-26"},2,{"$f":"+'Spielbogen 8er'!N5","v":"OT"},164,197,194,555,185,null,{"$f":"+'Anmeldegruppen Turniere'!T11&\" - \"&W13","v":"12. / 13. Nov. 24 - 1. Antritt HH-Cup"},null,null,null,null,null,null,{"$f":"IF(R13>1,+R13/V13,\"\")","v":""},{"$f":"IF(R13>1,SUM($R$12:S13),\" \")","v":" "},{"$f":"IF(R13,4,0)","v":0},"1. Antritt HH-Cup"]
[null,null,null,{"$f":"+'Spielbogen 8er'!P6","v":"2024-10-10"},3,{"$f":"+'Spielbogen 8er'!N6","v":"WB"},null,null,null,""," ",null,{"$f":"+'Anmeldegruppen Turniere'!T12&\" - \"&W14","v":"26. / 27. Nov .24 - 2. Antritt HH-Cup"},null,null,null,null,null,null,{"$f":"IF(R14>1,+R14/V14,\"\")","v":""},{"$f":"IF(R14>1,SUM($R$12:S14),\" \")","v":" "},{"$f":"IF(R14,4,0)","v":0},"2. Antritt HH-Cup"]
[null,null,null,{"$f":"+'Spielbogen 8er'!P7","v":"2024-10-24"},4,{"$f":"+'Spielbogen 8er'!N7","v":"OT"},null,null,null,""," ",null,{"$f":"+'Hilfstabelle Mannschaften'!J12&\" - \"&W15","v":"16. / 17. Nov. 24 - Herbst-Mix"},null,null,null,null,null,null,{"$f":"IF(R15>1,+R15/V15,\"\")","v":""},{"$f":"IF(R15>1,SUM($R$12:S15),\" \")","v":" "},{"$f":"IF(R15,4,0)","v":0},"Herbst-Mix"]
[null,null,null,{"$f":"+'Spielbogen 8er'!P8","v":"2024-11-07"},5,{"$f":"+'Spielbogen 8er'!N8","v":"WB"},243,155,170,568,189.33333333333334,null,{"$f":"+'Anmeldegruppen Turniere'!T21&\" - \"&W16","v":"18. / 19. Jan. 25 - 1. Antritt Einzel"},null,null,null,null,null,null,{"$f":"IF(S16>1,+S16/V16,\"\")","v":""},{"$f":"IF(S16>1,SUM($R$12:S16),\" \")","v":" "},{"$f":"IF(S16>0,6,0)","v":0},"1. Antritt Einzel"]
[null,null,null,{"$f":"+'Spielbogen 8er'!P9","v":"2025-01-16"},6,{"$f":"+'Spielbogen 8er'!N9","v":"WB"},172,169,169,510,170,null,{"$f":"+'Anmeldegruppen Turniere'!T22&\" - \"&W17","v":"01. / 02. Feb. 25 - 2. Antritt Einzel"},null,null,null,null,null,null,{"$f":"IF(S17>1,+S17/V17,\"\")","v":""},{"$f":"IF(S17>1,SUM($R$12:S17),\" \")","v":" "},{"$f":"IF(S17>0,6,0)","v":0},"2. Antritt Einzel"]
[null,null,null,{"$f":"+'Spielbogen 8er'!P10","v":"2025-01-30"},7,{"$f":"+'Spielbogen 8er'!N10","v":"OT"},154,167,157,478,159.33333333333334,null,{"$f":"+'Hilfstabelle Mannschaften'!J14&\" - \"&W18","v":"12. / 13. Mär, 25 - Frühjahrs-Mix"},null,null,null,null,null,null,{"$f":"IF(R18>1,+R18/V18,\"\")","v":""},{"$f":"IF(R18>1,SUM($R$12:S18),\" \")","v":" "},{"$f":"IF(R18,4,0)","v":0},"Frühjahrs-Mix"]
[null,null,null,{"$f":"+'Spielbogen 8er'!P11","v":"2025-02-13"},8,{"$f":"+'Spielbogen 8er'!N11","v":"WB"},null,null,null,""," ",null,{"$f":"+'Anmeldegruppen Turniere'!T29&\" - \"&W19","v":"12. / 13. Apr. 25 - 1. Antritt Doppel"},null,null,null,null,null,null,{"$f":"IF(S19>1,+S19/V19,\"\")","v":""},{"$f":"IF(S19>1,SUM($R$12:S19),\" \")","v":" "},{"$f":"IF(S19>0,6,0)","v":0},"1. Antritt Doppel"]
[null,null,null,{"$f":"+'Spielbogen 8er'!P12","v":"2025-02-27"},9,{"$f":"+'Spielbogen 8er'!N12","v":"OT"},158,165,183,506,{"$f":"IF(G20>1,SUM(G20:I20)/3,\" \")","v":168.66666666666666},null,{"$f":"+'Anmeldegruppen Turniere'!T30&\" - \"&W20","v":"10. / 11. Mai  25 - 2. Antritt Doppel"},null,null,null,null,null,null,{"$f":"IF(S20>1,+S20/V20,\"\")","v":""},{"$f":"IF(S20>1,SUM($R$12:S20),\" \")","v":" "},{"$f":"IF(S20>0,6,0)","v":0},"2. Antritt Doppel"]
[null,null,null,{"$f":"+'Spielbogen 8er'!P13","v":"2025-03-13"},10,{"$f":"+'Spielbogen 8er'!N13","v":"WB"},null,null,null,"",{"$f":"IF(G21>1,SUM(G21:I21)/3,\" \")","v":" "}]
[null,null,null,{"$f":"+'Spielbogen 8er'!P14","v":"2025-03-27"},11,{"$f":"+'Spielbogen 8er'!N14","v":"OT"},null,null,null,""," ",null,null,null,null,null,null,"Ges. Pins","Spiele","Schnitt"]
[null,null,null,{"$f":"+'Spielbogen 8er'!P15","v":"2025-04-10"},12,{"$f":"+'Spielbogen 8er'!N15","v":"WB"},null,null,null,""," ",null,null,null,"Schnitt HH-Cup",null,null,{"$f":"IF(R13>0,SUM(R13:R14),\"\")","v":""},{"$f":"IF(R13>0,SUM(V13:V14),\"\")","v":""},{"$f":"IF(R13>0,SUM(R13:R14)/SUM(V13:V14),\"\")","v":""}]
[null,null,null,{"$f":"+'Spielbogen 8er'!P16","v":"2025-04-24"},13,{"$f":"+'Spielbogen 8er'!N16","v":"OT"},null,null,null,""," ",null,null,null,"Schnitt Einzel",null,null,{"$f":"IF(S16>0,SUM(S16:S17),\"\")","v":""},{"$f":"IF(S16>0,SUM(V16:V17),\"\")","v":""},{"$f":"IF(S16>0,SUM(S16:S17)/SUM(V16:V17),\"\")","v":""}]
[null,null,null,{"$f":"+'Spielbogen 8er'!P17","v":"2025-05-08"},14,{"$f":"+'Spielbogen 8er'!N17","v":"WB"},214,245,169,628,209.33333333333334,null,null,null,"Schnitt Doppel",null,null,{"$f":"IF(S19>0,SUM(S19:S20),\"\")","v":""},{"$f":"IF(S19>0,SUM(V19:V20),\"\")","v":""},{"$f":"IF(S19>0,SUM(S19:S20)/SUM(V19:V20),\"\")","v":""}]

{"sheet":"Kai R.","index":11,"n_rows":25,"n_cols":23,"rows_kept":25,"cut":false,"hidden":false,"merged":[[1,6,1,18],[9,3,9,10],[7,3,7,5],[5,3,5,5],[6,3,6,5],[9,12,9,21],[4,16,4,21],[5,11,5,12],[6,11,6,12],[7,11,7,12],[6,16,6,17],[5,19,5,21],[7,16,7,17],[7,19,7,20],[6,19,6,20],[4,9,4,14],[22,14,22,16],[23,14,23,16],[24,14,24,16],[2,9,2,13],[4,4,4,5],[2,3,2,7],[5,16,5,18],[10,12,10,16],[11,12,11,16],[12,12,12,16],[13,12,13,16],[14,12,14,16],[15,12,15,16],[16,12,16,16],[17,12,17,16],[18,12,18,16],[19,12,19,16],[17,22,17,23],[18,22,18,23],[19,22,19,23],[12,22,12,23],[13,22,13,23],[14,22,14,23],[15,22,15,23],[16,22,16,23]]}
[null,"Start"]
[null,"Rangliste",null,null,null,null,{"$f":"+'Hilfstabelle Mannschaften'!H8&\" \"&+'Hilfstabelle Mannschaften'!I8","v":"PUNKTSPIELSAISON  2024/2025"}]
[null,null,null,{"$f":"+'Hilfstabelle Spieler'!A11","v":"Kai Roßberg"}]
[]
[null,null,null,"Pass.-Nr.:",{"$f":"VLOOKUP(D3,'Hilfstabelle Spieler'!A6:B19,2,0)","v":21889},null,"Pins","Spiele","Schnitt","Ligaergebnisse",null,null,null,null,null,null,"Sonstige Antritte:"]
[null,null,null,"Ligaergebnisse:",null,null,{"$f":"IF(SUM(J12:J25)>1,SUM(J12:J25),\" \")","v":6459},{"$f":"COUNT(G12:I25)","v":36},{"$f":"IF(SUM(G12:I25)>1,SUM(G6/H6),\" \")","v":179.41666666666666},"MAX.","MIN.","MAX.",null,"MIN.","Schnitt",null,"4.er Serie:",null,null,"6.er Serie:"]
[null,null,null,"Sonstige Antritte:",null,null,{"$f":"IF(SUM(R12:S19)>1,SUM(R12:S20),\" \")","v":" "},{"$f":"IF(SUM(R12:S19)>1,SUM(V12:V20),\" \")","v":" "},{"$f":"IF(SUM(R12:S19)>1,G7/H7,\" \")","v":" "},"ERG.","ERG.","3.ER",null,"3.ER","3.ER",null,"Höchstes 4.er Erg. :",null,{"$f":"MAX(R13:R18)","v":0},"Höchstes 6.er Erg. :"]
[null,null,null,"GESAMTSCHNITT:",null,null,{"$f":"IF(SUM(G6:G7)>1,SUM(G6:G7),\" \")","v":6459},{"$f":"IF(SUM(H6:H7)>1,SUM(H6:H7),\" \")","v":36},{"$f":"IF(SUM(G8)>1,SUM(G8/H8),\" \")","v":179.41666666666666},{"$f":"MAX(G12:I25)","v":246},{"$f":"IF(SUM(G12:I25)<1,\" \",MIN(G12:I25))","v":128},{"$f":"MAX(J12:J25)","v":610},null,{"$f":"IF(SUM(G12:J25)>1,MIN(J12:J25),\" \")","v":484},{"$f":"IF(J8>0,AVERAGE(J12:J30),\"\")","v":538.25},null,"Höchste Einzel-Erg. :",null,null,"Höchste Einzel-Erg. :"]
[]
[null,null,null,"         Einzelspielergebnisse Liga",null,null,null,null,null,null,null,null,"Sonstige Antritte"]
[null,null,null," Datum","Antr.","Bahn","1. Spiel","2. Spiel","3. Spiel","3. er Serie","3. er Ø",null," Datum - Turnier",null,null,null,null,"4.er Erg.","6.er Erg.","Schnitt","Ges. Pins","Spiele"]
[null,null,null,{"$f":"+'Spielbogen 8er'!P4","v":"2024-09-12"},1,{"$f":"+'Spielbogen 8er'!N4","v":"OT"},160,184,169,{"$f":"IF(G12>1,+G12+H12+I12,\"\")","v":513},{"$f":"IF(G12>1,SUM(G12:I12)/3,\" \")","v":171},null,{"$f":"+'Anmeldegruppen Turniere'!T8&\" - \"&W12","v":"07. / 08. Sep. 24 - Eröffnungs Doppel"},null,null,null,null,null,null,{"$f":"IF(S12>1,+S12/V12,\"\")","v":""},{"$f":"IF(S12>1,SUM($R$12:S12),\" \")","v":" "},{"$f":"IF(S12>0,6,0)","v":0},"Eröffnungs Doppel"]
[null,null,null,{"$f":"+'Spielbogen 8er'!P5","v":"2024-09-26"},2,{"$f":"+'Spielbogen 8er'!N5","v":"OT"},181,149,246,576,192,null,{"$f":"+'Anmeldegruppen Turniere'!T11&\" - \"&W13","v":"12. / 13. Nov. 24 - 1. Antritt HH-Cup"},null,null,null,null,null,null,{"$f":"IF(R13>1,+R13/V13,\"\")","v":""},{"$f":"IF(R13>1,SUM($R$12:S13),\" \")","v":" "},{"$f":"IF(R13,4,0)","v":0},"1. Antritt HH-Cup"]
[null,null,null,{"$f":"+'Spielbogen 8er'!P6","v":"2024-10-10"},3,{"$f":"+'Spielbogen 8er'!N6","v":"WB"},147,179,200,526,175.33333333333334,null,{"$f":"+'Anmeldegruppen Turniere'!T12&\" - \"&W14","v":"26. / 27. Nov .24 - 2. Antritt HH-Cup"},null,null,null,null,null,null,{"$f":"IF(R14>1,+R14/V14,\"\")","v":""},{"$f":"IF(R14>1,SUM($R$12:S14),\" \")","v":" "},{"$f":"IF(R14,4,0)","v":0},"2. Antritt HH-Cup"]
[null,null,null,{"$f":"+'Spielbogen 8er'!P7","v":"2024-10-24"},4,{"$f":"+'Spielbogen 8er'!N7","v":"OT"},null,null,null,""," ",null,{"$f":"+'Hilfstabelle Mannschaften'!J12&\" - \"&W15","v":"16. / 17. Nov. 24 - Herbst-Mix"},null,null,null,null,null,null,{"$f":"IF(R15>1,+R15/V15,\"\")","v":""},{"$f":"IF(R15>1,SUM($R$12:S15),\" \")","v":" "},{"$f":"IF(R15,4,0)","v":0},"Herbst-Mix"]
[null,null,null,{"$f":"+'Spielbogen 8er'!P8","v":"2024-11-07"},5,{"$f":"+'Spielbogen 8er'!N8","v":"WB"},208,185,163,556,185.33333333333334,null,{"$f":"+'Anmeldegruppen Turniere'!T21&\" - \"&W16","v":"18. / 19. Jan. 25 - 1. Antritt Einzel"},null,null,null,null,null,null,{"$f":"IF(S16>1,+S16/V16,\"\")","v":""},{"$f":"IF(S16>1,SUM($R$12:S16),\" \")","v":" "},{"$f":"IF(S16>0,6,0)","v":0},"1. Antritt Einzel"]
[null,null,null,{"$f":"+'Spielbogen 8er'!P9","v":"2025-01-16"},6,{"$f":"+'Spielbogen 8er'!N9","v":"WB"},178,195,194,567,189,null,{"$f":"+'Anmeldegruppen Turniere'!T22&\" - \"&W17","v":"01. / 02. Feb. 25 - 2. Antritt Einzel"},null,null,null,null,null,null,{"$f":"IF(S17>1,+S17/V17,\"\")","v":""},{"$f":"IF(S17>1,SUM($R$12:S17),\" \")","v":" "},{"$f":"IF(S17>0,6,0)","v":0},"2. Antritt Einzel"]
[null,null,null,{"$f":"+'Spielbogen 8er'!P10","v":"2025-01-30"},7,{"$f":"+'Spielbogen 8er'!N10","v":"OT"},152,174,182,508,169.33333333333334,null,{"$f":"+'Hilfstabelle Mannschaften'!J14&\" - \"&W18","v":"12. / 13. Mär, 25 - Frühjahrs-Mix"},null,null,null,null,null,null,{"$f":"IF(R18>1,+R18/V18,\"\")","v":""},{"$f":"IF(R18>1,SUM($R$12:S18),\" \")","v":" "},{"$f":"IF(R18,4,0)","v":0},"Frühjahrs-Mix"]
[null,null,null,{"$f":"+'Spielbogen 8er'!P11","v":"2025-02-13"},8,{"$f":"+'Spielbogen 8er'!N11","v":"WB"},179,201,183,563,187.66666666666666,null,{"$f":"+'Anmeldegruppen Turniere'!T29&\" - \"&W19","v":"12. / 13. Apr. 25 - 1. Antritt Doppel"},null,null,null,null,null,null,{"$f":"IF(S19>1,+S19/V19,\"\")","v":""},{"$f":"IF(S19>1,SUM($R$12:S19),\" \")","v":" "},{"$f":"IF(S19>0,6,0)","v":0},"1. Antritt Doppel"]
[null,null,null,{"$f":"+'Spielbogen 8er'!P12","v":"2025-02-27"},9,{"$f":"+'Spielbogen 8er'!N12","v":"OT"},null,null,null,"",{"$f":"IF(G20>1,SUM(G20:I20)/3,\" \")","v":" "},null,{"$f":"+'Anmeldegruppen Turniere'!T30&\" - \"&W20","v":"10. / 11. Mai  25 - 2. Antritt Doppel"},null,null,null,null,null,null,{"$f":"IF(S20>1,+S20/V20,\"\")","v":""},{"$f":"IF(S20>1,SUM($R$12:S20),\" \")","v":" "},{"$f":"IF(S20>0,6,0)","v":0},"2. Antritt Doppel"]
[null,null,null,{"$f":"+'Spielbogen 8er'!P13","v":"2025-03-13"},10,{"$f":"+'Spielbogen 8er'!N13","v":"WB"},188,236,186,610,{"$f":"IF(G21>1,SUM(G21:I21)/3,\" \")","v":203.33333333333334}]
[null,null,null,{"$f":"+'Spielbogen 8er'!P14","v":"2025-03-27"},11,{"$f":"+'Spielbogen 8er'!N14","v":"OT"},154,201,154,509,169.66666666666666,null,null,null,null,null,null,"Ges. Pins","Spiele","Schnitt"]
[null,null,null,{"$f":"+'Spielbogen 8er'!P15","v":"2025-04-10"},12,{"$f":"+'Spielbogen 8er'!N15","v":"WB"},146,148,190,484,161.33333333333334,null,null,null,"Schnitt HH-Cup",null,null,{"$f":"IF(R13>0,SUM(R13:R14),\"\")","v":""},{"$f":"IF(R13>0,SUM(V13:V14),\"\")","v":""},{"$f":"IF(R13>0,SUM(R13:R14)/SUM(V13:V14),\"\")","v":""}]
[null,null,null,{"$f":"+'Spielbogen 8er'!P16","v":"2025-04-24"},13,{"$f":"+'Spielbogen 8er'!N16","v":"OT"},198,179,172,549,183,null,null,null,"Schnitt Einzel",null,null,{"$f":"IF(S16>0,SUM(S16:S17),\"\")","v":""},{"$f":"IF(S16>0,SUM(V16:V17),\"\")","v":""},{"$f":"IF(S16>0,SUM(S16:S17)/SUM(V16:V17),\"\")","v":""}]
[null,null,null,{"$f":"+'Spielbogen 8er'!P17","v":"2025-05-08"},14,{"$f":"+'Spielbogen 8er'!N17","v":"WB"},128,198,172,{"$f":"IF(G25>1,+G25+H25+I25,\"\")","v":498},{"$f":"IF(G25>1,SUM(G25:I25)/3,\" \")","v":166},null,null,null,"Schnitt Doppel",null,null,{"$f":"IF(S19>0,SUM(S19:S20),\"\")","v":""},{"$f":"IF(S19>0,SUM(V19:V20),\"\")","v":""},{"$f":"IF(S19>0,SUM(S19:S20)/SUM(V19:V20),\"\")","v":""}]

{"sheet":"Frank N.","index":12,"n_rows":25,"n_cols":23,"rows_kept":25,"cut":false,"hidden":false,"merged":[[1,6,1,18],[9,3,9,10],[7,3,7,5],[5,3,5,5],[6,3,6,5],[9,12,9,21],[4,16,4,21],[5,11,5,12],[6,11,6,12],[7,11,7,12],[6,16,6,17],[5,19,5,21],[7,16,7,17],[7,19,7,20],[6,19,6,20],[4,9,4,14],[22,14,22,16],[23,14,23,16],[24,14,24,16],[2,9,2,13],[4,4,4,5],[2,3,2,7],[5,16,5,18],[10,12,10,16],[11,12,11,16],[12,12,12,16],[13,12,13,16],[14,12,14,16],[15,12,15,16],[16,12,16,16],[17,12,17,16],[18,12,18,16],[19,12,19,16],[17,22,17,23],[18,22,18,23],[19,22,19,23],[12,22,12,23],[13,22,13,23],[14,22,14,23],[15,22,15,23],[16,22,16,23]]}
[null,"Start"]
[null,"Rangliste",null,null,null,null,{"$f":"+'Hilfstabelle Mannschaften'!H8&\" \"&+'Hilfstabelle Mannschaften'!I8","v":"PUNKTSPIELSAISON  2024/2025"}]
[null,null,null,{"$f":"+'Hilfstabelle Spieler'!A8","v":"Frank Nijholt"}]
[]
[null,null,null,"Pass.-Nr.:",{"$f":"VLOOKUP(D3,'Hilfstabelle Spieler'!A6:B19,2,0)","v":24774},null,"Pins","Spiele","Schnitt","Ligaergebnisse",null,null,null,null,null,null,"Sonstige Antritte:"]
[null,null,null,"Ligaergebnisse:",null,null,{"$f":"IF(SUM(J12:J26)>1,SUM(J12:J26),\" \")","v":2051},{"$f":"COUNT(G12:I25)","v":15},{"$f":"IF(SUM(G12:I25)>1,SUM(G6/H6),\" \")","v":136.73333333333332},"MAX.","MIN.","MAX.",null,"MIN.","Schnitt",null,"4.er Serie:",null,null,"6.er Serie:"]
[null,null,null,"Sonstige Antritte:",null,null,{"$f":"IF(SUM(R12:S19)>1,SUM(R12:S20),\" \")","v":" "},{"$f":"IF(SUM(R12:S19)>1,SUM(V12:V20),\" \")","v":" "},{"$f":"IF(SUM(R12:S19)>1,G7/H7,\" \")","v":" "},"ERG.","ERG.","3.ER",null,"3.ER","3.ER",null,"Höchstes 4.er Erg. :",null,{"$f":"MAX(R13:R18)","v":0},"Höchstes 6.er Erg. :"]
[null,null,null,"GESAMTSCHNITT:",null,null,{"$f":"IF(SUM(G6:G7)>1,SUM(G6:G7),\" \")","v":2051},{"$f":"IF(SUM(H6:H7)>1,SUM(H6:H7),\" \")","v":15},{"$f":"IF(SUM(G8)>1,SUM(G8/H8),\" \")","v":136.73333333333332},{"$f":"MAX(G12:I25)","v":180},{"$f":"IF(SUM(G12:I25)<1,\" \",MIN(G12:I25))","v":117},{"$f":"MAX(J12:J25)","v":431},null,{"$f":"IF(SUM(G12:J25)>1,MIN(J12:J25),\" \")","v":398},{"$f":"IF(J8>0,AVERAGE(J12:J30),\"\")","v":410.2},null,"Höchste Einzel-Erg. :",null,null,"Höchste Einzel-Erg. :"]
[]
[null,null,null,"         Einzelspielergebnisse Liga",null,null,null,null,null,null,null,null,"Sonstige Antritte"]
[null,null,null," Datum","Antr.","Bahn","1. Spiel","2. Spiel","3. Spiel","3. er Serie","3. er Ø",null," Datum - Turnier",null,null,null,null,"4.er Erg.","6.er Erg.","Schnitt","Ges. Pins","Spiele"]
[null,null,null,{"$f":"+'Spielbogen 8er'!P4","v":"2024-09-12"},1,{"$f":"+'Spielbogen 8er'!N4","v":"OT"},null,null,null,{"$f":"IF(G12>1,+G12+H12+I12,\"\")","v":""},{"$f":"IF(G12>1,SUM(G12:I12)/3,\" \")","v":" "},null,{"$f":"+'Anmeldegruppen Turniere'!T8&\" - \"&W12","v":"07. / 08. Sep. 24 - Eröffnungs Doppel"},null,null,null,null,null,null,{"$f":"IF(S12>1,+S12/V12,\"\")","v":""},{"$f":"IF(S12>1,SUM($R$12:S12),\" \")","v":" "},{"$f":"IF(S12>0,6,0)","v":0},"Eröffnungs Doppel"]
[null,null,null,{"$f":"+'Spielbogen 8er'!P5","v":"2024-09-26"},2,{"$f":"+'Spielbogen 8er'!N5","v":"OT"},null,null,null,""," ",null,{"$f":"+'Anmeldegruppen Turniere'!T11&\" - \"&W13","v":"12. / 13. Nov. 24 - 1. Antritt HH-Cup"},null,null,null,null,null,null,{"$f":"IF(R13>1,+R13/V13,\"\")","v":""},{"$f":"IF(R13>1,SUM($R$12:S13),\" \")","v":" "},{"$f":"IF(R13,4,0)","v":0},"1. Antritt HH-Cup"]
[null,null,null,{"$f":"+'Spielbogen 8er'!P6","v":"2024-10-10"},3,{"$f":"+'Spielbogen 8er'!N6","v":"WB"},null,null,null,""," ",null,{"$f":"+'Anmeldegruppen Turniere'!T12&\" - \"&W14","v":"26. / 27. Nov .24 - 2. Antritt HH-Cup"},null,null,null,null,null,null,{"$f":"IF(R14>1,+R14/V14,\"\")","v":""},{"$f":"IF(R14>1,SUM($R$12:S14),\" \")","v":" "},{"$f":"IF(R14,4,0)","v":0},"2. Antritt HH-Cup"]
[null,null,null,{"$f":"+'Spielbogen 8er'!P7","v":"2024-10-24"},4,{"$f":"+'Spielbogen 8er'!N7","v":"OT"},131,122,147,400,133.33333333333334,null,{"$f":"+'Hilfstabelle Mannschaften'!J12&\" - \"&W15","v":"16. / 17. Nov. 24 - Herbst-Mix"},null,null,null,null,null,null,{"$f":"IF(R15>1,+R15/V15,\"\")","v":""},{"$f":"IF(R15>1,SUM($R$12:S15),\" \")","v":" "},{"$f":"IF(R15,4,0)","v":0},"Herbst-Mix"]
[null,null,null,{"$f":"+'Spielbogen 8er'!P8","v":"2024-11-07"},5,{"$f":"+'Spielbogen 8er'!N8","v":"WB"},128,125,151,404,134.66666666666666,null,{"$f":"+'Anmeldegruppen Turniere'!T21&\" - \"&W16","v":"18. / 19. Jan. 25 - 1. Antritt Einzel"},null,null,null,null,null,null,{"$f":"IF(S16>1,+S16/V16,\"\")","v":""},{"$f":"IF(S16>1,SUM($R$12:S16),\" \")","v":" "},{"$f":"IF(S16>0,6,0)","v":0},"1. Antritt Einzel"]
[null,null,null,{"$f":"+'Spielbogen 8er'!P9","v":"2025-01-16"},6,{"$f":"+'Spielbogen 8er'!N9","v":"WB"},126,135,137,398,132.66666666666666,null,{"$f":"+'Anmeldegruppen Turniere'!T22&\" - \"&W17","v":"01. / 02. Feb. 25 - 2. Antritt Einzel"},null,null,null,null,null,null,{"$f":"IF(S17>1,+S17/V17,\"\")","v":""},{"$f":"IF(S17>1,SUM($R$12:S17),\" \")","v":" "},{"$f":"IF(S17>0,6,0)","v":0},"2. Antritt Einzel"]
[null,null,null,{"$f":"+'Spielbogen 8er'!P10","v":"2025-01-30"},7,{"$f":"+'Spielbogen 8er'!N10","v":"OT"},null,null,null,""," ",null,{"$f":"+'Hilfstabelle Mannschaften'!J14&\" - \"&W18","v":"12. / 13. Mär, 25 - Frühjahrs-Mix"},null,null,null,null,null,null,{"$f":"IF(R18>1,+R18/V18,\"\")","v":""},{"$f":"IF(R18>1,SUM($R$12:S18),\" \")","v":" "},{"$f":"IF(R18,4,0)","v":0},"Frühjahrs-Mix"]
[null,null,null,{"$f":"+'Spielbogen 8er'!P11","v":"2025-02-13"},8,{"$f":"+'Spielbogen 8er'!N11","v":"WB"},null,null,null,""," ",null,{"$f":"+'Anmeldegruppen Turniere'!T29&\" - \"&W19","v":"12. / 13. Apr. 25 - 1. Antritt Doppel"},null,null,null,null,null,null,{"$f":"IF(S19>1,+S19/V19,\"\")","v":""},{"$f":"IF(S19>1,SUM($R$12:S19),\" \")","v":" "},{"$f":"IF(S19>0,6,0)","v":0},"1. Antritt Doppel"]
[null,null,null,{"$f":"+'Spielbogen 8er'!P12","v":"2025-02-27"},9,{"$f":"+'Spielbogen 8er'!N12","v":"OT"},null,null,null,"",{"$f":"IF(G20>1,SUM(G20:I20)/3,\" \")","v":" "},null,{"$f":"+'Anmeldegruppen Turniere'!T30&\" - \"&W20","v":"10. / 11. Mai  25 - 2. Antritt Doppel"},null,null,null,null,null,null,{"$f":"IF(S20>1,+S20/V20,\"\")","v":""},{"$f":"IF(S20>1,SUM($R$12:S20),\" \")","v":" "},{"$f":"IF(S20>0,6,0)","v":0},"2. Antritt Doppel"]
[null,null,null,{"$f":"+'Spielbogen 8er'!P13","v":"2025-03-13"},10,{"$f":"+'Spielbogen 8er'!N13","v":"WB"},180,134,117,431,{"$f":"IF(G21>1,SUM(G21:I21)/3,\" \")","v":143.66666666666666}]
[null,null,null,{"$f":"+'Spielbogen 8er'!P14","v":"2025-03-27"},11,{"$f":"+'Spielbogen 8er'!N14","v":"OT"},null,null,null,""," ",null,null,null,null,null,null,"Ges. Pins","Spiele","Schnitt"]
[null,null,null,{"$f":"+'Spielbogen 8er'!P15","v":"2025-04-10"},12,{"$f":"+'Spielbogen 8er'!N15","v":"WB"},122,141,155,418,139.33333333333334,null,null,null,"Schnitt HH-Cup",null,null,{"$f":"IF(R13>0,SUM(R13:R14),\"\")","v":""},{"$f":"IF(R13>0,SUM(V13:V14),\"\")","v":""},{"$f":"IF(R13>0,SUM(R13:R14)/SUM(V13:V14),\"\")","v":""}]
[null,null,null,{"$f":"+'Spielbogen 8er'!P16","v":"2025-04-24"},13,{"$f":"+'Spielbogen 8er'!N16","v":"OT"},null,null,null,""," ",null,null,null,"Schnitt Einzel",null,null,{"$f":"IF(S16>0,SUM(S16:S17),\"\")","v":""},{"$f":"IF(S16>0,SUM(V16:V17),\"\")","v":""},{"$f":"IF(S16>0,SUM(S16:S17)/SUM(V16:V17),\"\")","v":""}]
[null,null,null,{"$f":"+'Spielbogen 8er'!P17","v":"2025-05-08"},14,{"$f":"+'Spielbogen 8er'!N17","v":"WB"},null,null,null,{"$f":"IF(G25>1,+G25+H25+I25,\"\")","v":""},{"$f":"IF(G25>1,SUM(G25:I25)/3,\" \")","v":" "},null,null,null,"Schnitt Doppel",null,null,{"$f":"IF(S19>0,SUM(S19:S20),\"\")","v":""},{"$f":"IF(S19>0,SUM(V19:V20),\"\")","v":""},{"$f":"IF(S19>0,SUM(S19:S20)/SUM(V19:V20),\"\")","v":""}]

{"sheet":"Jörg F.","index":13,"n_rows":31,"n_cols":23,"rows_kept":31,"cut":false,"hidden":false,"merged":[[1,6,1,18],[9,3,9,10],[7,3,7,5],[5,3,5,5],[6,3,6,5],[9,12,9,21],[4,16,4,21],[5,11,5,12],[6,11,6,12],[7,11,7,12],[6,16,6,17],[5,19,5,21],[7,16,7,17],[7,19,7,20],[6,19,6,20],[4,9,4,14],[22,14,22,16],[23,14,23,16],[24,14,24,16],[2,9,2,13],[4,4,4,5],[2,3,2,7],[5,16,5,18],[10,12,10,16],[11,12,11,16],[12,12,12,16],[13,12,13,16],[14,12,14,16],[15,12,15,16],[16,12,16,16],[17,12,17,16],[18,12,18,16],[19,12,19,16],[17,22,17,23],[18,22,18,23],[19,22,19,23],[12,22,12,23],[13,22,13,23],[14,22,14,23],[15,22,15,23],[16,22,16,23]]}
[null,"Start"]
[null,"Rangliste",null,null,null,null,{"$f":"+'Hilfstabelle Mannschaften'!H8&\" \"&+'Hilfstabelle Mannschaften'!I8","v":"PUNKTSPIELSAISON  2024/2025"}]
[null,null,null,{"$f":"+'Hilfstabelle Spieler'!A10","v":"Jörg Frahm"}]
[]
[null,null,null,"Pass.-Nr.:",{"$f":"VLOOKUP(D3,'Hilfstabelle Spieler'!A6:B19,2,0)","v":19221},null,"Pins","Spiele","Schnitt","Ligaergebnisse",null,null,null,null,null,null,"Sonstige Antritte:"]
[null,null,null,"Ligaergebnisse:",null,null,{"$f":"IF(SUM(J12:J31)>1,SUM(J12:J31),\" \")","v":2508},{"$f":"COUNT(G12:I31)","v":15},{"$f":"IF(SUM(G12:I31)>1,SUM(G6/H6),\" \")","v":167.2},"MAX.","MIN.","MAX.",null,"MIN.","Schnitt",null,"4.er Serie:",null,null,"6.er Serie:"]
[null,null,null,"Sonstige Antritte:",null,null,{"$f":"IF(SUM(R12:S19)>1,SUM(R12:S20),\" \")","v":2792},{"$f":"IF(SUM(R12:S19)>1,SUM(V12:V20),\" \")","v":16},{"$f":"IF(SUM(R12:S19)>1,G7/H7,\" \")","v":174.5},"ERG.","ERG.","3.ER",null,"3.ER","3.ER",null,"Höchstes 4.er Erg. :",null,{"$f":"MAX(R13:R18)","v":742},"Höchstes 6.er Erg. :",null,{"$f":"MAX(S12:S20)","v":1059}]
[null,null,null,"GESAMTSCHNITT:",null,null,{"$f":"IF(SUM(G6:G7)>1,SUM(G6:G7),\" \")","v":5300},{"$f":"IF(SUM(H6:H7)>1,SUM(H6:H7),\" \")","v":31},{"$f":"IF(SUM(G8)>1,SUM(G8/H8),\" \")","v":170.96774193548387},{"$f":"MAX(G12:I40)","v":221},{"$f":"IF(SUM(G12:I40)<1,\" \",MIN(G12:I40))","v":138},{"$f":"MAX(J12:J40)","v":563},null,{"$f":"IF(SUM(G12:J40)>1,MIN(J12:J40),\" \")","v":474},{"$f":"IF(J8>0,AVERAGE(J12:J30),\"\")","v":501.6},null,"Höchste Einzel-Erg. :",null,212,"Höchste Einzel-Erg. :",null,198]
[]
[null,null,null,"         Einzelspielergebnisse Liga",null,null,null,null,null,null,null,null,"Sonstige Antritte"]
[null,null,null," Datum","Antr.","Bahn","1. Spiel","2. Spiel","3. Spiel","3. er Serie","3. er Ø",null," Datum - Turnier",null,null,null,null,"4.er Erg.","6.er Erg.","Schnitt","Ges. Pins","Spiele"]
[null,null,null,{"$f":"+'Spielbogen 8er'!P4","v":"2024-09-12"},1,{"$f":"+'Spielbogen 8er'!N4","v":"OT"},null,null,null,{"$f":"IF(G12>1,+G12+H12+I12,\"\")","v":""},{"$f":"IF(G12>1,SUM(G12:I12)/3,\" \")","v":" "},null,{"$f":"+'Anmeldegruppen Turniere'!T8&\" - \"&W12","v":"07. / 08. Sep. 24 - Eröffnungs Doppel"},null,null,null,null,null,null,{"$f":"IF(S12>1,+S12/V12,\"\")","v":""},{"$f":"IF(S12>1,SUM($R$12:S12),\" \")","v":" "},{"$f":"IF(S12>0,6,0)","v":0},"Eröffnungs Doppel"]
[null,null,null,{"$f":"+'Spielbogen 8er'!P5","v":"2024-09-26"},2,{"$f":"+'Spielbogen 8er'!N5","v":"OT"},null,null,null,""," ",null,{"$f":"+'Anmeldegruppen Turniere'!T11&\" - \"&W13","v":"12. / 13. Nov. 24 - 1. Antritt HH-Cup"},null,null,null,null,null,null,{"$f":"IF(R13>1,+R13/V13,\"\")","v":""},{"$f":"IF(R13>1,SUM($R$12:S13),\" \")","v":" "},{"$f":"IF(R13,4,0)","v":0},"1. Antritt HH-Cup"]
[null,null,null,{"$f":"+'Spielbogen 8er'!P6","v":"2024-10-10"},3,{"$f":"+'Spielbogen 8er'!N6","v":"WB"},null,null,null,""," ",null,{"$f":"+'Anmeldegruppen Turniere'!T12&\" - \"&W14","v":"26. / 27. Nov .24 - 2. Antritt HH-Cup"},null,null,null,null,null,null,{"$f":"IF(R14>1,+R14/V14,\"\")","v":""},{"$f":"IF(R14>1,SUM($R$12:S14),\" \")","v":" "},{"$f":"IF(R14,4,0)","v":0},"2. Antritt HH-Cup"]
[null,null,null,{"$f":"+'Spielbogen 8er'!P7","v":"2024-10-24"},4,{"$f":"+'Spielbogen 8er'!N7","v":"OT"},null,null,null,""," ",null,{"$f":"+'Hilfstabelle Mannschaften'!J12&\" - \"&W15","v":"16. / 17. Nov. 24 - Herbst-Mix"},null,null,null,null,null,null,{"$f":"IF(R15>1,+R15/V15,\"\")","v":""},{"$f":"IF(R15>1,SUM($R$12:S15),\" \")","v":" "},{"$f":"IF(R15,4,0)","v":0},"Herbst-Mix"]
[null,null,null,{"$f":"+'Spielbogen 8er'!P8","v":"2024-11-07"},5,{"$f":"+'Spielbogen 8er'!N8","v":"WB"},null,null,null,""," ",null,{"$f":"+'Anmeldegruppen Turniere'!T21&\" - \"&W16","v":"18. / 19. Jan. 25 - 1. Antritt Einzel"},null,null,null,null,null,null,{"$f":"IF(S16>1,+S16/V16,\"\")","v":""},{"$f":"IF(S16>1,SUM($R$12:S16),\" \")","v":" "},{"$f":"IF(S16>0,6,0)","v":0},"1. Antritt Einzel"]
[null,null,null,{"$f":"+'Spielbogen 8er'!P9","v":"2025-01-16"},6,{"$f":"+'Spielbogen 8er'!N9","v":"WB"},null,null,null,""," ",null,{"$f":"+'Anmeldegruppen Turniere'!T22&\" - \"&W17","v":"01. / 02. Feb. 25 - 2. Antritt Einzel"},null,null,null,null,null,null,{"$f":"IF(S17>1,+S17/V17,\"\")","v":""},{"$f":"IF(S17>1,SUM($R$12:S17),\" \")","v":" "},{"$f":"IF(S17>0,6,0)","v":0},"2. Antritt Einzel"]
[null,null,null,{"$f":"+'Spielbogen 8er'!P10","v":"2025-01-30"},7,{"$f":"+'Spielbogen 8er'!N10","v":"OT"},null,null,null,""," ",null,{"$f":"+'Hilfstabelle Mannschaften'!J14&\" - \"&W18","v":"12. / 13. Mär, 25 - Frühjahrs-Mix"},null,null,null,null,742,null,{"$f":"IF(R18>1,+R18/V18,\"\")","v":185.5},{"$f":"IF(R18>1,SUM($R$12:S18),\" \")","v":742},{"$f":"IF(R18,4,0)","v":4},"Frühjahrs-Mix"]
[null,null,null,{"$f":"+'Spielbogen 8er'!P11","v":"2025-02-13"},8,{"$f":"+'Spielbogen 8er'!N11","v":"WB"},null,null,null,""," ",null,{"$f":"+'Anmeldegruppen Turniere'!T29&\" - \"&W19","v":"12. / 13. Apr. 25 - 1. Antritt Doppel"},null,null,null,null,null,1059,{"$f":"IF(S19>1,+S19/V19,\"\")","v":176.5},{"$f":"IF(S19>1,SUM($R$12:S19),\" \")","v":1801},{"$f":"IF(S19>0,6,0)","v":6},"1. Antritt Doppel"]
[null,null,null,{"$f":"+'Spielbogen 8er'!P12","v":"2025-02-27"},9,{"$f":"+'Spielbogen 8er'!N12","v":"OT"},151,185,138,474,{"$f":"IF(G20>1,SUM(G20:I20)/3,\" \")","v":158},null,{"$f":"+'Anmeldegruppen Turniere'!T30&\" - \"&W20","v":"10. / 11. Mai  25 - 2. Antritt Doppel"},null,null,null,null,null,991,{"$f":"IF(S20>1,+S20/V20,\"\")","v":165.16666666666666},{"$f":"IF(S20>1,SUM($R$12:S20),\" \")","v":2792},{"$f":"IF(S20>0,6,0)","v":6},"2. Antritt Doppel"]
[null,null,null,{"$f":"+'Spielbogen 8er'!P13","v":"2025-03-13"},10,{"$f":"+'Spielbogen 8er'!N13","v":"WB"},158,221,184,563,{"$f":"IF(G21>1,SUM(G21:I21)/3,\" \")","v":187.66666666666666}]
[null,null,null,{"$f":"+'Spielbogen 8er'!P14","v":"2025-03-27"},11,{"$f":"+'Spielbogen 8er'!N14","v":"OT"},147,189,145,481,160.33333333333334,null,null,null,null,null,null,"Ges. Pins","Spiele","Schnitt"]
[null,null,null,{"$f":"+'Spielbogen 8er'!P15","v":"2025-04-10"},12,{"$f":"+'Spielbogen 8er'!N15","v":"WB"},178,156,164,498,166,null,null,null,"Schnitt HH-Cup",null,null,{"$f":"IF(R13>0,SUM(R13:R14),\"\")","v":""},{"$f":"IF(R13>0,SUM(V13:V14),\"\")","v":""},{"$f":"IF(R13>0,SUM(R13:R14)/SUM(V13:V14),\"\")","v":""}]
[null,null,null,{"$f":"+'Spielbogen 8er'!P16","v":"2025-04-24"},13,{"$f":"+'Spielbogen 8er'!N16","v":"OT"},153,180,159,492,164,null,null,null,"Schnitt Einzel",null,null,{"$f":"IF(S16>0,SUM(S16:S17),\"\")","v":""},{"$f":"IF(S16>0,SUM(V16:V17),\"\")","v":""},{"$f":"IF(S16>0,SUM(S16:S17)/SUM(V16:V17),\"\")","v":""}]
[null,null,null,{"$f":"+'Spielbogen 8er'!P17","v":"2025-05-08"},14,{"$f":"+'Spielbogen 8er'!N17","v":"WB"},null,null,null,{"$f":"IF(G25>1,+G25+H25+I25,\"\")","v":""},{"$f":"IF(G25>1,SUM(G25:I25)/3,\" \")","v":" "},null,null,null,"Schnitt Doppel",null,null,{"$f":"IF(S19>0,SUM(S19:S20),\"\")","v":2050},{"$f":"IF(S19>0,SUM(V19:V20),\"\")","v":12},{"$f":"IF(S19>0,SUM(S19:S20)/SUM(V19:V20),\"\")","v":170.83333333333334}]
[null,null,null,{"$f":"+\"Ausgeholfen in der 1. Mannschaft                                                     Anzahl Spiele:\"&\" \"&+COUNT(G27:I30)","v":"Ausgeholfen in der 1. Mannschaft                                                     Anzahl Spiele: 0"}]
[null,null,null,null,null,null,null,null,null,{"$f":"IF(G27>1,+G27+H27+I27,\"\")","v":""},{"$f":"IF(G27>1,SUM(G27:I27)/3,\" \")","v":" "}]
[null,null,null,null,null,null,null,null,null,{"$f":"IF(G28>1,+G28+H28+I28,\"\")","v":""},{"$f":"IF(G28>1,SUM(G28:I28)/3,\" \")","v":" "}]
[null,null,null,null,null,null,null,null,null,{"$f":"IF(G29>1,+G29+H29+I29,\"\")","v":""},{"$f":"IF(G29>1,SUM(G29:I29)/3,\" \")","v":" "}]
[null,null,null,null,null,null,null,null,null,{"$f":"IF(G30>1,+G30+H30+I30,\"\")","v":""},{"$f":"IF(G30>1,SUM(G30:I30)/3,\" \")","v":" "}]
[null,null,null,null,null,null,null,null,null,{"$f":"IF(G31>1,+G31+H31+I31,\"\")","v":""},{"$f":"IF(G31>1,SUM(G31:I31)/3,\" \")","v":" "}]

{"sheet":"Matthias N.","index":14,"n_rows":31,"n_cols":23,"rows_kept":31,"cut":false,"hidden":false,"merged":[[1,6,1,18],[6,19,6,20],[5,11,5,12],[6,11,6,12],[6,16,6,17],[4,9,4,14],[5,16,5,18],[5,19,5,21],[4,16,4,21],[2,3,2,7],[2,9,2,13],[4,4,4,5],[11,12,11,16],[12,12,12,16],[7,19,7,20],[5,3,5,5],[6,3,6,5],[7,3,7,5],[7,11,7,12],[7,16,7,17],[9,3,9,10],[10,12,10,16],[9,12,9,21],[22,14,22,16],[23,14,23,16],[24,14,24,16],[13,12,13,16],[14,12,14,16],[15,12,15,16],[16,12,16,16],[17,12,17,16],[18,12,18,16],[19,12,19,16],[17,22,17,23],[18,22,18,23],[19,22,19,23],[12,22,12,23],[13,22,13,23],[14,22,14,23],[15,22,15,23],[16,22,16,23]]}
[null,"Start"]
[null,"Rangliste",null,null,null,null,{"$f":"+'Hilfstabelle Mannschaften'!H8&\" \"&+'Hilfstabelle Mannschaften'!I8","v":"PUNKTSPIELSAISON  2024/2025"}]
[null,null,null,{"$f":"+'Hilfstabelle Spieler'!A13","v":"Matthias Nolte"}]
[]
[null,null,null,"Pass.-Nr.:",{"$f":"VLOOKUP(D3,'Hilfstabelle Spieler'!A6:B19,2,0)","v":20137},null,"Pins","Spiele","Schnitt","Ligaergebnisse",null,null,null,null,null,null,"Sonstige Antritte:"]
[null,null,null,"Ligaergebnisse:",null,null,{"$f":"IF(SUM(J12:J31)>1,SUM(J12:J31),\" \")","v":2000},{"$f":"COUNT(G12:I31)","v":15},{"$f":"IF(SUM(G12:I31)>1,SUM(G6/H6),\" \")","v":133.33333333333334},"MAX.","MIN.","MAX.",null,"MIN.","Schnitt",null,"4.er Serie:",null,null,"6.er Serie:"]
[null,null,null,"Sonstige Antritte:",null,null,{"$f":"IF(SUM(R12:S19)>1,SUM(R12:S20),\" \")","v":" "},{"$f":"IF(SUM(R12:S19)>1,SUM(V12:V20),\" \")","v":" "},{"$f":"IF(SUM(R12:S19)>1,G7/H7,\" \")","v":" "},"ERG.","ERG.","3.ER",null,"3.ER","3.ER",null,"Höchstes 4.er Erg. :",null,{"$f":"MAX(R13:R18)","v":0},"Höchstes 6.er Erg. :"]
[null,null,null,"GESAMTSCHNITT:",null,null,{"$f":"IF(SUM(G6:G7)>1,SUM(G6:G7),\" \")","v":2000},{"$f":"IF(SUM(H6:H7)>1,SUM(H6:H7),\" \")","v":15},{"$f":"IF(SUM(G8)>1,SUM(G8/H8),\" \")","v":133.33333333333334},{"$f":"MAX(G12:I40)","v":185},{"$f":"IF(SUM(G12:I40)<1,\" \",MIN(G12:I40))","v":106},{"$f":"MAX(J12:J40)","v":491},null,{"$f":"IF(SUM(G12:J40)>1,MIN(J12:J40),\" \")","v":350},{"$f":"IF(J8>0,AVERAGE(J12:J30),\"\")","v":400},null,"Höchste Einzel-Erg. :",null,null,"Höchste Einzel-Erg. :"]
[]
[null,null,null,"         Einzelspielergebnisse Liga",null,null,null,null,null,null,null,null,"Sonstige Antritte"]
[null,null,null," Datum","Antr.","Bahn","1. Spiel","2. Spiel","3. Spiel","3. er Serie","3. er Ø",null," Datum - Turnier",null,null,null,null,"4.er Erg.","6.er Erg.","Schnitt","Ges. Pins","Spiele"]
[null,null,null,{"$f":"+'Spielbogen 8er'!P4","v":"2024-09-12"},1,{"$f":"+'Spielbogen 8er'!N4","v":"OT"},null,null,null,{"$f":"IF(G12>1,+G12+H12+I12,\"\")","v":""},{"$f":"IF(G12>1,SUM(G12:I12)/3,\" \")","v":" "},null,{"$f":"+'Anmeldegruppen Turniere'!T8&\" - \"&W12","v":"07. / 08. Sep. 24 - Eröffnungs Doppel"},null,null,null,null,null,null,{"$f":"IF(S12>1,+S12/V12,\"\")","v":""},{"$f":"IF(S12>1,SUM($R$12:S12),\" \")","v":" "},{"$f":"IF(S12>0,6,0)","v":0},"Eröffnungs Doppel"]
[null,null,null,{"$f":"+'Spielbogen 8er'!P5","v":"2024-09-26"},2,{"$f":"+'Spielbogen 8er'!N5","v":"OT"},156,141,109,406,135.33333333333334,null,{"$f":"+'Anmeldegruppen Turniere'!T11&\" - \"&W13","v":"12. / 13. Nov. 24 - 1. Antritt HH-Cup"},null,null,null,null,null,null,{"$f":"IF(R13>1,+R13/V13,\"\")","v":""},{"$f":"IF(R13>1,SUM($R$12:S13),\" \")","v":" "},{"$f":"IF(R13,4,0)","v":0},"1. Antritt HH-Cup"]
[null,null,null,{"$f":"+'Spielbogen 8er'!P6","v":"2024-10-10"},3,{"$f":"+'Spielbogen 8er'!N6","v":"WB"},null,null,null,""," ",null,{"$f":"+'Anmeldegruppen Turniere'!T12&\" - \"&W14","v":"26. / 27. Nov .24 - 2. Antritt HH-Cup"},null,null,null,null,null,null,{"$f":"IF(R14>1,+R14/V14,\"\")","v":""},{"$f":"IF(R14>1,SUM($R$12:S14),\" \")","v":" "},{"$f":"IF(R14,4,0)","v":0},"2. Antritt HH-Cup"]
[null,null,null,{"$f":"+'Spielbogen 8er'!P7","v":"2024-10-24"},4,{"$f":"+'Spielbogen 8er'!N7","v":"OT"},106,136,123,365,121.66666666666667,null,{"$f":"+'Hilfstabelle Mannschaften'!J12&\" - \"&W15","v":"16. / 17. Nov. 24 - Herbst-Mix"},null,null,null,null,null,null,{"$f":"IF(R15>1,+R15/V15,\"\")","v":""},{"$f":"IF(R15>1,SUM($R$12:S15),\" \")","v":" "},{"$f":"IF(R15,4,0)","v":0},"Herbst-Mix"]
[null,null,null,{"$f":"+'Spielbogen 8er'!P8","v":"2024-11-07"},5,{"$f":"+'Spielbogen 8er'!N8","v":"WB"},null,null,null,""," ",null,{"$f":"+'Anmeldegruppen Turniere'!T21&\" - \"&W16","v":"18. / 19. Jan. 25 - 1. Antritt Einzel"},null,null,null,null,null,null,{"$f":"IF(S16>1,+S16/V16,\"\")","v":""},{"$f":"IF(S16>1,SUM($R$12:S16),\" \")","v":" "},{"$f":"IF(S16>0,6,0)","v":0},"1. Antritt Einzel"]
[null,null,null,{"$f":"+'Spielbogen 8er'!P9","v":"2025-01-16"},6,{"$f":"+'Spielbogen 8er'!N9","v":"WB"},null,null,null,""," ",null,{"$f":"+'Anmeldegruppen Turniere'!T22&\" - \"&W17","v":"01. / 02. Feb. 25 - 2. Antritt Einzel"},null,null,null,null,null,null,{"$f":"IF(S17>1,+S17/V17,\"\")","v":""},{"$f":"IF(S17>1,SUM($R$12:S17),\" \")","v":" "},{"$f":"IF(S17>0,6,0)","v":0},"2. Antritt Einzel"]
[null,null,null,{"$f":"+'Spielbogen 8er'!P10","v":"2025-01-30"},7,{"$f":"+'Spielbogen 8er'!N10","v":"OT"},126,109,115,350,116.66666666666667,null,{"$f":"+'Hilfstabelle Mannschaften'!J14&\" - \"&W18","v":"12. / 13. Mär, 25 - Frühjahrs-Mix"},null,null,null,null,null,null,{"$f":"IF(R18>1,+R18/V18,\"\")","v":""},{"$f":"IF(R18>1,SUM($R$12:S18),\" \")","v":" "},{"$f":"IF(R18,4,0)","v":0},"Frühjahrs-Mix"]
[null,null,null,{"$f":"+'Spielbogen 8er'!P11","v":"2025-02-13"},8,{"$f":"+'Spielbogen 8er'!N11","v":"WB"},null,null,null,""," ",null,{"$f":"+'Anmeldegruppen Turniere'!T29&\" - \"&W19","v":"12. / 13. Apr. 25 - 1. Antritt Doppel"},null,null,null,null,null,null,{"$f":"IF(S19>1,+S19/V19,\"\")","v":""},{"$f":"IF(S19>1,SUM($R$12:S19),\" \")","v":" "},{"$f":"IF(S19>0,6,0)","v":0},"1. Antritt Doppel"]
[null,null,null,{"$f":"+'Spielbogen 8er'!P12","v":"2025-02-27"},9,{"$f":"+'Spielbogen 8er'!N12","v":"OT"},null,null,null,"",{"$f":"IF(G20>1,SUM(G20:I20)/3,\" \")","v":" "},null,{"$f":"+'Anmeldegruppen Turniere'!T30&\" - \"&W20","v":"10. / 11. Mai  25 - 2. Antritt Doppel"},null,null,null,null,null,null,{"$f":"IF(S20>1,+S20/V20,\"\")","v":""},{"$f":"IF(S20>1,SUM($R$12:S20),\" \")","v":" "},{"$f":"IF(S20>0,6,0)","v":0},"2. Antritt Doppel"]
[null,null,null,{"$f":"+'Spielbogen 8er'!P13","v":"2025-03-13"},10,{"$f":"+'Spielbogen 8er'!N13","v":"WB"},null,null,null,"",{"$f":"IF(G21>1,SUM(G21:I21)/3,\" \")","v":" "}]
[null,null,null,{"$f":"+'Spielbogen 8er'!P14","v":"2025-03-27"},11,{"$f":"+'Spielbogen 8er'!N14","v":"OT"},185,152,154,491,163.66666666666666,null,null,null,null,null,null,"Ges. Pins","Spiele","Schnitt"]
[null,null,null,{"$f":"+'Spielbogen 8er'!P15","v":"2025-04-10"},12,{"$f":"+'Spielbogen 8er'!N15","v":"WB"},null,null,null,""," ",null,null,null,"Schnitt HH-Cup",null,null,{"$f":"IF(R13>0,SUM(R13:R14),\"\")","v":""},{"$f":"IF(R13>0,SUM(V13:V14),\"\")","v":""},{"$f":"IF(R13>0,SUM(R13:R14)/SUM(V13:V14),\"\")","v":""}]
[null,null,null,{"$f":"+'Spielbogen 8er'!P16","v":"2025-04-24"},13,{"$f":"+'Spielbogen 8er'!N16","v":"OT"},151,108,129,388,129.33333333333334,null,null,null,"Schnitt Einzel",null,null,{"$f":"IF(S16>0,SUM(S16:S17),\"\")","v":""},{"$f":"IF(S16>0,SUM(V16:V17),\"\")","v":""},{"$f":"IF(S16>0,SUM(S16:S17)/SUM(V16:V17),\"\")","v":""}]
[null,null,null,{"$f":"+'Spielbogen 8er'!P17","v":"2025-05-08"},14,{"$f":"+'Spielbogen 8er'!N17","v":"WB"},null,null,null,{"$f":"IF(G25>1,+G25+H25+I25,\"\")","v":""},{"$f":"IF(G25>1,SUM(G25:I25)/3,\" \")","v":" "},null,null,null,"Schnitt Doppel",null,null,{"$f":"IF(S19>0,SUM(S19:S20),\"\")","v":""},{"$f":"IF(S19>0,SUM(V19:V20),\"\")","v":""},{"$f":"IF(S19>0,SUM(S19:S20)/SUM(V19:V20),\"\")","v":""}]
[null,null,null,{"$f":"+\"Ausgeholfen in der 2 Mannschaft                                                     Anzahl Spiele:\"&\" \"&+COUNT(G27:I30)","v":"Ausgeholfen in der 2 Mannschaft                                                     Anzahl Spiele: 0"}]
[null,null,null,null,null,null,null,null,null,{"$f":"IF(G27>1,+G27+H27+I27,\"\")","v":""},{"$f":"IF(G27>1,SUM(G27:I27)/3,\" \")","v":" "}]
[null,null,null,null,null,null,null,null,null,{"$f":"IF(G28>1,+G28+H28+I28,\"\")","v":""},{"$f":"IF(G28>1,SUM(G28:I28)/3,\" \")","v":" "}]
[null,null,null,null,null,null,null,null,null,{"$f":"IF(G29>1,+G29+H29+I29,\"\")","v":""},{"$f":"IF(G29>1,SUM(G29:I29)/3,\" \")","v":" "}]
[null,null,null,null,null,null,null,null,null,{"$f":"IF(G30>1,+G30+H30+I30,\"\")","v":""},{"$f":"IF(G30>1,SUM(G30:I30)/3,\" \")","v":" "}]
[null,null,null,null,null,null,null,null,null,{"$f":"IF(G31>1,+G31+H31+I31,\"\")","v":""},{"$f":"IF(G31>1,SUM(G31:I31)/3,\" \")","v":" "}]

{"sheet":"Deniz H.","index":15,"n_rows":31,"n_cols":23,"rows_kept":31,"cut":false,"hidden":false,"merged":[[5,3,5,5],[5,11,5,12],[5,16,5,18],[5,19,5,21],[1,6,1,18],[4,9,4,14],[4,16,4,21],[2,3,2,7],[2,9,2,13],[4,4,4,5],[9,3,9,10],[9,12,9,21],[6,3,6,5],[6,11,6,12],[6,16,6,17],[6,19,6,20],[7,3,7,5],[7,11,7,12],[7,16,7,17],[7,19,7,20],[22,14,22,16],[23,14,23,16],[24,14,24,16],[13,12,13,16],[14,12,14,16],[15,12,15,16],[16,12,16,16],[17,12,17,16],[18,12,18,16],[19,12,19,16],[10,12,10,16],[17,22,17,23],[18,22,18,23],[19,22,19,23],[11,12,11,16],[12,12,12,16],[12,22,12,23],[13,22,13,23],[14,22,14,23],[15,22,15,23],[16,22,16,23]]}
[null,"Start"]
[null,"Rangliste",null,null,null,null,{"$f":"+'Hilfstabelle Mannschaften'!H8&\" \"&+'Hilfstabelle Mannschaften'!I8","v":"PUNKTSPIELSAISON  2024/2025"}]
[null,null,null,{"$f":"+'Hilfstabelle Spieler'!A7","v":"Deniz Hagelstein"}]
[]
[null,null,null,"Pass.-Nr.:",{"$f":"VLOOKUP(D3,'Hilfstabelle Spieler'!A6:B19,2,0)","v":24775},null,"Pins","Spiele","Schnitt","Ligaergebnisse",null,null,null,null,null,null,"Sonstige Antritte:"]
[null,null,null,"Ligaergebnisse:",null,null,{"$f":"IF(SUM(J12:J31)>1,SUM(J12:J31),\" \")","v":2818},{"$f":"COUNT(G12:I31)","v":21},{"$f":"IF(SUM(G12:I31)>1,SUM(G6/H6),\" \")","v":134.1904761904762},"MAX.","MIN.","MAX.",null,"MIN.","Schnitt",null,"4.er Serie:",null,null,"6.er Serie"]
[null,null,null,"Sonstige Antritte:",null,null,{"$f":"IF(SUM(R12:S19)>1,SUM(R12:S20),\" \")","v":" "},{"$f":"IF(SUM(R12:S19)>1,SUM(V12:V20),\" \")","v":" "},{"$f":"IF(SUM(R12:S19)>1,G7/H7,\" \")","v":" "},"ERG.","ERG.","3.ER",null,"3.ER","3.ER",null,"Höchstes 4.er Erg. :",null,{"$f":"MAX(R13:R18)","v":0},"Höchstes 6.er Erg. :"]
[null,null,null,"GESAMTSCHNITT:",null,null,{"$f":"IF(SUM(G6:G7)>1,SUM(G6:G7),\" \")","v":2818},{"$f":"IF(SUM(H6:H7)>1,SUM(H6:H7),\" \")","v":21},{"$f":"IF(SUM(G8)>1,SUM(G8/H8),\" \")","v":134.1904761904762},{"$f":"MAX(G12:I40)","v":179},{"$f":"IF(SUM(G12:I40)<1,\" \",MIN(G12:I40))","v":98},{"$f":"MAX(J12:J40)","v":490},null,{"$f":"IF(SUM(G12:J40)>1,MIN(J12:J40),\" \")","v":350},{"$f":"IF(J8>0,AVERAGE(J12:J30),\"\")","v":402.57142857142856},null,"Höchste Einzel-Erg. :",null,null,"Höchste Einzel-Erg. :"]
[]
[null,null,null,"         Einzelspielergebnisse Liga",null,null,null,null,null,null,null,null,"Sonstige Antritte"]
[null,null,null," Datum","Antr.","Bahn","1. Spiel","2. Spiel","3. Spiel","3. er Serie","3. er Ø",null," Datum - Turnier",null,null,null,null,"4.er Erg.","6.er Erg.","Schnitt","Ges. Pins","Spiele"]
[null,null,null,{"$f":"+'Spielbogen 8er'!P4","v":"2024-09-12"},1,{"$f":"+'Spielbogen 8er'!N4","v":"OT"},null,null,null,{"$f":"IF(G12>1,+G12+H12+I12,\"\")","v":""},{"$f":"IF(G12>1,SUM(G12:I12)/3,\" \")","v":" "},null,{"$f":"+'Anmeldegruppen Turniere'!T8&\" - \"&W12","v":"07. / 08. Sep. 24 - Eröffnungs Doppel"},null,null,null,null,null,null,{"$f":"IF(S12>1,+S12/V12,\"\")","v":""},{"$f":"IF(S12>1,SUM($R$12:S12),\" \")","v":" "},{"$f":"IF(S12>0,6,0)","v":0},"Eröffnungs Doppel"]
[null,null,null,{"$f":"+'Spielbogen 8er'!P5","v":"2024-09-26"},2,{"$f":"+'Spielbogen 8er'!N5","v":"OT"},98,128,149,375,125,null,{"$f":"+'Anmeldegruppen Turniere'!T11&\" - \"&W13","v":"12. / 13. Nov. 24 - "},null,null,null,null,null,null,{"$f":"IF(R13>1,+R13/V13,\"\")","v":""},{"$f":"IF(R13>1,SUM($R$12:S13),\" \")","v":" "},{"$f":"IF(R13,4,0)","v":0}]
[null,null,null,{"$f":"+'Spielbogen 8er'!P6","v":"2024-10-10"},3,{"$f":"+'Spielbogen 8er'!N6","v":"WB"},null,null,null,""," ",null,{"$f":"+'Anmeldegruppen Turniere'!T12&\" - \"&W14","v":"26. / 27. Nov .24 - 2. Antritt HH-Cup"},null,null,null,null,null,null,{"$f":"IF(R14>1,+R14/V14,\"\")","v":""},{"$f":"IF(R14>1,SUM($R$12:S14),\" \")","v":" "},{"$f":"IF(R14,4,0)","v":0},"2. Antritt HH-Cup"]
[null,null,null,{"$f":"+'Spielbogen 8er'!P7","v":"2024-10-24"},4,{"$f":"+'Spielbogen 8er'!N7","v":"OT"},147,175,168,490,163.33333333333334,null,{"$f":"+'Hilfstabelle Mannschaften'!J12&\" - \"&W15","v":"16. / 17. Nov. 24 - Herbst-Mix"},null,null,null,null,null,null,{"$f":"IF(R15>1,+R15/V15,\"\")","v":""},{"$f":"IF(R15>1,SUM($R$12:S15),\" \")","v":" "},{"$f":"IF(R15,4,0)","v":0},"Herbst-Mix"]
[null,null,null,{"$f":"+'Spielbogen 8er'!P8","v":"2024-11-07"},5,{"$f":"+'Spielbogen 8er'!N8","v":"WB"},null,null,null,""," ",null,{"$f":"+'Anmeldegruppen Turniere'!T21&\" - \"&W16","v":"18. / 19. Jan. 25 - 1. Antritt Einzel"},null,null,null,null,null,null,{"$f":"IF(S16>1,+S16/V16,\"\")","v":""},{"$f":"IF(S16>1,SUM($R$12:S16),\" \")","v":" "},{"$f":"IF(S16>0,6,0)","v":0},"1. Antritt Einzel"]
[null,null,null,{"$f":"+'Spielbogen 8er'!P9","v":"2025-01-16"},6,{"$f":"+'Spielbogen 8er'!N9","v":"WB"},null,null,null,""," ",null,{"$f":"+'Anmeldegruppen Turniere'!T22&\" - \"&W17","v":"01. / 02. Feb. 25 - 2. Antritt Einzel"},null,null,null,null,null,null,{"$f":"IF(S17>1,+S17/V17,\"\")","v":""},{"$f":"IF(S17>1,SUM($R$12:S17),\" \")","v":" "},{"$f":"IF(S17>0,6,0)","v":0},"2. Antritt Einzel"]
[null,null,null,{"$f":"+'Spielbogen 8er'!P10","v":"2025-01-30"},7,{"$f":"+'Spielbogen 8er'!N10","v":"OT"},113,135,102,350,116.66666666666667,null,{"$f":"+'Hilfstabelle Mannschaften'!J14&\" - \"&W18","v":"12. / 13. Mär, 25 - Frühjahrs-Mix"},null,null,null,null,null,null,{"$f":"IF(R18>1,+R18/V18,\"\")","v":""},{"$f":"IF(R18>1,SUM($R$12:S18),\" \")","v":" "},{"$f":"IF(R18,4,0)","v":0},"Frühjahrs-Mix"]
[null,null,null,{"$f":"+'Spielbogen 8er'!P11","v":"2025-02-13"},8,{"$f":"+'Spielbogen 8er'!N11","v":"WB"},145,113,107,365,121.66666666666667,null,{"$f":"+'Anmeldegruppen Turniere'!T29&\" - \"&W19","v":"12. / 13. Apr. 25 - 1. Antritt Doppel"},null,null,null,null,null,null,{"$f":"IF(S19>1,+S19/V19,\"\")","v":""},{"$f":"IF(S19>1,SUM($R$12:S19),\" \")","v":" "},{"$f":"IF(S19>0,6,0)","v":0},"1. Antritt Doppel"]
[null,null,null,{"$f":"+'Spielbogen 8er'!P12","v":"2025-02-27"},9,{"$f":"+'Spielbogen 8er'!N12","v":"OT"},null,null,null,"",{"$f":"IF(G20>1,SUM(G20:I20)/3,\" \")","v":" "},null,{"$f":"+'Anmeldegruppen Turniere'!T30&\" - \"&W20","v":"10. / 11. Mai  25 - 2. Antritt Doppel"},null,null,null,null,null,null,{"$f":"IF(S20>1,+S20/V20,\"\")","v":""},{"$f":"IF(S20>1,SUM($R$12:S20),\" \")","v":" "},{"$f":"IF(S20>0,6,0)","v":0},"2. Antritt Doppel"]
[null,null,null,{"$f":"+'Spielbogen 8er'!P13","v":"2025-03-13"},10,{"$f":"+'Spielbogen 8er'!N13","v":"WB"},null,null,null,"",{"$f":"IF(G21>1,SUM(G21:I21)/3,\" \")","v":" "}]
[null,null,null,{"$f":"+'Spielbogen 8er'!P14","v":"2025-03-27"},11,{"$f":"+'Spielbogen 8er'!N14","v":"OT"},140,108,138,386,128.66666666666666,null,null,null,null,null,null,"Ges. Pins","Spiele","Schnitt"]
[null,null,null,{"$f":"+'Spielbogen 8er'!P15","v":"2025-04-10"},12,{"$f":"+'Spielbogen 8er'!N15","v":"WB"},136,130,179,445,148.33333333333334,null,null,null,"Schnitt HH-Cup",null,null,{"$f":"IF(R13>0,SUM(R13:R14),\"\")","v":""},{"$f":"IF(R13>0,SUM(V13:V14),\"\")","v":""},{"$f":"IF(R13>0,SUM(R13:R14)/SUM(V13:V14),\"\")","v":""}]
[null,null,null,{"$f":"+'Spielbogen 8er'!P16","v":"2025-04-24"},13,{"$f":"+'Spielbogen 8er'!N16","v":"OT"},null,null,null,""," ",null,null,null,"Schnitt Einzel",null,null,{"$f":"IF(S16>0,SUM(S16:S17),\"\")","v":""},{"$f":"IF(S16>0,SUM(V16:V17),\"\")","v":""},{"$f":"IF(S16>0,SUM(S16:S17)/SUM(V16:V17),\"\")","v":""}]
[null,null,null,{"$f":"+'Spielbogen 8er'!P17","v":"2025-05-08"},14,{"$f":"+'Spielbogen 8er'!N17","v":"WB"},154,126,127,{"$f":"IF(G25>1,+G25+H25+I25,\"\")","v":407},{"$f":"IF(G25>1,SUM(G25:I25)/3,\" \")","v":135.66666666666666},null,null,null,"Schnitt Doppel",null,null,{"$f":"IF(S19>0,SUM(S19:S20),\"\")","v":""},{"$f":"IF(S19>0,SUM(V19:V20),\"\")","v":""},{"$f":"IF(S19>0,SUM(S19:S20)/SUM(V19:V20),\"\")","v":""}]
[null,null,null,{"$f":"+\"Ausgeholfen in der 2 Mannschaft                                                     Anzahl Spiele:\"&\" \"&+COUNT(G27:I30)","v":"Ausgeholfen in der 2 Mannschaft                                                     Anzahl Spiele: 0"}]
[null,null,null,null,null,null,null,null,null,{"$f":"IF(G27>1,+G27+H27+I27,\"\")","v":""},{"$f":"IF(G27>1,SUM(G27:I27)/3,\" \")","v":" "}]
[null,null,null,null,null,null,null,null,null,{"$f":"IF(G28>1,+G28+H28+I28,\"\")","v":""},{"$f":"IF(G28>1,SUM(G28:I28)/3,\" \")","v":" "}]
[null,null,null,null,null,null,null,null,null,{"$f":"IF(G29>1,+G29+H29+I29,\"\")","v":""},{"$f":"IF(G29>1,SUM(G29:I29)/3,\" \")","v":" "}]
[null,null,null,null,null,null,null,null,null,{"$f":"IF(G30>1,+G30+H30+I30,\"\")","v":""},{"$f":"IF(G30>1,SUM(G30:I30)/3,\" \")","v":" "}]
[null,null,null,null,null,null,null,null,null,{"$f":"IF(G31>1,+G31+H31+I31,\"\")","v":""},{"$f":"IF(G31>1,SUM(G31:I31)/3,\" \")","v":" "}]

{"sheet":"Hilfstabelle","index":16,"n_rows":51,"n_cols":22,"rows_kept":51,"cut":false,"hidden":true,"merged":[[2,0,2,3],[2,5,2,6],[2,8,2,11],[3,14,3,15],[3,17,3,18]]}
[]
[]
["Spieler, bei neue Saison neue Formel bei Bahn",null,null,null,null,"Für Spielberichte",null,null,"Anhang zum Spielbericht",null,null,null,null,null,null,null,null,null,null,null,"Mitglieder","Passnummer"]
["Antritt","Datum","Bahn","Jahr",null,"Datum","Klasse",null,"Antritt","Datum","Bahn","Ausrichter",null,null,"Strafgeldliste",null,null,"Spielereinteilung",null,null,"Annegret Schmidt",19222]
["1.",{"$f":"+'Spielbogen 7er'!P4","v":"2024-09-12"},{"$f":"+B38","v":"Othmarschen"},{"$f":"+'Hilfstabelle Mannschaften'!I10","v":"2024/2025"},null,{"$f":"+B5","v":"2024-09-12"},{"$f":"+'Hilfstabelle Mannschaften'!I4","v":"B4"},null,1,{"$f":"+B5","v":"2024-09-12"},{"$f":"+C5","v":"Othmarschen"},{"$f":"+'Spielbogen 7er'!D10","v":"Panasonic 1"},{"$f":"+'Spielbogen 7er'!S4","v":"PAN 1"},null,"1. Antritt",{"$f":"+J5","v":"2024-09-12"},null,{"$f":"+B5","v":"2024-09-12"},{"$f":"IF(K5=\"Wandsbek\",\"WB\",\"OT\")","v":"OT"},null,"Deniz Hagelstein",24775]
["2.","2024-09-26",{"$f":"+B39","v":"Othmarschen"},null,null,{"$f":"+B6","v":"2024-09-26"},null,null,2,{"$f":"+B6","v":"2024-09-26"},"Othmarschen",{"$f":"+'Spielbogen 7er'!D11","v":"Dataport 2"},{"$f":"+'Spielbogen 7er'!S5","v":"DAT 2"},null,"2. Antritt",{"$f":"+J6","v":"2024-09-26"},null,"2024-09-26",{"$f":"IF(K6=\"Wandsbek\",\"WB\",\"OT\")","v":"OT"},null,"Frank Nijholt",24774]
["3.",{"$f":"+'Spielbogen 7er'!P6","v":"2024-10-10"},"Wandsbek",null,null,"2024-10-10",null,null,3,"2024-10-10","Wandsbek",{"$f":"+'Spielbogen 7er'!D12","v":"Still 3"},{"$f":"+'Spielbogen 7er'!S6","v":"STI 3"},null,"3. Antritt","2024-10-10",null,"2024-10-10","WB",null,"Ilona Wetzel",22115]
["4.",{"$f":"+'Spielbogen 7er'!P7","v":"2024-10-24"},"Othmarschen",null,null,"2024-10-24",null,null,4,"2024-10-24","Othmarschen",{"$f":"+'Spielbogen 7er'!D13","v":"SG Stern Hamburg 1"},{"$f":"+'Spielbogen 7er'!S7","v":"SGS 1"},null,"4. Antritt","2024-10-24",null,"2024-10-24","OT",null,"Jörg Frahm",19221]
["5.",{"$f":"+'Spielbogen 7er'!P8","v":"2024-11-07"},"Wandsbek",null,null,"2024-11-07",null,null,5,"2024-11-07","Wandsbek",{"$f":"+'Spielbogen 7er'!D14","v":"Justitzbehörde 2"},{"$f":"+'Spielbogen 7er'!S8","v":"JUS 2"},null,"5. Antritt","2024-11-07",null,"2024-11-07","WB",null,"Kai Roßberg",21889]
["6.",{"$f":"+'Spielbogen 7er'!P9","v":"2025-01-16"},"Wandsbek",null,null,"2025-01-16",null,null,6,"2025-01-16","Wandsbek",{"$f":"+'Spielbogen 7er'!D15","v":"Postamt 2"},{"$f":"+'Spielbogen 7er'!S9","v":"P2 2"},null,"6. Antritt","2025-01-16",null,"2025-01-16","WB",null,"Mario Jurk",23302]
["7.",{"$f":"+'Spielbogen 7er'!P10","v":"2025-01-30"},"Othmarschen",null,null,"2025-01-30",null,null,7,"2025-01-30","Othmarschen",{"$f":"+'Spielbogen 7er'!D16","v":"Körber Sports 2"},{"$f":"+'Spielbogen 7er'!S10","v":"KS 2"},null,"7. Antritt","2025-01-30",null,"2025-01-30","OT",null,"Matthias Nolte",20137]
["8.",{"$f":"+'Spielbogen 7er'!P11","v":"2025-02-13"},"Wandsbek",null,null,"2025-02-13",null,null,8,"2025-02-13","Wandsbek",{"$f":"+L5","v":"Panasonic 1"},{"$f":"+'Spielbogen 7er'!S11","v":"PAN 1"},null,"8. Antritt","2025-02-13",null,"2025-02-13","WB",null,"Michael Wetzel",22113]
["9.",{"$f":"+'Spielbogen 7er'!P12","v":"2025-02-27"},"Othmarschen",null,null,"2025-02-27",null,null,9,"2025-02-27","Othmarschen",{"$f":"+L6","v":"Dataport 2"},{"$f":"+'Spielbogen 7er'!S12","v":"DAT 2"},null,"9. Antritt","2025-02-27",null,"2025-02-27","OT"]
["10.",{"$f":"+'Spielbogen 7er'!P13","v":"2025-03-13"},"Wandsbek",null,null,"2025-03-13",null,null,10,"2025-03-13","Wandsbek","Still 3",{"$f":"+'Spielbogen 7er'!S13","v":"STI 3"},null,"10. Antritt","2025-03-13",null,"2025-03-13","WB"]
["11.",{"$f":"+'Spielbogen 7er'!P14","v":"2025-03-27"},"Othmarschen",null,null,"2025-03-27",null,null,11,"2025-03-27","Othmarschen","SG Stern Hamburg 1",{"$f":"+'Spielbogen 7er'!S14","v":"SGS 1"},null,"11. Antritt","2025-03-27",null,"2025-03-27","OT"]
["12.",{"$f":"+'Spielbogen 7er'!P15","v":"2025-04-10"},"Wandsbek",null,null,"2025-04-10",null,null,12,"2025-04-10","Wandsbek","Justitzbehörde 2",{"$f":"+'Spielbogen 7er'!S15","v":"JUS 2"},null,"12. Antritt","2025-04-10",null,"2025-04-10","WB"]
["13.",{"$f":"+'Spielbogen 7er'!P16","v":"2025-04-24"},"Othmarschen",null,null,"2025-04-24",null,null,13,"2025-04-24","Othmarschen","Postamt 2",{"$f":"+'Spielbogen 7er'!S16","v":"P2 2"},null,"13. Antritt","2025-04-24",null,"2025-04-24","OT"]
["14.",{"$f":"+'Spielbogen 7er'!P17","v":"2025-05-08"},"Wandsbek",null,null,"2025-05-08",null,null,14,"2025-05-08","Wandsbek","Körber Sports 2",{"$f":"+'Spielbogen 7er'!S17","v":"KS 2"},null,"14. Antritt","2025-05-08",null,"2025-05-08","WB"]
[]
["Spielberichte drucken",null,"Anhang zum Spielbericht",null,null,{"$f":"+Mannschaftsübersicht!D8","v":"Körber Sports 2"},{"$f":"+Mannschaftsübersicht!C8","v":"1."},{"$f":"+L5","v":"Panasonic 1"},{"$f":"+L6","v":"Dataport 2"},{"$f":"+L7","v":"Still 3"},{"$f":"+L8","v":"SG Stern Hamburg 1"},{"$f":"+L9","v":"Justitzbehörde 2"},{"$f":"+L10","v":"Postamt 2"},{"$f":"+L11","v":"Körber Sports 2"},"Körber Sports 2","Körber Sports 2","Panasonic 1"]
[null,null,null,null,null,{"$f":"+Mannschaftsübersicht!D9","v":"Panasonic 1"},{"$f":"+Mannschaftsübersicht!C9","v":"2."},{"$f":"VLOOKUP(H20,$F$20:$G$29,2,0)","v":"2."},{"$f":"VLOOKUP(I20,$F$20:$G$29,2,0)","v":"3."},"5.","4.","6.","7.","1.","1.","1.","2."]
["1. Antritt",null,null,null,null,{"$f":"+Mannschaftsübersicht!D10","v":"Dataport 2"},{"$f":"+Mannschaftsübersicht!C10","v":"3."}]
["2. Antritt",null,"2. Antritt",null,null,{"$f":"+Mannschaftsübersicht!D11","v":"SG Stern Hamburg 1"},{"$f":"+Mannschaftsübersicht!C11","v":"4."}]
["3. Antritt",null,"3. Antritt",null,null,{"$f":"+Mannschaftsübersicht!D12","v":"Still 3"},{"$f":"+Mannschaftsübersicht!C12","v":"5."}]
["4. Antritt",null,"4. Antritt",null,null,{"$f":"+Mannschaftsübersicht!D13","v":"Justitzbehörde 2"},{"$f":"+Mannschaftsübersicht!C13","v":"6."},null,null,null,null,"2024-09-12","2024-09-12"]
["5. Antritt",null,"5. Antritt",null,null,{"$f":"+Mannschaftsübersicht!D14","v":"Postamt 2"},{"$f":"+Mannschaftsübersicht!C14","v":"7."},null,null,null,null,"2024-09-26","2024-09-16"]
["6. Antritt",null,"6. Antritt",null,null,{"$f":"+Mannschaftsübersicht!D15","v":"Panasonic 1"},{"$f":"+Mannschaftsübersicht!C15","v":"8."},null,null,null,null,"2024-10-10","2024-10-10"]
["7. Antritt",null,"7. Antritt",null,null,{"$f":"+Mannschaftsübersicht!D16","v":"Dataport 2"},{"$f":"+Mannschaftsübersicht!C16","v":"9."},null,null,null,null,"2024-10-24","2024-10-24"]
["8. Antritt",null,"8. Antritt",null,null,{"$f":"+Mannschaftsübersicht!D17","v":"Still 3"},{"$f":"+Mannschaftsübersicht!C17","v":"10."},null,null,null,null,"2024-11-07","2024-11-07"]
["9. Antritt",null,"9. Antritt",null,null,null,null,null,null,null,null,"2025-01-16","2025-01-16"]
["10. Antritt",null,"10. Antritt",null,null,null,null,null,null,null,null,"2025-01-30","2025-01-30"]
["11. Antritt",null,"11. Antritt",null,null,null,null,null,null,null,null,"2025-02-13","2025-02-13"]
["12. Antritt",null,"12. Antritt",null,null,null,null,null,null,null,null,"2025-02-27","2025-02-27"]
["13. Antritt",null,"13. Antritt",null,null,null,null,null,null,null,null,"2025-03-13","2025-03-13"]
["14. Antritt",null,"14. Antritt",null,null,null,null,null,null,null,null,"2025-03-27","2025-03-27"]
[null,null,null,null,null,null,null,null,null,null,null,"2025-04-10","2025-04-10"]
[null,null,null,null,null,null,null,null,null,null,null,"2025-04-24","2025-04-24"]
[{"$f":"+'Spielbogen 7er'!N4","v":"OT"},{"$f":"IF(A38=\"OT\",\"Othmarschen\",\"Wandsbek\")","v":"Othmarschen"},null,null,null,null,null,null,null,null,null,"2025-05-08","2025-05-08"]
[{"$f":"+'Spielbogen 7er'!N5","v":"OT"},{"$f":"IF(A39=\"OT\",\"Othmarschen\",\"Wandsbek\")","v":"Othmarschen"}]
[{"$f":"+'Spielbogen 7er'!N6","v":"WB"},"Wandsbek"]
[{"$f":"+'Spielbogen 7er'!N7","v":"OT"},"Othmarschen"]
[{"$f":"+'Spielbogen 7er'!N8","v":"WB"},"Wandsbek"]
[{"$f":"+'Spielbogen 7er'!N9","v":"WB"},"Wandsbek"]
[{"$f":"+'Spielbogen 7er'!N10","v":"OT"},"Othmarschen"]
[{"$f":"+'Spielbogen 7er'!N11","v":"WB"},"Wandsbek"]
[{"$f":"+'Spielbogen 7er'!N12","v":"OT"},"Othmarschen"]
[{"$f":"+'Spielbogen 7er'!N13","v":"WB"},"Wandsbek"]
[{"$f":"+'Spielbogen 7er'!N14","v":"OT"},"Othmarschen"]
[{"$f":"+'Spielbogen 7er'!N15","v":"WB"},"Wandsbek"]
[{"$f":"+'Spielbogen 7er'!N16","v":"OT"},"Othmarschen"]
[{"$f":"+'Spielbogen 7er'!N17","v":"WB"},"Wandsbek"]

{"sheet":"Hilfstabelle Spieler","index":17,"n_rows":29,"n_cols":61,"rows_kept":29,"cut":false,"hidden":true,"merged":[[0,58,0,59],[4,0,4,1],[1,34,5,34],[1,15,1,28],[1,39,5,39],[1,38,5,38],[1,37,5,37],[1,36,5,36],[1,35,5,35],[1,32,5,32],[1,33,5,33],[3,8,3,9],[3,10,3,11],[3,4,3,5],[3,6,3,7]]}
[null,null,null,null,null,null,null,null,null,null,null,null,null,null,null,null,null,null,null,null,null,null,null,null,null,null,null,null,null,null,null,null,null,null,null,null,null,null,null,null,null,null,null,"1. Ant.","2. Ant.","3. Ant.","4. Ant.","5. Ant.","6. Ant.","7. Ant.","8. Ant.","9. Ant.","10. Ant.","11. Ant.","12. Ant.","13. Ant.","14. Ant.",null,"Summe Pins sonstige",null,"Anzahl Spiele sonstige"]
[null,null,null,null,null,null,null,null,null,null,null,null,null,null,null,"1. Mannschaft",null,null,null,null,null,null,null,null,null,null,null,null,null,null,null,null,"Annegret Schmidt","Ilona Wetzel","Jörg Frahm","Kai Roßberg","Mario Jurk","Matthias Nolte","Michael Wetzel","Deniz Hagelstein",null,"Annegret Schmidt",{"$f":"+'Annegret S.'!$J$12","v":386},{"$f":"+'Annegret S.'!$J$13","v":""},{"$f":"+'Annegret S.'!$J$14","v":426},{"$f":"+'Annegret S.'!$J$15","v":""},{"$f":"+'Annegret S.'!$J$16","v":""},{"$f":"+'Annegret S.'!$J$17","v":405},{"$f":"+'Annegret S.'!$J$18","v":""},{"$f":"+'Annegret S.'!$J$19","v":416},{"$f":"+'Annegret S.'!$J$20","v":396},{"$f":"+'Annegret S.'!$J$21","v":413},{"$f":"+'Annegret S.'!$J$22","v":""},{"$f":"+'Annegret S.'!$J$23","v":""},{"$f":"+'Annegret S.'!$J$24","v":""},{"$f":"+'Annegret S.'!$J$25","v":392},null,null,"Annegret Schmidt",{"$f":"+'Annegret S.'!H7","v":42},{"$f":"+'Annegret S.'!G7","v":5829}]
[null,"Pass.-Nr.",null,null,null,null,null,null,null,null,null,null,null,null,null,"1. Ant.","2. Ant.","3. Ant.","4. Ant.","5. Ant.","6. Ant.","7. Ant.","8. Ant.","9. Ant.","10. Ant.","11. Ant.","12. Ant.","13. Ant.","14. Ant.",null,null,null,null,null,null,null,null,null,null,null,null,"Ilona Wetzel",{"$f":"+'Ilona W.'!$J$12","v":509},{"$f":"+'Ilona W.'!$J$13","v":""},{"$f":"+'Ilona W.'!$J$14","v":423},{"$f":"+'Ilona W.'!$J$15","v":""},{"$f":"+'Ilona W.'!$J$16","v":379},{"$f":"+'Ilona W.'!$J$17","v":""},{"$f":"+'Ilona W.'!$J$18","v":""},{"$f":"+'Ilona W.'!$J$19","v":473},{"$f":"+'Ilona W.'!$J$20","v":456},{"$f":"+'Ilona W.'!$J$21","v":""},{"$f":"+'Ilona W.'!$J$22","v":""},{"$f":"+'Ilona W.'!$J$23","v":""},{"$f":"+'Ilona W.'!$J$24","v":""},{"$f":"+'Ilona W.'!$J$25","v":""},null,null,"Deniz Hagelstein",{"$f":"+'Deniz H.'!H7","v":" "},{"$f":"+'Deniz H.'!G7","v":" "}]
[null,null,null,null,"Max Wert Einzel Ergebnis",null,"Max Wert 3er Ergebnis",null,"Max Wert 4er Ergebnis",null,"Max Wert 6er Ergebnis",null,null,null,"Deniz Hagelstein",{"$f":"+'Deniz H.'!$J12","v":""},{"$f":"+'Deniz H.'!$J13","v":375},{"$f":"+'Deniz H.'!$J14","v":""},{"$f":"+'Deniz H.'!$J15","v":490},{"$f":"+'Deniz H.'!$J16","v":""},{"$f":"+'Deniz H.'!$J17","v":""},{"$f":"+'Deniz H.'!$J18","v":350},{"$f":"+'Deniz H.'!$J19","v":365},{"$f":"+'Deniz H.'!$J20","v":""},{"$f":"+'Deniz H.'!$J21","v":""},{"$f":"+'Deniz H.'!$J22","v":386},{"$f":"+'Deniz H.'!$J23","v":445},{"$f":"+'Deniz H.'!$J24","v":""},{"$f":"+'Deniz H.'!$J25","v":407},null,null,null,null,null,null,null,null,null,null,null,null,"Jörg Frahm",{"$f":"+'Jörg F.'!$J$12","v":""},{"$f":"+'Jörg F.'!$J$13","v":""},{"$f":"+'Jörg F.'!$J$14","v":""},{"$f":"+'Jörg F.'!$J$15","v":""},{"$f":"+'Jörg F.'!$J$16","v":""},{"$f":"+'Jörg F.'!$J$17","v":""},{"$f":"+'Jörg F.'!$J$18","v":""},{"$f":"+'Jörg F.'!$J$19","v":""},{"$f":"+'Jörg F.'!$J$20","v":474},{"$f":"+'Jörg F.'!$J$21","v":563},{"$f":"+'Jörg F.'!$J$22","v":481},{"$f":"+'Jörg F.'!$J$23","v":498},{"$f":"+'Jörg F.'!$J$24","v":492},{"$f":"+'Jörg F.'!$J$25","v":""},null,null,"Frank Nijholt",{"$f":"+'Frank N.'!H7","v":" "},{"$f":"+'Frank N.'!G7","v":" "}]
["Mannschaft 1",null,null,null,{"$f":"+MAX('Michael W.'!J8,'Michael W.'!V8,'Michael W.'!S8)","v":227},"Michael Wetzel",{"$f":"+'Michael W.'!L8","v":600},"Michael Wetzel",{"$f":"+MAX('Michael W.'!$R$12:$R$20)","v":721},"Michael Wetzel",{"$f":"+MAX('Michael W.'!$S$12:$S$20)","v":1090},"Michael Wetzel",null,null,"Matthias Nolte",{"$f":"+'Matthias N.'!$J12","v":""},{"$f":"+'Matthias N.'!$J13","v":406},{"$f":"+'Matthias N.'!$J14","v":""},{"$f":"+'Matthias N.'!$J15","v":365},{"$f":"+'Matthias N.'!$J16","v":""},{"$f":"+'Matthias N.'!$J17","v":""},{"$f":"+'Matthias N.'!$J18","v":350},{"$f":"+'Matthias N.'!$J19","v":""},{"$f":"+'Matthias N.'!$J20","v":""},{"$f":"+'Matthias N.'!$J21","v":""},{"$f":"+'Matthias N.'!$J22","v":491},{"$f":"+'Matthias N.'!$J23","v":""},{"$f":"+'Matthias N.'!$J24","v":388},{"$f":"+'Matthias N.'!$J25","v":""},null,null,null,null,null,null,null,null,null,null,null,null,"Kai Roßberg",{"$f":"+'Kai R.'!$J$12","v":513},{"$f":"+'Kai R.'!$J$13","v":576},{"$f":"+'Kai R.'!$J$14","v":526},{"$f":"+'Kai R.'!$J$15","v":""},{"$f":"+'Kai R.'!$J$16","v":556},{"$f":"+'Kai R.'!$J$17","v":567},{"$f":"+'Kai R.'!$J$18","v":508},{"$f":"+'Kai R.'!$J$19","v":563},{"$f":"+'Kai R.'!$J$20","v":""},{"$f":"+'Kai R.'!$J$21","v":610},{"$f":"+'Kai R.'!$J$22","v":509},{"$f":"+'Kai R.'!$J$23","v":484},{"$f":"+'Kai R.'!$J$24","v":549},{"$f":"+'Kai R.'!$J$25","v":498},null,null,"Ilona Wetzel",{"$f":"+'Ilona W.'!H7","v":34},{"$f":"+'Ilona W.'!G7","v":5294}]
["Annegret Schmidt",19222,null,null,{"$f":"+MAX('Kai R.'!J8,'Kai R.'!V8,'Kai R.'!S8)","v":246},"Kai Roßberg",{"$f":"+'Kai R.'!L8","v":610},"Kai Roßberg",{"$f":"+MAX('Kai R.'!$R$12:$R$20)","v":0},"Kai Roßberg",{"$f":"+MAX('Kai R.'!$S$12:$S$20)","v":0},"Kai Roßberg",null,null,"Jörg Frahm",{"$f":"+'Jörg F.'!$J$12","v":""},{"$f":"+'Jörg F.'!$J$13","v":""},{"$f":"+'Jörg F.'!$J$14","v":""},{"$f":"+'Jörg F.'!$J$15","v":""},{"$f":"+'Jörg F.'!$J$16","v":""},{"$f":"+'Jörg F.'!$J$17","v":""},{"$f":"+'Jörg F.'!$J$18","v":""},{"$f":"+'Jörg F.'!$J$19","v":""},{"$f":"+'Jörg F.'!$J$20","v":474},{"$f":"+'Jörg F.'!$J$21","v":563},{"$f":"+'Jörg F.'!$J$22","v":481},{"$f":"+'Jörg F.'!$J$23","v":498},{"$f":"+'Jörg F.'!$J$24","v":492},{"$f":"+'Jörg F.'!$J$25","v":""},null,null,null,null,null,null,null,null,null,null,null,null,"Mario Jurk",{"$f":"+'Mario J.'!$J$12","v":""},{"$f":"+'Mario J.'!$J$13","v":555},{"$f":"+'Mario J.'!$J$14","v":""},{"$f":"+'Mario J.'!$J$15","v":""},{"$f":"+'Mario J.'!$J$16","v":568},{"$f":"+'Mario J.'!$J$17","v":510},{"$f":"+'Mario J.'!$J$18","v":478},{"$f":"+'Mario J.'!$J$19","v":""},{"$f":"+'Mario J.'!$J$20","v":506},{"$f":"+'Mario J.'!$J$21","v":""},{"$f":"+'Mario J.'!$J$22","v":""},{"$f":"+'Mario J.'!$J$23","v":""},{"$f":"+'Mario J.'!$J$24","v":""},{"$f":"+'Mario J.'!$J$25","v":628},null,null,"Jörg Frahm",{"$f":"+'Jörg F.'!H7","v":16},{"$f":"+'Jörg F.'!G7","v":2792}]
["Deniz Hagelstein",24775,null,null,{"$f":"+MAX('Mario J.'!J8,'Mario J.'!V8,'Mario J.'!S8)","v":245},"Mario Jurk",{"$f":"+'Mario J.'!L8","v":628},"Mario Jurk",{"$f":"+MAX('Mario J.'!$R$12:$R$20)","v":0},"Mario Jurk",{"$f":"+MAX('Mario J.'!$S$12:$S$20)","v":0},"Mario Jurk",null,null,"Michael Wetzel",{"$f":"+'Michael W.'!$J$12","v":506},{"$f":"+'Michael W.'!$J$13","v":""},{"$f":"+'Michael W.'!$J$14","v":600},{"$f":"+'Michael W.'!$J$15","v":522},{"$f":"+'Michael W.'!$J$16","v":""},{"$f":"+'Michael W.'!$J$17","v":""},{"$f":"+'Michael W.'!$J$18","v":""},{"$f":"+'Michael W.'!$J$19","v":""},{"$f":"+'Michael W.'!$J$20","v":""},{"$f":"+'Michael W.'!$J$21","v":""},{"$f":"+'Michael W.'!$J$22","v":""},{"$f":"+'Michael W.'!$J$23","v":""},{"$f":"+'Michael W.'!$J$24","v":471},{"$f":"+'Michael W.'!$J$25","v":""},null,null,"1. Antritt",{"$f":"+'Annegret S.'!$J$12","v":386},{"$f":"+'Ilona W.'!$J$12","v":509},{"$f":"+'Jörg F.'!$J$12","v":""},{"$f":"+'Kai R.'!$J$13","v":576},{"$f":"+'Mario J.'!$J$12","v":""},{"$f":"+'Matthias N.'!$J$12","v":""},{"$f":"+'Michael W.'!$J$12","v":506},{"$f":"+'Deniz H.'!$J$12","v":""},null,"Matthias Nolte",{"$f":"+'Matthias N.'!$J$12","v":""},{"$f":"+'Matthias N.'!$J$13","v":406},{"$f":"+'Matthias N.'!$J$14","v":""},{"$f":"+'Matthias N.'!$J$15","v":365},{"$f":"+'Matthias N.'!$J$16","v":""},{"$f":"+'Matthias N.'!$J$17","v":""},{"$f":"+'Matthias N.'!$J$18","v":350},{"$f":"+'Matthias N.'!$J$19","v":""},{"$f":"+'Matthias N.'!$J$20","v":""},{"$f":"+'Matthias N.'!$J$21","v":""},{"$f":"+'Matthias N.'!$J$22","v":491},{"$f":"+'Matthias N.'!$J$23","v":""},{"$f":"+'Matthias N.'!$J$24","v":388},{"$f":"+'Matthias N.'!$J$25","v":""},null,null,"Kai Roßberg",{"$f":"+'Kai R.'!H7","v":" "},{"$f":"+'Kai R.'!G7","v":" "}]
["Frank Nijholt",24774,null,null,{"$f":"+MAX('Jörg F.'!J8,'Jörg F.'!V8,'Jörg F.'!S8)","v":221},"Jörg Frahm",{"$f":"+'Jörg F.'!L8","v":563},"Jörg Frahm",{"$f":"+MAX('Jörg F.'!$R$12:$R$20)","v":742},"Jörg Frahm",{"$f":"+MAX('Jörg F.'!$S$12:$S$20)","v":1059},"Jörg Frahm",null,null,"Kai Roßberg",{"$f":"+'Kai R.'!$J$12","v":513},{"$f":"+'Kai R.'!$J$13","v":576},{"$f":"+'Kai R.'!$J$14","v":526},{"$f":"+'Kai R.'!$J$15","v":""},{"$f":"+'Kai R.'!$J$16","v":556},{"$f":"+'Kai R.'!$J$17","v":567},{"$f":"+'Kai R.'!$J$18","v":508},{"$f":"+'Kai R.'!$J$19","v":563},{"$f":"+'Kai R.'!$J$20","v":""},{"$f":"+'Kai R.'!$J$21","v":610},{"$f":"+'Kai R.'!$J$22","v":509},{"$f":"+'Kai R.'!$J$23","v":484},{"$f":"+'Kai R.'!$J$24","v":549},{"$f":"+'Kai R.'!$J$25","v":498},null,null,"2. Antritt",{"$f":"+'Annegret S.'!$J$13","v":""},{"$f":"+'Ilona W.'!$J$13","v":""},{"$f":"+'Jörg F.'!$J$13","v":""},{"$f":"+'Kai R.'!$J$14","v":526},{"$f":"+'Mario J.'!$J$13","v":555},{"$f":"+'Matthias N.'!$J$13","v":406},{"$f":"+'Michael W.'!$J$13","v":""},{"$f":"+'Deniz H.'!$J$13","v":375},null,"Michael Wetzel",{"$f":"+'Michael W.'!$J$12","v":506},{"$f":"+'Michael W.'!$J$13","v":""},{"$f":"+'Michael W.'!$J$14","v":600},{"$f":"+'Michael W.'!$J$15","v":522},{"$f":"+'Michael W.'!$J$16","v":""},{"$f":"+'Michael W.'!$J$17","v":""},{"$f":"+'Michael W.'!$J$18","v":""},{"$f":"+'Michael W.'!$J$19","v":""},{"$f":"+'Michael W.'!$J$20","v":""},{"$f":"+'Michael W.'!$J$21","v":""},{"$f":"+'Michael W.'!$J$22","v":""},{"$f":"+'Michael W.'!$J$23","v":""},{"$f":"+'Michael W.'!$J$24","v":471},{"$f":"+'Michael W.'!$J$25","v":""},null,null,"Mario Jurk",{"$f":"+'Mario J.'!H7","v":" "},{"$f":"+'Mario J.'!G7","v":" "}]
["Ilona Wetzel",22115,null,null,{"$f":"+MAX('Matthias N.'!$J$8,'Matthias N.'!$V$8,'Matthias N.'!$S$8)","v":185},"Matthias Nolte",{"$f":"+'Matthias N.'!$L$8","v":491},"Matthias Nolte",{"$f":"+MAX('Matthias N.'!$R$12:$R$20)","v":0},"Matthias Nolte",{"$f":"+MAX('Matthias N.'!$S$12:$S$20)","v":0},"Matthias Nolte",null,null,"Mario Jurk",{"$f":"+'Mario J.'!$J$12","v":""},{"$f":"+'Mario J.'!$J$13","v":555},{"$f":"+'Mario J.'!$J$14","v":""},{"$f":"+'Mario J.'!$J$15","v":""},{"$f":"+'Mario J.'!$J$16","v":568},{"$f":"+'Mario J.'!$J$17","v":510},{"$f":"+'Mario J.'!$J$18","v":478},{"$f":"+'Mario J.'!$J$19","v":""},{"$f":"+'Mario J.'!$J$20","v":506},{"$f":"+'Mario J.'!$J$21","v":""},{"$f":"+'Mario J.'!$J$22","v":""},{"$f":"+'Mario J.'!$J$23","v":""},{"$f":"+'Mario J.'!$J$24","v":""},{"$f":"+'Mario J.'!$J$25","v":628},null,null,"3. Antritt",{"$f":"+'Annegret S.'!$J$14","v":426},{"$f":"+'Ilona W.'!$J$14","v":423},{"$f":"+'Jörg F.'!$J$14","v":""},{"$f":"+'Kai R.'!$J$15","v":""},{"$f":"+'Mario J.'!$J$14","v":""},{"$f":"+'Matthias N.'!$J$14","v":""},{"$f":"+'Michael W.'!$J$14","v":600},{"$f":"+'Deniz H.'!$J$14","v":""},null,"Deniz Hagelstein",{"$f":"+'Deniz H.'!$J$12","v":""},{"$f":"+'Deniz H.'!$J$13","v":375},{"$f":"+'Deniz H.'!$J$14","v":""},{"$f":"+'Deniz H.'!$J$15","v":490},{"$f":"+'Deniz H.'!$J$16","v":""},{"$f":"+'Deniz H.'!$J$17","v":""},{"$f":"+'Deniz H.'!$J$18","v":350},{"$f":"+'Deniz H.'!$J$19","v":365},{"$f":"+'Deniz H.'!$J$20","v":""},{"$f":"+'Deniz H.'!$J$21","v":""},{"$f":"+'Deniz H.'!$J$22","v":386},{"$f":"+'Deniz H.'!$J$23","v":445},{"$f":"+'Deniz H.'!$J$24","v":""},{"$f":"+'Deniz H.'!$J$25","v":407},null,null,"Matthias Nolte",{"$f":"+'Matthias N.'!H7","v":" "},{"$f":"+'Matthias N.'!G7","v":" "}]
["Jörg Frahm",19221,null,null,{"$f":"+MAX('Deniz H.'!$J$8,'Deniz H.'!$V$8,'Deniz H.'!$S$8)","v":179},"Deniz Hagelstein",{"$f":"+'Deniz H.'!$L$8","v":490},"Deniz Hagelstein",{"$f":"+MAX('Deniz H.'!$R$12:$R$20)","v":0},"Deniz Hagelstein",{"$f":"+MAX('Deniz H.'!$S$12:$S$20)","v":0},"Deniz Hagelstein",null,null,"Ilona Wetzel",{"$f":"+'Ilona W.'!$J$12","v":509},{"$f":"+'Ilona W.'!$J$13","v":""},{"$f":"+'Ilona W.'!$J$14","v":423},{"$f":"+'Ilona W.'!$J$15","v":""},{"$f":"+'Ilona W.'!$J$16","v":379},{"$f":"+'Ilona W.'!$J$17","v":""},{"$f":"+'Ilona W.'!$J$18","v":""},{"$f":"+'Ilona W.'!$J$19","v":473},{"$f":"+'Ilona W.'!$J$20","v":456},{"$f":"+'Ilona W.'!$J$21","v":""},{"$f":"+'Ilona W.'!$J$22","v":""},{"$f":"+'Ilona W.'!$J$23","v":""},{"$f":"+'Ilona W.'!$J$24","v":""},{"$f":"+'Ilona W.'!$J$25","v":""},null,null,"4. Antritt",{"$f":"+'Annegret S.'!$J$15","v":""},{"$f":"+'Ilona W.'!$J$15","v":""},{"$f":"+'Jörg F.'!$J$15","v":""},{"$f":"+'Kai R.'!$J$16","v":556},{"$f":"+'Mario J.'!$J$15","v":""},{"$f":"+'Matthias N.'!$J$15","v":365},{"$f":"+'Michael W.'!$J$15","v":522},{"$f":"+'Deniz H.'!$J$15","v":490},null,null,null,null,null,null,null,null,null,null,null,null,null,null,null,null,null,null,"Michael Wetzel",{"$f":"+'Michael W.'!H7","v":16},{"$f":"+'Michael W.'!G7","v":2851}]
["Kai Roßberg",21889,null,null,{"$f":"+MAX('Frank N.'!$J$8,'Frank N.'!$V$8,'Frank N.'!$S$8)","v":180},"Frank Nijholt",{"$f":"+'Frank N.'!$L$8","v":431},"Frank Nijholt",{"$f":"+MAX('Frank N.'!$R$12:$R$20)","v":0},"Frank Nijholt",{"$f":"+MAX('Frank N.'!$S$12:$S$20)","v":0},"Frank Nijholt",null,null,"Annegret Schmidt",{"$f":"+'Annegret S.'!$J$12","v":386},{"$f":"+'Annegret S.'!$J$13","v":""},{"$f":"+'Annegret S.'!$J$14","v":426},{"$f":"+'Annegret S.'!$J$15","v":""},{"$f":"+'Annegret S.'!$J$16","v":""},{"$f":"+'Annegret S.'!$J$17","v":405},{"$f":"+'Annegret S.'!$J$18","v":""},{"$f":"+'Annegret S.'!$J$19","v":416},{"$f":"+'Annegret S.'!$J$20","v":396},{"$f":"+'Annegret S.'!$J$21","v":413},{"$f":"+'Annegret S.'!$J$22","v":""},{"$f":"+'Annegret S.'!$J$23","v":""},{"$f":"+'Annegret S.'!$J$24","v":""},{"$f":"+'Annegret S.'!$J$25","v":392},null,null,"5. Antritt",{"$f":"+'Annegret S.'!$J$16","v":""},{"$f":"+'Ilona W.'!$J$16","v":379},{"$f":"+'Jörg F.'!$J$16","v":""},{"$f":"+'Kai R.'!$J$17","v":567},{"$f":"+'Mario J.'!$J$16","v":568},{"$f":"+'Matthias N.'!$J$16","v":""},{"$f":"+'Michael W.'!$J$16","v":""},{"$f":"+'Deniz H.'!$J$17","v":""},null,null,null,null,null,null,null,null,null,null,null,null,null,null,null,null,null,null,"Gesamt",{"$f":"SUM(BH2:BH10)","v":108},{"$f":"SUM(BI2:BI10)","v":16766}]
["Mario Jurk",23302,null,null,null,null,{"$f":"+G10/3","v":163.33333333333334},null,{"$f":"+I10/4","v":0},null,{"$f":"+K10/6","v":0},null,null,null,"Frank Nijholt",{"$f":"+'Frank N.'!$J$12","v":""},{"$f":"+'Frank N.'!$J$13","v":""},{"$f":"+'Frank N.'!$J$14","v":""},{"$f":"+'Frank N.'!$J$15","v":400},{"$f":"+'Frank N.'!$J$16","v":404},{"$f":"+'Frank N.'!$J$17","v":398},{"$f":"+'Frank N.'!$J$18","v":""},{"$f":"+'Frank N.'!$J$19","v":""},{"$f":"+'Frank N.'!$J$20","v":""},{"$f":"+'Frank N.'!$J$21","v":431},{"$f":"+'Frank N.'!$J$22","v":""},{"$f":"+'Frank N.'!$J$23","v":418},{"$f":"+'Frank N.'!$J$24","v":""},{"$f":"+'Frank N.'!$J$25","v":""},null,null,"6. Antritt",{"$f":"+'Annegret S.'!$J$17","v":405},{"$f":"+'Ilona W.'!$J$17","v":""},{"$f":"+'Jörg F.'!$J$17","v":""},{"$f":"+'Kai R.'!$J$18","v":508},{"$f":"+'Mario J.'!$J$17","v":510},{"$f":"+'Matthias N.'!$J$17","v":""},{"$f":"+'Michael W.'!$J$17","v":""},{"$f":"+'Deniz H.'!$J$17","v":""}]
["Matthias Nolte",20137,null,null,{"$f":"MAX(E5:E11)","v":246},{"$f":"VLOOKUP(E13,E5:F10,2,0)","v":"Kai Roßberg"},{"$f":"MAX(G5:G11)","v":628},{"$f":"VLOOKUP(G13,G5:H10,2,0)","v":"Mario Jurk"},{"$f":"MAX(I5:I11)","v":742},{"$f":"VLOOKUP(I13,I5:J10,2,0)","v":"Jörg Frahm"},{"$f":"MAX(K5:K11)","v":1090},{"$f":"VLOOKUP(K13,K5:L10,2,0)","v":"Michael Wetzel"},null,null,null,null,null,null,null,null,null,null,null,null,null,null,null,null,null,null,null,"7. Antritt",{"$f":"+'Annegret S.'!$J$18","v":""},{"$f":"+'Ilona W.'!$J$18","v":""},{"$f":"+'Jörg F.'!$J$18","v":""},{"$f":"+'Kai R.'!$J$19","v":563},{"$f":"+'Mario J.'!$J$18","v":478},{"$f":"+'Matthias N.'!$J$18","v":350},{"$f":"+'Michael W.'!$J$18","v":""},{"$f":"+'Deniz H.'!$J$18","v":350}]
["Michael Wetzel",22113,null,null,null,null,{"$f":"+G13/3","v":209.33333333333334},null,{"$f":"+I13/4","v":185.5},null,{"$f":"+K13/6","v":181.66666666666666},null,null,null,null,null,null,null,null,null,null,null,null,null,null,null,null,null,null,null,null,"8. Antritt",{"$f":"+'Annegret S.'!$J$19","v":416},{"$f":"+'Ilona W.'!$J$19","v":473},{"$f":"+'Jörg F.'!$J$19","v":""},{"$f":"+'Kai R.'!$J$20","v":""},{"$f":"+'Mario J.'!$J$19","v":""},{"$f":"+'Matthias N.'!$J$19","v":""},{"$f":"+'Michael W.'!$J$19","v":""},{"$f":"+'Deniz H.'!$J$19","v":365}]
[null,null,null,null,{"$f":"+MAX('Annegret S.'!J8,'Annegret S.'!V8,'Annegret S.'!S8)","v":168},"Annegret Schmidt",{"$f":"+'Annegret S.'!L8","v":426},"Annegret Schmidt",{"$f":"+MAX('Annegret S.'!$R$12:$R$20)","v":574},"Annegret Schmidt",{"$f":"+MAX('Annegret S.'!$S$12:$S$20)","v":892},"Annegret Schmidt",null,null,null,null,null,null,null,null,null,null,null,null,null,null,null,null,null,null,null,"9. Antritt",{"$f":"+'Annegret S.'!$J$20","v":396},{"$f":"+'Ilona W.'!$J$20","v":456},{"$f":"+'Jörg F.'!$J$20","v":474},{"$f":"+'Kai R.'!$J$21","v":610},{"$f":"+'Mario J.'!$J$20","v":506},{"$f":"+'Matthias N.'!$J$20","v":""},{"$f":"+'Michael W.'!$J$20","v":""},{"$f":"+'Deniz H.'!$J$20","v":""}]
[null,null,null,null,{"$f":"+MAX('Ilona W.'!J8,'Ilona W.'!V8,'Ilona W.'!S8)","v":202},"Ilona Wetzel",{"$f":"+'Ilona W.'!L8","v":509},"Ilona Wetzel",{"$f":"+MAX('Ilona W.'!$R$12:$R$20)","v":557},"Ilona Wetzel",{"$f":"+MAX('Ilona W.'!$S$12:$S$20)","v":1024},"Ilona Wetzel",null,null,null,null,null,null,null,null,null,null,null,null,null,null,null,null,null,null,null,"10. Antritt",{"$f":"+'Annegret S.'!$J$21","v":413},{"$f":"+'Ilona W.'!$J$21","v":""},{"$f":"+'Jörg F.'!$J$21","v":563},{"$f":"+'Kai R.'!$J$22","v":509},{"$f":"+'Mario J.'!$J$21","v":""},{"$f":"+'Matthias N.'!$J$21","v":""},{"$f":"+'Michael W.'!$J$21","v":""},{"$f":"+'Deniz H.'!$J$21","v":""}]
[null,null,null,null,null,null,null,null,null,null,null,null,null,null,null,null,null,null,null,null,null,null,null,null,null,null,null,null,null,null,null,"11. Antritt",{"$f":"+'Annegret S.'!$J$22","v":""},{"$f":"+'Ilona W.'!$J$22","v":""},{"$f":"+'Jörg F.'!$J$22","v":481},{"$f":"+'Kai R.'!$J$23","v":484},{"$f":"+'Mario J.'!$J$22","v":""},{"$f":"+'Matthias N.'!$J$22","v":491},{"$f":"+'Michael W.'!$J$22","v":""},{"$f":"+'Deniz H.'!$J$22","v":386}]
[null,null,null,null,{"$f":"MAX(E15:E16)","v":202},{"$f":"VLOOKUP(E18,E15:F16,2,0)","v":"Ilona Wetzel"},{"$f":"MAX(G15:G16)","v":509},{"$f":"VLOOKUP(G18,G15:H16,2,0)","v":"Ilona Wetzel"},{"$f":"MAX(I15:I16)","v":574},{"$f":"VLOOKUP(I18,I15:J16,2,0)","v":"Annegret Schmidt"},{"$f":"MAX(K15:K16)","v":1024},{"$f":"VLOOKUP(K18,K15:L16,2,0)","v":"Ilona Wetzel"},null,null,null,null,null,null,null,null,null,null,null,null,null,null,null,null,null,null,null,"12. Antritt",{"$f":"+'Annegret S.'!$J$23","v":""},{"$f":"+'Ilona W.'!$J$23","v":""},{"$f":"+'Jörg F.'!$J$23","v":498},{"$f":"+'Kai R.'!$J$24","v":549},{"$f":"+'Mario J.'!$J$23","v":""},{"$f":"+'Matthias N.'!$J$23","v":""},{"$f":"+'Michael W.'!$J$23","v":""},{"$f":"+'Deniz H.'!$J$23","v":445}]
[null,null,null,null,null,null,{"$f":"+G18/3","v":169.66666666666666},null,{"$f":"+I18/4","v":143.5},null,{"$f":"+K18/6","v":170.66666666666666},null,null,null,null,null,null,null,null,null,null,null,null,null,null,null,null,null,null,null,null,"13. Antritt",{"$f":"+'Annegret S.'!$J$24","v":""},{"$f":"+'Ilona W.'!$J$24","v":""},{"$f":"+'Jörg F.'!$J$24","v":492},{"$f":"+'Kai R.'!$J$25","v":498},{"$f":"+'Mario J.'!$J$24","v":""},{"$f":"+'Matthias N.'!$J$24","v":388},{"$f":"+'Michael W.'!$J$24","v":471},{"$f":"+'Deniz H.'!$J$24","v":""}]
[null,null,null,null,null,null,null,null,null,null,null,null,null,null,null,null,null,null,null,null,null,null,null,null,null,null,null,null,null,null,null,"14. Antritt",{"$f":"+'Annegret S.'!$J$25","v":392},{"$f":"+'Ilona W.'!$J$25","v":""},{"$f":"+'Jörg F.'!$J$25","v":""},{"$f":"+'Kai R.'!$K$26","v":0},{"$f":"+'Mario J.'!$J$25","v":628},{"$f":"+'Matthias N.'!$J$25","v":""},{"$f":"+'Michael W.'!$J$25","v":""},{"$f":"+'Deniz H.'!$J$25","v":407}]
[]
[]
[]
[]
[null,null,null,null,"Zuletzt aktualisiert am:",{"$f":"NOW()","v":"2025-05-13T21:35:45.910"},">>>>>>>>>",{"$f":"'Hilfstabelle Spieler'!$E$25&\"  \"&TEXT('Hilfstabelle Spieler'!$F$25,\"TT.MM.JJJJ\")","v":"Zuletzt aktualisiert am:  13.05.2025"}]
[null,null,null,null,null,null,null,{"$f":"'Hilfstabelle Spieler'!$E$25&\"  \"&TEXT('Hilfstabelle Spieler'!$F$25,\"hh:mm:ss\")","v":"Zuletzt aktualisiert am:  21:35:46"}]
[]
[null,null,null,null,null,null,null,{"$f":"+H26","v":"Zuletzt aktualisiert am:  21:35:46"}]
[null,null,null,null,null,null,null,{"$f":"NOW()","v":45790.899836921293}]

{"sheet":"Hilfstabelle Mannschaften","index":18,"n_rows":91,"n_cols":80,"rows_kept":91,"cut":false,"hidden":true,"merged":[[57,67,59,78],[57,79,59,90],[60,67,64,78],[60,79,64,90],[65,67,67,78],[65,79,67,90],[44,67,48,78],[49,67,51,78],[44,79,48,90],[49,79,51,90],[52,67,56,78],[52,79,56,90],[76,67,80,78],[77,49,80,51],[77,54,80,64],[81,67,83,78],[81,79,83,90],[76,79,80,90],[61,49,64,51],[65,49,66,51],[73,67,75,78],[68,79,72,90],[73,79,75,90],[68,67,72,78],[44,49,48,51],[49,49,50,51],[81,49,82,51],[44,54,48,64],[49,54,50,64],[57,49,58,51],[57,54,58,64],[53,54,56,64],[53,49,56,51],[81,54,82,64],[61,54,64,64],[65,54,66,64],[69,49,72,51],[73,49,74,51],[69,54,72,64],[73,54,74,64],[87,16,87,27],[42,16,42,27],[47,16,47,27],[52,16,52,27],[57,16,57,27],[62,16,62,27],[67,16,67,27],[72,16,72,27],[77,16,77,27],[0,30,0,35],[22,16,22,27],[27,16,27,27],[32,16,32,27],[1,30,1,31],[0,7,0,9],[1,1,1,5],[1,7,1,8],[82,16,82,27],[37,16,37,27],[1,16,1,27],[1,37,1,40],[1,42,1,45],[1,47,1,49],[1,34,1,35],[1,32,1,33]]}
[null,null,null,null,null,null,null,null,null,null,null,null,null,null,null,null,null,null,null,null,null,null,null,null,null,null,null,null,null,null,"Punkte aus den Antritten der 1. Mannschaft für den Spielsystembogen"]
[null,"1. Mannschaft Ausrichter",null,null,null,null,null,"Mannschaftsklassen",null,null,null,"Übersicht aller Mannschaften / Pins",null,null,null,null,{"$f":"\"1. Mannschaft \"&I4","v":"1. Mannschaft B4"},null,null,null,null,null,null,null,null,null,null,null,null,null,"1. Mannschaft",null,null,null,null,null,null,"1. Mannschaft"]
[null,"Antritt","Datum","Bahn","BSG","BSG-Kurzf.",null,"Mannschaft","Klasse",null,null,"1. Mannschaft","Pins",null,null,null,{"$f":"+'Spielbogen 7er'!I10","v":"PAN 1"},{"$f":"+'Spielbogen 7er'!I11","v":"DAT 2"},{"$f":"+'Spielbogen 7er'!I12","v":"STI 3"},{"$f":"+'Spielbogen 7er'!I13","v":"SGS 1"},{"$f":"+'Spielbogen 7er'!I14","v":"JUS 2"},{"$f":"+'Spielbogen 7er'!I15","v":"P2 2"},{"$f":"+'Spielbogen 7er'!I16","v":"KS 2"},{"$f":"+'Spielbogen 7er'!$G$16","v":0},{"$f":"+'Spielbogen 7er'!$G$17","v":0},{"$f":"+'Spielbogen 7er'!$G$18","v":0},null,null,null,null,{"$f":"+#REF!","v":{"$error":"#REF!"}},{"$f":"+#REF!","v":{"$error":"#REF!"}},null,null,null,null,null,{"$f":"+#REF!","v":{"$error":"#REF!"}},{"$f":"+#REF!","v":{"$error":"#REF!"}},{"$f":"+#REF!","v":{"$error":"#REF!"}},{"$f":"VLOOKUP(AM3,$E$4:$F$13,2,0)","v":{"$error":"#REF!"}}]
[null,{"$f":"+'Spielbogen 7er'!M4","v":"1."},{"$f":"+'Spielbogen 7er'!P4","v":"2024-09-12"},{"$f":"+'Spielbogen 7er'!N4","v":"OT"},{"$f":"+'Spielbogen 7er'!D10","v":"Panasonic 1"},{"$f":"+'Spielbogen 7er'!S4","v":"PAN 1"},null,"1. Mannschaft","B4",null,null,{"$f":"+$E$4","v":"Panasonic 1"},{"$f":"+'Übersicht der Klasse B4'!$F$8","v":26254},null,null,"1. Antritt",{"$f":"+'Übersicht der Klasse B4'!$H$8","v":1914},{"$f":"+'Übersicht der Klasse B4'!$H$10","v":1586},{"$f":"+'Übersicht der Klasse B4'!$H$12","v":1732},{"$f":"+'Übersicht der Klasse B4'!$H$14","v":1528},{"$f":"+'Übersicht der Klasse B4'!$H$16","v":1349},{"$f":"+'Übersicht der Klasse B4'!$H$18","v":1740},{"$f":"+'Übersicht der Klasse B4'!$H$20","v":1229},{"$f":"+'Übersicht der Klasse B4'!$H$22","v":1229},{"$f":"+'Übersicht der Klasse B4'!$H$24","v":{"$error":"#N/A"}},{"$f":"+'Übersicht der Klasse B4'!$H$26","v":{"$error":"#N/A"}},{"$f":"+'Übersicht der Klasse B4'!$H$28","v":0},{"$f":"+'Übersicht der Klasse B4'!$H$30","v":0},null,null,{"$f":"+#REF!","v":{"$error":"#REF!"}},{"$f":"+#REF!","v":{"$error":"#REF!"}},null,null,null,null,null,{"$f":"+#REF!","v":{"$error":"#REF!"}},{"$f":"+#REF!","v":{"$error":"#REF!"}},{"$f":"+#REF!","v":{"$error":"#REF!"}},{"$error":"#REF!"}]
[null,{"$f":"+'Spielbogen 7er'!M5","v":"2."},{"$f":"+'Spielbogen 7er'!P5","v":"2024-09-26"},{"$f":"+'Spielbogen 7er'!N5","v":"OT"},{"$f":"+'Spielbogen 7er'!D11","v":"Dataport 2"},{"$f":"+'Spielbogen 7er'!S5","v":"DAT 2"},null,null,null,null,null,{"$f":"+$E$5","v":"Dataport 2"},{"$f":"+'Übersicht der Klasse B4'!$F$10","v":25261},null,null,"2. Antritt",{"$f":"+'Übersicht der Klasse B4'!$I$8","v":1912},{"$f":"+'Übersicht der Klasse B4'!$I$10","v":1748},{"$f":"+'Übersicht der Klasse B4'!$I$12","v":1572},{"$f":"+'Übersicht der Klasse B4'!$I$14","v":1637},{"$f":"+'Übersicht der Klasse B4'!$I$16","v":1664},{"$f":"+'Übersicht der Klasse B4'!$I$18","v":1761},{"$f":"+'Übersicht der Klasse B4'!$I$20","v":1282},{"$f":"+'Übersicht der Klasse B4'!$I$22","v":1282},{"$f":"+'Übersicht der Klasse B4'!$I$24","v":{"$error":"#N/A"}},{"$f":"+'Übersicht der Klasse B4'!$I$26","v":{"$error":"#N/A"}},{"$f":"+'Übersicht der Klasse B4'!$I$28","v":0},{"$f":"+'Übersicht der Klasse B4'!$I$30","v":0},null,null,{"$f":"+#REF!","v":{"$error":"#REF!"}},{"$f":"+#REF!","v":{"$error":"#REF!"}},null,null,null,null,null,{"$f":"+#REF!","v":{"$error":"#REF!"}},{"$f":"+#REF!","v":{"$error":"#REF!"}},{"$f":"+#REF!","v":{"$error":"#REF!"}},{"$error":"#REF!"}]
[null,{"$f":"+'Spielbogen 7er'!M6","v":"3."},{"$f":"+'Spielbogen 7er'!P6","v":"2024-10-10"},{"$f":"+'Spielbogen 7er'!N6","v":"WB"},{"$f":"+'Spielbogen 7er'!D12","v":"Still 3"},{"$f":"+'Spielbogen 7er'!S6","v":"STI 3"},null,null,null,null,null,{"$f":"+$E$6","v":"Still 3"},{"$f":"+'Übersicht der Klasse B4'!$F$12","v":24708},null,null,"3. Antritt",{"$f":"+'Übersicht der Klasse B4'!$J$8","v":1975},{"$f":"+'Übersicht der Klasse B4'!$J$10","v":1606},{"$f":"+'Übersicht der Klasse B4'!$J$12","v":1805},{"$f":"+'Übersicht der Klasse B4'!$J$14","v":1502},{"$f":"+'Übersicht der Klasse B4'!$J$16","v":1609},{"$f":"+'Übersicht der Klasse B4'!$J$18","v":1781},{"$f":"+'Übersicht der Klasse B4'!$J$20","v":1909},{"$f":"+'Übersicht der Klasse B4'!$J$22","v":1909},{"$f":"+'Übersicht der Klasse B4'!$J$24","v":{"$error":"#N/A"}},{"$f":"+'Übersicht der Klasse B4'!$J$26","v":{"$error":"#N/A"}},{"$f":"+'Übersicht der Klasse B4'!$J$28","v":0},{"$f":"+'Übersicht der Klasse B4'!$J$30","v":0},null,null,{"$f":"+#REF!","v":{"$error":"#REF!"}},{"$f":"+#REF!","v":{"$error":"#REF!"}},null,null,null,null,null,{"$f":"+#REF!","v":{"$error":"#REF!"}},{"$f":"+#REF!","v":{"$error":"#REF!"}},{"$f":"+#REF!","v":{"$error":"#REF!"}},{"$error":"#REF!"}]
[null,{"$f":"+'Spielbogen 7er'!M7","v":"4."},{"$f":"+'Spielbogen 7er'!P7","v":"2024-10-24"},{"$f":"+'Spielbogen 7er'!N7","v":"OT"},{"$f":"+'Spielbogen 7er'!D13","v":"SG Stern Hamburg 1"},{"$f":"+'Spielbogen 7er'!S7","v":"SGS 1"},null,null,null,null,null,{"$f":"+$E$7","v":"SG Stern Hamburg 1"},{"$f":"+'Übersicht der Klasse B4'!$F$14","v":24600},null,null,"4. Antritt",{"$f":"+'Übersicht der Klasse B4'!$K$8","v":1777},{"$f":"+'Übersicht der Klasse B4'!$K$10","v":1733},{"$f":"+'Übersicht der Klasse B4'!$K$12","v":1788},{"$f":"+'Übersicht der Klasse B4'!$K$14","v":1714},{"$f":"+'Übersicht der Klasse B4'!$K$16","v":1734},{"$f":"+'Übersicht der Klasse B4'!$K$18","v":1659},{"$f":"+'Übersicht der Klasse B4'!$K$20","v":1952},{"$f":"+'Übersicht der Klasse B4'!$K$22","v":1952},{"$f":"+'Übersicht der Klasse B4'!$K$24","v":{"$error":"#N/A"}},{"$f":"+'Übersicht der Klasse B4'!$K$26","v":{"$error":"#N/A"}},{"$f":"+'Übersicht der Klasse B4'!$K$28","v":0},{"$f":"+'Übersicht der Klasse B4'!$K$30","v":0},null,null,{"$f":"+#REF!","v":{"$error":"#REF!"}},{"$f":"+#REF!","v":{"$error":"#REF!"}},null,null,null,null,null,{"$f":"+#REF!","v":{"$error":"#REF!"}},{"$f":"+#REF!","v":{"$error":"#REF!"}},{"$f":"+#REF!","v":{"$error":"#REF!"}},{"$error":"#REF!"}]
[null,{"$f":"+'Spielbogen 7er'!M8","v":"5."},{"$f":"+'Spielbogen 7er'!P8","v":"2024-11-07"},{"$f":"+'Spielbogen 7er'!N8","v":"WB"},{"$f":"+'Spielbogen 7er'!D14","v":"Justitzbehörde 2"},{"$f":"+'Spielbogen 7er'!S8","v":"JUS 2"},null,"PUNKTSPIELSAISON ","2024/2025",null,null,{"$f":"+$E$8","v":"Justitzbehörde 2"},{"$f":"+'Übersicht der Klasse B4'!$F$16","v":24257},null,null,"5. Antritt",{"$f":"+'Übersicht der Klasse B4'!$L$8","v":1907},{"$f":"+'Übersicht der Klasse B4'!$L$10","v":1849},{"$f":"+'Übersicht der Klasse B4'!$L$12","v":1806},{"$f":"+'Übersicht der Klasse B4'!$L$14","v":1897},{"$f":"+'Übersicht der Klasse B4'!$L$16","v":1811},{"$f":"+'Übersicht der Klasse B4'!$L$18","v":1759},{"$f":"+'Übersicht der Klasse B4'!$L$20","v":1914},{"$f":"+'Übersicht der Klasse B4'!$L$22","v":1914},{"$f":"+'Übersicht der Klasse B4'!$L$24","v":{"$error":"#N/A"}},{"$f":"+'Übersicht der Klasse B4'!$L$26","v":{"$error":"#N/A"}},{"$f":"+'Übersicht der Klasse B4'!$L$28","v":0},{"$f":"+'Übersicht der Klasse B4'!$L$30","v":0},null,null,{"$f":"+#REF!","v":{"$error":"#REF!"}},{"$f":"+#REF!","v":{"$error":"#REF!"}},null,null,null,null,null,{"$f":"+#REF!","v":{"$error":"#REF!"}},{"$f":"+#REF!","v":{"$error":"#REF!"}},{"$f":"+#REF!","v":{"$error":"#REF!"}},{"$error":"#REF!"}]
[null,{"$f":"+'Spielbogen 7er'!M9","v":"6."},{"$f":"+'Spielbogen 7er'!P9","v":"2025-01-16"},{"$f":"+'Spielbogen 7er'!N9","v":"WB"},{"$f":"+'Spielbogen 7er'!D15","v":"Postamt 2"},{"$f":"+'Spielbogen 7er'!S9","v":"P2 2"},null,null,"23/24",null,null,{"$f":"+$E$9","v":"Postamt 2"},{"$f":"+'Übersicht der Klasse B4'!$F$18","v":24763},null,null,"6. Antritt",{"$f":"+'Übersicht der Klasse B4'!$M$8","v":1880},{"$f":"+'Übersicht der Klasse B4'!$M$10","v":1968},{"$f":"+'Übersicht der Klasse B4'!$M$12","v":1853},{"$f":"+'Übersicht der Klasse B4'!$M$14","v":2011},{"$f":"+'Übersicht der Klasse B4'!$M$16","v":1961},{"$f":"+'Übersicht der Klasse B4'!$M$18","v":1692},{"$f":"+'Übersicht der Klasse B4'!$M$20","v":1445},{"$f":"+'Übersicht der Klasse B4'!$M$22","v":1445},{"$f":"+'Übersicht der Klasse B4'!$M$24","v":{"$error":"#N/A"}},{"$f":"+'Übersicht der Klasse B4'!$M$26","v":{"$error":"#N/A"}},{"$f":"+'Übersicht der Klasse B4'!$M$28","v":0},{"$f":"+'Übersicht der Klasse B4'!$M$30","v":0},null,null,{"$f":"+#REF!","v":{"$error":"#REF!"}},{"$f":"+#REF!","v":{"$error":"#REF!"}},null,null,null,null,null,{"$f":"+#REF!","v":{"$error":"#REF!"}},{"$f":"+#REF!","v":{"$error":"#REF!"}},{"$f":"+#REF!","v":{"$error":"#REF!"}},{"$error":"#REF!"}]
[null,{"$f":"+'Spielbogen 7er'!M10","v":"7."},{"$f":"+'Spielbogen 7er'!P10","v":"2025-01-30"},{"$f":"+'Spielbogen 7er'!N10","v":"OT"},{"$f":"+'Spielbogen 7er'!D16","v":"Körber Sports 2"},{"$f":"+'Spielbogen 7er'!S10","v":"KS 2"},null,null,"2024/2025",null,null,{"$f":"+$E$10","v":"Körber Sports 2"},{"$f":"+'Übersicht der Klasse B4'!$F$20","v":25432},null,null,"7. Antritt",{"$f":"+'Übersicht der Klasse B4'!$N$8","v":1686},{"$f":"+'Übersicht der Klasse B4'!$N$10","v":1822},{"$f":"+'Übersicht der Klasse B4'!$N$12","v":1724},{"$f":"+'Übersicht der Klasse B4'!$N$14","v":1830},{"$f":"+'Übersicht der Klasse B4'!$N$16","v":1754},{"$f":"+'Übersicht der Klasse B4'!$N$18","v":1749},{"$f":"+'Übersicht der Klasse B4'!$N$20","v":1777},{"$f":"+'Übersicht der Klasse B4'!$N$22","v":1777},{"$f":"+'Übersicht der Klasse B4'!$N$24","v":{"$error":"#N/A"}},{"$f":"+'Übersicht der Klasse B4'!$N$26","v":{"$error":"#N/A"}},{"$f":"+'Übersicht der Klasse B4'!$N$28","v":0},{"$f":"+'Übersicht der Klasse B4'!$N$30","v":0},null,null,{"$f":"+#REF!","v":{"$error":"#REF!"}},{"$f":"+#REF!","v":{"$error":"#REF!"}},null,null,null,null,null,{"$f":"+#REF!","v":{"$error":"#REF!"}},{"$f":"+#REF!","v":{"$error":"#REF!"}},{"$f":"+#REF!","v":{"$error":"#REF!"}},{"$error":"#REF!"}]
[null,{"$f":"+'Spielbogen 7er'!M11","v":"8."},{"$f":"+'Spielbogen 7er'!P11","v":"2025-02-13"},{"$f":"+'Spielbogen 7er'!N11","v":"WB"},{"$f":"+E4","v":"Panasonic 1"},{"$f":"+'Spielbogen 7er'!S11","v":"PAN 1"},null,null,"2023/2024",null,null,{"$f":"+$E$11","v":"Panasonic 1"},{"$f":"+'Übersicht der Klasse B4'!$F$22","v":25432},null,null,"8. Antritt",{"$f":"+'Übersicht der Klasse B4'!$O$8","v":1817},{"$f":"+'Übersicht der Klasse B4'!$O$10","v":1940},{"$f":"+'Übersicht der Klasse B4'!$O$12","v":1778},{"$f":"+'Übersicht der Klasse B4'!$O$14","v":1822},{"$f":"+'Übersicht der Klasse B4'!$O$16","v":1958},{"$f":"+'Übersicht der Klasse B4'!$O$18","v":1824},{"$f":"+'Übersicht der Klasse B4'!$O$20","v":2149},{"$f":"+'Übersicht der Klasse B4'!$O$22","v":2149},{"$f":"+'Übersicht der Klasse B4'!$O$24","v":{"$error":"#N/A"}},{"$f":"+'Übersicht der Klasse B4'!$O$26","v":{"$error":"#N/A"}},{"$f":"+'Übersicht der Klasse B4'!$O$28","v":0},{"$f":"+'Übersicht der Klasse B4'!$O$30","v":0},null,null,{"$f":"+#REF!","v":{"$error":"#REF!"}},{"$f":"+#REF!","v":{"$error":"#REF!"}},null,null,null,null,null,{"$f":"+#REF!","v":{"$error":"#REF!"}},{"$f":"+#REF!","v":{"$error":"#REF!"}},{"$f":"+#REF!","v":{"$error":"#REF!"}},{"$error":"#REF!"}]
[null,{"$f":"+'Spielbogen 7er'!M12","v":"9."},{"$f":"+'Spielbogen 7er'!P12","v":"2025-02-27"},{"$f":"+'Spielbogen 7er'!N12","v":"OT"},{"$f":"+E5","v":"Dataport 2"},{"$f":"+'Spielbogen 7er'!S12","v":"DAT 2"},null,"Herbst-Mix",null,"16. / 17. Nov. 24",null,{"$f":"+$E$12","v":"Dataport 2"},{"$f":"+'Übersicht der Klasse B4'!$F$24","v":{"$error":"#N/A"}},null,null,"9. Antritt",{"$f":"+'Übersicht der Klasse B4'!$P$8","v":1832},{"$f":"+'Übersicht der Klasse B4'!$P$10","v":1762},{"$f":"+'Übersicht der Klasse B4'!$P$12","v":1835},{"$f":"+'Übersicht der Klasse B4'!$P$14","v":1661},{"$f":"+'Übersicht der Klasse B4'!$P$16","v":1555},{"$f":"+'Übersicht der Klasse B4'!$P$18","v":1751},{"$f":"+'Übersicht der Klasse B4'!$P$20","v":2014},{"$f":"+'Übersicht der Klasse B4'!$P$22","v":2014},{"$f":"+'Übersicht der Klasse B4'!$P$24","v":{"$error":"#N/A"}},{"$f":"+'Übersicht der Klasse B4'!$P$26","v":{"$error":"#N/A"}},{"$f":"+'Übersicht der Klasse B4'!$P$28","v":0},{"$f":"+'Übersicht der Klasse B4'!$P$30","v":0},null,null,{"$f":"+#REF!","v":{"$error":"#REF!"}},{"$f":"+#REF!","v":{"$error":"#REF!"}},null,null,null,null,null,{"$f":"+#REF!","v":{"$error":"#REF!"}},{"$f":"+#REF!","v":{"$error":"#REF!"}},{"$f":"+#REF!","v":{"$error":"#REF!"}},{"$error":"#REF!"}]
[null,{"$f":"+'Spielbogen 7er'!M13","v":"10."},{"$f":"+'Spielbogen 7er'!P13","v":"2025-03-13"},{"$f":"+'Spielbogen 7er'!N13","v":"WB"},"Still 3",{"$f":"+'Spielbogen 7er'!S13","v":"STI 3"},null,null,null,null,null,{"$f":"+$E$13","v":"Still 3"},{"$f":"+'Übersicht der Klasse B4'!$F$26","v":{"$error":"#N/A"}},null,null,"10. Antritt",{"$f":"+'Übersicht der Klasse B4'!$Q$8","v":2017},{"$f":"+'Übersicht der Klasse B4'!$Q$10","v":1842},{"$f":"+'Übersicht der Klasse B4'!$Q$12","v":1718},{"$f":"+'Übersicht der Klasse B4'!$Q$14","v":1706},{"$f":"+'Übersicht der Klasse B4'!$Q$16","v":1756},{"$f":"+'Übersicht der Klasse B4'!$Q$18","v":1633},{"$f":"+'Übersicht der Klasse B4'!$Q$20","v":1974},{"$f":"+'Übersicht der Klasse B4'!$Q$22","v":1974},{"$f":"+'Übersicht der Klasse B4'!$Q$24","v":{"$error":"#N/A"}},{"$f":"+'Übersicht der Klasse B4'!$Q$26","v":{"$error":"#N/A"}},{"$f":"+'Übersicht der Klasse B4'!$Q$28","v":0},{"$f":"+'Übersicht der Klasse B4'!$Q$30","v":0}]
[null,{"$f":"+'Spielbogen 7er'!M14","v":"11."},{"$f":"+'Spielbogen 7er'!P14","v":"2025-03-27"},{"$f":"+'Spielbogen 7er'!N14","v":"OT"},"SG Stern Hamburg 1",{"$f":"+'Spielbogen 7er'!S14","v":"SGS 1"},null,"Frühjahrs-Mix",null,"12. / 13. Mär, 25",null,null,null,null,null,"11. Antritt",{"$f":"+'Übersicht der Klasse B4'!$R$8","v":1867},{"$f":"+'Übersicht der Klasse B4'!$R$10","v":1952},{"$f":"+'Übersicht der Klasse B4'!$R$12","v":1639},{"$f":"+'Übersicht der Klasse B4'!$R$14","v":1953},{"$f":"+'Übersicht der Klasse B4'!$R$16","v":1418},{"$f":"+'Übersicht der Klasse B4'!$R$18","v":2062},{"$f":"+'Übersicht der Klasse B4'!$R$20","v":1757},{"$f":"+'Übersicht der Klasse B4'!$R$22","v":1757},{"$f":"+'Übersicht der Klasse B4'!$R$24","v":{"$error":"#N/A"}},{"$f":"+'Übersicht der Klasse B4'!$R$26","v":{"$error":"#N/A"}},{"$f":"+'Übersicht der Klasse B4'!$R$28","v":0},{"$f":"+'Übersicht der Klasse B4'!$R$30","v":0}]
[null,{"$f":"+'Spielbogen 7er'!M15","v":"12."},{"$f":"+'Spielbogen 7er'!P15","v":"2025-04-10"},{"$f":"+'Spielbogen 7er'!N15","v":"WB"},"Justitzbehörde 2",{"$f":"+'Spielbogen 7er'!S15","v":"JUS 2"},null,null,null,null,null,null,null,null,null,"12. Antritt",{"$f":"+'Übersicht der Klasse B4'!$S$8","v":1845},{"$f":"+'Übersicht der Klasse B4'!$S$10","v":1888},{"$f":"+'Übersicht der Klasse B4'!$S$12","v":1899},{"$f":"+'Übersicht der Klasse B4'!$S$14","v":1984},{"$f":"+'Übersicht der Klasse B4'!$S$16","v":1802},{"$f":"+'Übersicht der Klasse B4'!$S$18","v":1718},{"$f":"+'Übersicht der Klasse B4'!$S$20","v":2017},{"$f":"+'Übersicht der Klasse B4'!$S$22","v":2017},{"$f":"+'Übersicht der Klasse B4'!$S$24","v":{"$error":"#N/A"}},{"$f":"+'Übersicht der Klasse B4'!$S$26","v":{"$error":"#N/A"}},{"$f":"+'Übersicht der Klasse B4'!$S$28","v":0},{"$f":"+'Übersicht der Klasse B4'!$S$30","v":0}]
[null,{"$f":"+'Spielbogen 7er'!M16","v":"13."},{"$f":"+'Spielbogen 7er'!P16","v":"2025-04-24"},{"$f":"+'Spielbogen 7er'!N16","v":"OT"},"Postamt 2",{"$f":"+'Spielbogen 7er'!S16","v":"P2 2"},null,null,null,null,null,null,null,null,null,"13. Antritt",{"$f":"+'Übersicht der Klasse B4'!$T$8","v":1900},{"$f":"+'Übersicht der Klasse B4'!$T$10","v":1733},{"$f":"+'Übersicht der Klasse B4'!$T$12","v":1906},{"$f":"+'Übersicht der Klasse B4'!$T$14","v":1542},{"$f":"+'Übersicht der Klasse B4'!$T$16","v":1841},{"$f":"+'Übersicht der Klasse B4'!$T$18","v":1793},{"$f":"+'Übersicht der Klasse B4'!$T$20","v":1922},{"$f":"+'Übersicht der Klasse B4'!$T$22","v":1922},{"$f":"+'Übersicht der Klasse B4'!$T$24","v":{"$error":"#N/A"}},{"$f":"+'Übersicht der Klasse B4'!$T$26","v":{"$error":"#N/A"}},{"$f":"+'Übersicht der Klasse B4'!$T$28","v":0},{"$f":"+'Übersicht der Klasse B4'!$T$30","v":0}]
[null,{"$f":"+'Spielbogen 7er'!M17","v":"14."},{"$f":"+'Spielbogen 7er'!P17","v":"2025-05-08"},{"$f":"+'Spielbogen 7er'!N17","v":"WB"},"Körber Sports 2",{"$f":"+'Spielbogen 7er'!S17","v":"KS 2"},null,null,null,null,null,"Übersicht aller Mannschaften / Punkte",null,null,null,"14. Antritt",{"$f":"+'Übersicht der Klasse B4'!$U$8","v":1925},{"$f":"+'Übersicht der Klasse B4'!$U$10","v":1832},{"$f":"+'Übersicht der Klasse B4'!$U$12","v":1653},{"$f":"+'Übersicht der Klasse B4'!$U$14","v":1813},{"$f":"+'Übersicht der Klasse B4'!$U$16","v":2045},{"$f":"+'Übersicht der Klasse B4'!$U$18","v":1841},{"$f":"+'Übersicht der Klasse B4'!$U$20","v":2091},{"$f":"+'Übersicht der Klasse B4'!$U$22","v":2091},{"$f":"+'Übersicht der Klasse B4'!$U$24","v":{"$error":"#N/A"}},{"$f":"+'Übersicht der Klasse B4'!$U$26","v":{"$error":"#N/A"}},{"$f":"+'Übersicht der Klasse B4'!$U$28","v":0},{"$f":"+'Übersicht der Klasse B4'!$U$30","v":0}]
[null,null,null,null,null,null,null,null,null,null,null,"1. Mannschaft","Punkte",null,null,"Gesamt Pins:",{"$f":"SUM(Q4:Q17)","v":26254},25261,24708,24600,24257,24763,25432,25432,{"$error":"#N/A"},{"$error":"#N/A"},0,0]
[null,null,null,null,null,null,null,null,null,null,null,{"$f":"+$E$4","v":"Panasonic 1"},{"$f":"+'Übersicht der Klasse B4'!$E$8","v":68}]
[null,null,null,null,null,null,null,null,null,null,null,{"$f":"+$E$5","v":"Dataport 2"},{"$f":"+'Übersicht der Klasse B4'!$E$10","v":58},null,null,null,null,null,null,null,null,null,null,null,null,null,null,null,null,null,null,"1. Antritt","2. Antritt","3. Antritt","4. Antritt","5. Antritt","6. Antritt","7. Antritt","8. Antritt","9. Antritt","10. Antritt","11. Antritt","12. Antritt","13. Antritt","14. Antritt","Gesamt Pins:"]
[null,null,null,null,null,null,null,null,null,null,null,{"$f":"+$E$6","v":"Still 3"},{"$f":"+'Übersicht der Klasse B4'!$E$12","v":49},null,null,"Gesamt Punkte:",{"$f":"+'Übersicht der Klasse B4'!E8","v":68},{"$f":"+'Übersicht der Klasse B4'!E10","v":58},{"$f":"+'Übersicht der Klasse B4'!E12","v":49},{"$f":"+'Übersicht der Klasse B4'!E14","v":50},{"$f":"+'Übersicht der Klasse B4'!E16","v":49},{"$f":"+'Übersicht der Klasse B4'!E18","v":46},{"$f":"+'Übersicht der Klasse B4'!E20","v":72},{"$f":"+'Übersicht der Klasse B4'!E22","v":72.5},{"$f":"+'Übersicht der Klasse B4'!F25","v":0},{"$f":"+'Übersicht der Klasse B4'!E26","v":{"$error":"#N/A"}},{"$f":"+'Übersicht der Klasse B4'!F29","v":0},{"$f":"+'Übersicht der Klasse B4'!F31","v":0},null,null,{"$f":"+'Spielbogen 7er'!D10","v":"Panasonic 1"},{"$f":"+'Übersicht der Klasse B4'!$H$8","v":1914},{"$f":"+'Übersicht der Klasse B4'!$I$8","v":1912},{"$f":"+'Übersicht der Klasse B4'!$J$8","v":1975},{"$f":"+'Übersicht der Klasse B4'!$K$8","v":1777},{"$f":"+'Übersicht der Klasse B4'!$L$8","v":1907},{"$f":"+'Übersicht der Klasse B4'!$M$8","v":1880},{"$f":"+'Übersicht der Klasse B4'!$N$8","v":1686},{"$f":"+'Übersicht der Klasse B4'!$O$8","v":1817},{"$f":"+'Übersicht der Klasse B4'!$P$8","v":1832},{"$f":"+'Übersicht der Klasse B4'!$Q$8","v":2017},{"$f":"+'Übersicht der Klasse B4'!$R$8","v":1867},{"$f":"+'Übersicht der Klasse B4'!$S$8","v":1845},{"$f":"+'Übersicht der Klasse B4'!$T$8","v":1900},{"$f":"+'Übersicht der Klasse B4'!$U$8","v":1925},{"$f":"SUM(AF21:AS21)","v":26254}]
[null,null,null,null,null,null,null,null,null,null,null,{"$f":"+$E$7","v":"SG Stern Hamburg 1"},{"$f":"+'Übersicht der Klasse B4'!$E$14","v":50},null,null,null,null,null,null,null,null,null,null,null,null,null,null,null,null,null,{"$f":"+'Spielbogen 7er'!D11","v":"Dataport 2"},{"$f":"+'Übersicht der Klasse B4'!$H$10","v":1586},{"$f":"+'Übersicht der Klasse B4'!$I$10","v":1748},{"$f":"+'Übersicht der Klasse B4'!$J$10","v":1606},{"$f":"+'Übersicht der Klasse B4'!$K$10","v":1733},{"$f":"+'Übersicht der Klasse B4'!$L$10","v":1849},{"$f":"+'Übersicht der Klasse B4'!$M$10","v":1968},{"$f":"+'Übersicht der Klasse B4'!$N$10","v":1822},{"$f":"+'Übersicht der Klasse B4'!$O$10","v":1940},{"$f":"+'Übersicht der Klasse B4'!$P$10","v":1762},{"$f":"+'Übersicht der Klasse B4'!$Q$10","v":1842},{"$f":"+'Übersicht der Klasse B4'!$R$10","v":1952},{"$f":"+'Übersicht der Klasse B4'!$S$10","v":1888},{"$f":"+'Übersicht der Klasse B4'!$T$10","v":1733},{"$f":"+'Übersicht der Klasse B4'!$U$10","v":1832},25261]
[null,null,null,null,null,null,null,null,null,null,null,{"$f":"+$E$8","v":"Justitzbehörde 2"},{"$f":"+'Übersicht der Klasse B4'!$E$16","v":49},null,null,null,"1. Antritt",null,null,null,null,null,null,null,null,null,null,null,null,null,{"$f":"+'Spielbogen 7er'!D12","v":"Still 3"},{"$f":"+'Übersicht der Klasse B4'!$H$12","v":1732},{"$f":"+'Übersicht der Klasse B4'!$I$12","v":1572},{"$f":"+'Übersicht der Klasse B4'!$J$12","v":1805},{"$f":"+'Übersicht der Klasse B4'!$K$12","v":1788},{"$f":"+'Übersicht der Klasse B4'!$L$12","v":1806},{"$f":"+'Übersicht der Klasse B4'!$M$12","v":1853},{"$f":"+'Übersicht der Klasse B4'!$N$12","v":1724},{"$f":"+'Übersicht der Klasse B4'!$O$12","v":1778},{"$f":"+'Übersicht der Klasse B4'!$P$12","v":1835},{"$f":"+'Übersicht der Klasse B4'!$Q$12","v":1718},{"$f":"+'Übersicht der Klasse B4'!$R$12","v":1639},{"$f":"+'Übersicht der Klasse B4'!$S$12","v":1899},{"$f":"+'Übersicht der Klasse B4'!$T$12","v":1906},{"$f":"+'Übersicht der Klasse B4'!$U$12","v":1653},24708]
[null,null,null,null,null,null,null,null,null,null,null,{"$f":"+$E$9","v":"Postamt 2"},{"$f":"+'Übersicht der Klasse B4'!$E$18","v":46},null,null,null,{"$f":"IF(Q26=\"1\",+Q25+0.5,+Q25)","v":7},4,5,3,2,6,1,1,{"$error":"#N/A"},{"$error":"#N/A"},"0","0",null,null,{"$f":"+'Spielbogen 7er'!D13","v":"SG Stern Hamburg 1"},{"$f":"+'Übersicht der Klasse B4'!$H$14","v":1528},{"$f":"+'Übersicht der Klasse B4'!$I$14","v":1637},{"$f":"+'Übersicht der Klasse B4'!$J$14","v":1502},{"$f":"+'Übersicht der Klasse B4'!$K$14","v":1714},{"$f":"+'Übersicht der Klasse B4'!$L$14","v":1897},{"$f":"+'Übersicht der Klasse B4'!$M$14","v":2011},{"$f":"+'Übersicht der Klasse B4'!$N$14","v":1830},{"$f":"+'Übersicht der Klasse B4'!$O$14","v":1822},{"$f":"+'Übersicht der Klasse B4'!$P$14","v":1661},{"$f":"+'Übersicht der Klasse B4'!$Q$14","v":1706},{"$f":"+'Übersicht der Klasse B4'!$R$14","v":1953},{"$f":"+'Übersicht der Klasse B4'!$S$14","v":1984},{"$f":"+'Übersicht der Klasse B4'!$T$14","v":1542},{"$f":"+'Übersicht der Klasse B4'!$U$14","v":1813},24600]
[null,null,null,null,null,null,null,null,null,null,null,{"$f":"+$E$10","v":"Körber Sports 2"},{"$f":"+'Übersicht der Klasse B4'!$E$20","v":72},null,null,null,{"$f":"IF(Q4>0,RANK(Q4,$Q$4:$W$4,7),\"0\")","v":7},4,5,3,2,6,1,1,{"$error":"#N/A"},{"$error":"#N/A"},"0","0",null,null,{"$f":"+'Spielbogen 7er'!D14","v":"Justitzbehörde 2"},{"$f":"+'Übersicht der Klasse B4'!$H$16","v":1349},{"$f":"+'Übersicht der Klasse B4'!$I$16","v":1664},{"$f":"+'Übersicht der Klasse B4'!$J$16","v":1609},{"$f":"+'Übersicht der Klasse B4'!$K$16","v":1734},{"$f":"+'Übersicht der Klasse B4'!$L$16","v":1811},{"$f":"+'Übersicht der Klasse B4'!$M$16","v":1961},{"$f":"+'Übersicht der Klasse B4'!$N$16","v":1754},{"$f":"+'Übersicht der Klasse B4'!$O$16","v":1958},{"$f":"+'Übersicht der Klasse B4'!$P$16","v":1555},{"$f":"+'Übersicht der Klasse B4'!$Q$16","v":1756},{"$f":"+'Übersicht der Klasse B4'!$R$16","v":1418},{"$f":"+'Übersicht der Klasse B4'!$S$16","v":1802},{"$f":"+'Übersicht der Klasse B4'!$T$16","v":1841},{"$f":"+'Übersicht der Klasse B4'!$U$16","v":2045},24257]
[null,null,null,null,null,null,null,null,null,null,null,{"$f":"+$E$11","v":"Panasonic 1"},{"$f":"+'Übersicht der Klasse B4'!$E$22","v":72.5},null,null,null,{"$f":"IF(COUNTIF($Q$4:$W$4,Q4)>1,\"1\",\"\")","v":""},"","","","","","","","","","","",null,null,{"$f":"+'Spielbogen 7er'!D15","v":"Postamt 2"},{"$f":"+'Übersicht der Klasse B4'!$H$18","v":1740},{"$f":"+'Übersicht der Klasse B4'!$I$18","v":1761},{"$f":"+'Übersicht der Klasse B4'!$J$18","v":1781},{"$f":"+'Übersicht der Klasse B4'!$K$18","v":1659},{"$f":"+'Übersicht der Klasse B4'!$L$18","v":1759},{"$f":"+'Übersicht der Klasse B4'!$M$18","v":1692},{"$f":"+'Übersicht der Klasse B4'!$N$18","v":1749},{"$f":"+'Übersicht der Klasse B4'!$O$18","v":1824},{"$f":"+'Übersicht der Klasse B4'!$P$18","v":1751},{"$f":"+'Übersicht der Klasse B4'!$Q$18","v":1633},{"$f":"+'Übersicht der Klasse B4'!$R$18","v":2062},{"$f":"+'Übersicht der Klasse B4'!$S$18","v":1718},{"$f":"+'Übersicht der Klasse B4'!$T$18","v":1793},{"$f":"+'Übersicht der Klasse B4'!$U$18","v":1841},24763]
[null,null,null,null,null,null,null,null,null,null,null,{"$f":"+$E$12","v":"Dataport 2"},{"$f":"+'Übersicht der Klasse B4'!$F$25","v":0},null,null,null,null,null,null,null,null,null,null,null,null,null,null,null,null,null,{"$f":"+'Spielbogen 7er'!D16","v":"Körber Sports 2"},{"$f":"+'Übersicht der Klasse B4'!$H$20","v":1229},{"$f":"+'Übersicht der Klasse B4'!$I$20","v":1282},{"$f":"+'Übersicht der Klasse B4'!$J$20","v":1909},{"$f":"+'Übersicht der Klasse B4'!$K$20","v":1952},{"$f":"+'Übersicht der Klasse B4'!$L$20","v":1914},{"$f":"+'Übersicht der Klasse B4'!$M$20","v":1445},{"$f":"+'Übersicht der Klasse B4'!$N$20","v":1777},{"$f":"+'Übersicht der Klasse B4'!$O$20","v":2149},{"$f":"+'Übersicht der Klasse B4'!$P$20","v":2014},{"$f":"+'Übersicht der Klasse B4'!$Q$20","v":1974},{"$f":"+'Übersicht der Klasse B4'!$R$20","v":1757},{"$f":"+'Übersicht der Klasse B4'!$S$20","v":2017},{"$f":"+'Übersicht der Klasse B4'!$T$20","v":1922},{"$f":"+'Übersicht der Klasse B4'!$U$20","v":2091},25432]
[null,null,null,null,null,null,null,null,null,null,null,{"$f":"+$E$13","v":"Still 3"},{"$f":"+'Übersicht der Klasse B4'!$E$26","v":{"$error":"#N/A"}},null,null,null,"2. Antritt",null,null,null,null,null,null,null,null,null,null,null,null,null,{"$f":"+'Spielbogen 7er'!$G16","v":0},{"$f":"+'Übersicht der Klasse B4'!$H$22","v":1229},{"$f":"+'Übersicht der Klasse B4'!$I$22","v":1282},{"$f":"+'Übersicht der Klasse B4'!$J$22","v":1909},{"$f":"+'Übersicht der Klasse B4'!$K$22","v":1952},{"$f":"+'Übersicht der Klasse B4'!$L$22","v":1914},{"$f":"+'Übersicht der Klasse B4'!$M$22","v":1445},{"$f":"+'Übersicht der Klasse B4'!$N$22","v":1777},{"$f":"+'Übersicht der Klasse B4'!$O$22","v":2149},{"$f":"+'Übersicht der Klasse B4'!$P$22","v":2014},{"$f":"+'Übersicht der Klasse B4'!$Q$22","v":1974},{"$f":"+'Übersicht der Klasse B4'!$R$22","v":1757},{"$f":"+'Übersicht der Klasse B4'!$S$22","v":2017},{"$f":"+'Übersicht der Klasse B4'!$T$22","v":1922},{"$f":"+'Übersicht der Klasse B4'!$U$22","v":2091},25432]
[null,null,null,null,null,null,null,null,null,null,null,null,null,null,null,null,{"$f":"IF(Q31=\"1\",+Q30+0.5,+Q30)","v":7},5,2,3,4,6,1,1,{"$error":"#N/A"},{"$error":"#N/A"},"0","0",null,null,{"$f":"+'Spielbogen 7er'!$G17","v":0},{"$f":"+'Übersicht der Klasse B4'!$H$24","v":{"$error":"#N/A"}},{"$f":"+'Übersicht der Klasse B4'!$I$24","v":{"$error":"#N/A"}},{"$f":"+'Übersicht der Klasse B4'!$J$24","v":{"$error":"#N/A"}},{"$f":"+'Übersicht der Klasse B4'!$K$24","v":{"$error":"#N/A"}},{"$f":"+'Übersicht der Klasse B4'!$L$24","v":{"$error":"#N/A"}},{"$f":"+'Übersicht der Klasse B4'!$M$24","v":{"$error":"#N/A"}},{"$f":"+'Übersicht der Klasse B4'!$N$24","v":{"$error":"#N/A"}},{"$f":"+'Übersicht der Klasse B4'!$O$24","v":{"$error":"#N/A"}},{"$f":"+'Übersicht der Klasse B4'!$P$24","v":{"$error":"#N/A"}},{"$f":"+'Übersicht der Klasse B4'!$Q$24","v":{"$error":"#N/A"}},{"$f":"+'Übersicht der Klasse B4'!$R$24","v":{"$error":"#N/A"}},{"$f":"+'Übersicht der Klasse B4'!$S$24","v":{"$error":"#N/A"}},{"$f":"+'Übersicht der Klasse B4'!$T$24","v":{"$error":"#N/A"}},{"$f":"+'Übersicht der Klasse B4'!$U$24","v":{"$error":"#N/A"}},{"$error":"#N/A"}]
[null,null,null,null,null,null,null,null,null,null,null,null,null,null,null,null,{"$f":"IF(Q5>0,RANK(Q5,$Q$5:$W$5,7),\"0\")","v":7},5,2,3,4,6,1,1,{"$error":"#N/A"},{"$error":"#N/A"},"0","0",null,null,{"$f":"+'Spielbogen 7er'!$G18","v":0},{"$f":"+'Übersicht der Klasse B4'!$H$26","v":{"$error":"#N/A"}},{"$f":"+'Übersicht der Klasse B4'!$I$26","v":{"$error":"#N/A"}},{"$f":"+'Übersicht der Klasse B4'!$J$26","v":{"$error":"#N/A"}},{"$f":"+'Übersicht der Klasse B4'!$K$26","v":{"$error":"#N/A"}},{"$f":"+'Übersicht der Klasse B4'!$L$26","v":{"$error":"#N/A"}},{"$f":"+'Übersicht der Klasse B4'!$M$26","v":{"$error":"#N/A"}},{"$f":"+'Übersicht der Klasse B4'!$N$26","v":{"$error":"#N/A"}},{"$f":"+'Übersicht der Klasse B4'!$O$26","v":{"$error":"#N/A"}},{"$f":"+'Übersicht der Klasse B4'!$P$26","v":{"$error":"#N/A"}},{"$f":"+'Übersicht der Klasse B4'!$Q$26","v":{"$error":"#N/A"}},{"$f":"+'Übersicht der Klasse B4'!$R$26","v":{"$error":"#N/A"}},{"$f":"+'Übersicht der Klasse B4'!$S$26","v":{"$error":"#N/A"}},{"$f":"+'Übersicht der Klasse B4'!$T$26","v":{"$error":"#N/A"}},{"$f":"+'Übersicht der Klasse B4'!$U$26","v":{"$error":"#N/A"}},{"$error":"#N/A"}]
[null,null,null,null,null,null,null,null,null,null,null,null,null,null,null,null,{"$f":"IF(COUNTIF($Q$5:$W$5,Q5)>1,\"1\",\"\")","v":""},"","","","","","","","","","","",null,null,null,{"$f":"+'Übersicht der Klasse B4'!$H$28","v":0},{"$f":"+'Übersicht der Klasse B4'!$I$28","v":0},{"$f":"+'Übersicht der Klasse B4'!$J$28","v":0},{"$f":"+'Übersicht der Klasse B4'!$K$28","v":0},{"$f":"+'Übersicht der Klasse B4'!$L$28","v":0},{"$f":"+'Übersicht der Klasse B4'!$M$28","v":0},{"$f":"+'Übersicht der Klasse B4'!$N$28","v":0},{"$f":"+'Übersicht der Klasse B4'!$O$28","v":0},{"$f":"+'Übersicht der Klasse B4'!$P$28","v":0},{"$f":"+'Übersicht der Klasse B4'!$Q$28","v":0},{"$f":"+'Übersicht der Klasse B4'!$R$28","v":0},{"$f":"+'Übersicht der Klasse B4'!$S$28","v":0},{"$f":"+'Übersicht der Klasse B4'!$T$28","v":0},{"$f":"+'Übersicht der Klasse B4'!$U$28","v":0},0]
[null,null,null,null,null,null,null,null,null,null,null,"Übersicht aller Mannschaften / Spiele",null,null,null,null,null,null,null,null,null,null,null,null,null,null,null,null,null,null,null,{"$f":"+'Übersicht der Klasse B4'!$H$30","v":0},{"$f":"+'Übersicht der Klasse B4'!$I$30","v":0},{"$f":"+'Übersicht der Klasse B4'!$J$30","v":0},{"$f":"+'Übersicht der Klasse B4'!$K$30","v":0},{"$f":"+'Übersicht der Klasse B4'!$L$30","v":0},{"$f":"+'Übersicht der Klasse B4'!$M$30","v":0},{"$f":"+'Übersicht der Klasse B4'!$N$30","v":0},{"$f":"+'Übersicht der Klasse B4'!$O$30","v":0},{"$f":"+'Übersicht der Klasse B4'!$P$30","v":0},{"$f":"+'Übersicht der Klasse B4'!$Q$30","v":0},{"$f":"+'Übersicht der Klasse B4'!$R$30","v":0},{"$f":"+'Übersicht der Klasse B4'!$S$30","v":0},{"$f":"+'Übersicht der Klasse B4'!$T$30","v":0},{"$f":"+'Übersicht der Klasse B4'!$U$30","v":0},0]
[null,null,null,null,null,null,null,null,null,null,null,"1. Mannschaft","Spiele",null,null,null,"3. Antritt"]
[null,null,null,null,null,null,null,null,null,null,null,{"$f":"+$E$4","v":"Panasonic 1"},{"$f":"COUNTIF(Uebersicht_1_01,\">1\")*12","v":168},null,null,null,{"$f":"IF(Q36=\"1\",+Q35+0.5,+Q35)","v":7},2,5,1,3,4,6,6,{"$error":"#N/A"},{"$error":"#N/A"},"0","0"]
[null,null,null,null,null,null,null,null,null,null,null,{"$f":"+$E$5","v":"Dataport 2"},{"$f":"COUNTIF(Uebersicht_1_02,\">1\")*12","v":168},null,null,null,{"$f":"IF(Q6>0,RANK(Q6,$Q$6:$W$6,7),\"0\")","v":7},2,5,1,3,4,6,6,{"$error":"#N/A"},{"$error":"#N/A"},"0","0",null,null,null,{"$f":"+'Spielbogen 7er'!$G$9","v":0},{"$f":"+'Spielbogen 7er'!$G$10","v":0},{"$f":"+'Spielbogen 7er'!$G$11","v":0},{"$f":"+'Spielbogen 7er'!$G$12","v":0},{"$f":"+'Spielbogen 7er'!$G$13","v":0},{"$f":"+'Spielbogen 7er'!$G$14","v":0},{"$f":"+'Spielbogen 7er'!$G$15","v":0},{"$f":"+'Spielbogen 7er'!$G$16","v":0},{"$f":"+'Spielbogen 7er'!$G$17","v":0},{"$f":"+'Spielbogen 7er'!$G$18","v":0}]
[null,null,null,null,null,null,null,null,null,null,null,{"$f":"+$E$6","v":"Still 3"},{"$f":"COUNTIF(Uebersicht_1_03,\">1\")*12","v":168},null,null,null,{"$f":"IF(COUNTIF($Q$6:$W$6,Q6)>1,\"1\",\"\")","v":""},"","","","","","","","","","","",null,null,"1. Antritt",{"$f":"+'Anhang zum Spielbericht'!$G$19","v":1914},{"$f":"+'Anhang zum Spielbericht'!$H$19","v":1586},{"$f":"+'Anhang zum Spielbericht'!$I$19","v":1732},{"$f":"+'Anhang zum Spielbericht'!$J$19","v":1528},{"$f":"+'Anhang zum Spielbericht'!$K$19","v":1349},{"$f":"+'Anhang zum Spielbericht'!$L$19","v":1740},{"$f":"+'Anhang zum Spielbericht'!$M$19","v":1229},{"$f":"+'Anhang zum Spielbericht'!$N$19","v":1300},{"$f":"+'Anhang zum Spielbericht'!$R$19","v":1812},{"$f":"+'Anhang zum Spielbericht'!$S$19","v":1850}]
[null,null,null,null,null,null,null,null,null,null,null,{"$f":"+$E$7","v":"SG Stern Hamburg 1"},{"$f":"COUNTIF(Uebersicht_1_04,\">1\")*12","v":168},null,null,null,null,null,null,null,null,null,null,null,null,null,null,null,null,null,"2. Antritt",{"$f":"+'Anhang zum Spielbericht'!$G$45","v":1912},{"$f":"+'Anhang zum Spielbericht'!$H$45","v":1748},{"$f":"+'Anhang zum Spielbericht'!$I$45","v":1572},{"$f":"+'Anhang zum Spielbericht'!$J$45","v":1637},{"$f":"+'Anhang zum Spielbericht'!$K$45","v":1664},{"$f":"+'Anhang zum Spielbericht'!$L$45","v":1761},{"$f":"+'Anhang zum Spielbericht'!$M$45","v":1282},{"$f":"+'Anhang zum Spielbericht'!$N$45","v":0},{"$f":"+'Anhang zum Spielbericht'!$R$45","v":0},{"$f":"+'Anhang zum Spielbericht'!$S$45","v":0}]
[null,null,null,null,null,null,null,null,null,null,null,{"$f":"+$E$8","v":"Justitzbehörde 2"},{"$f":"COUNTIF(Uebersicht_1_05,\">1\")*12","v":168},null,null,null,"4. Antritt",null,null,null,null,null,null,null,null,null,null,null,null,null,"3. Antritt",{"$f":"+'Anhang zum Spielbericht'!$G$72","v":1975},{"$f":"+'Anhang zum Spielbericht'!$H$72","v":1606},{"$f":"+'Anhang zum Spielbericht'!$I$72","v":1805},{"$f":"+'Anhang zum Spielbericht'!$J$72","v":1502},{"$f":"+'Anhang zum Spielbericht'!$K$72","v":1609},{"$f":"+'Anhang zum Spielbericht'!$L$72","v":1781},{"$f":"+'Anhang zum Spielbericht'!$M$72","v":1909},{"$f":"+'Anhang zum Spielbericht'!$N$72","v":0},{"$f":"+'Anhang zum Spielbericht'!$R$72","v":0},{"$f":"+'Anhang zum Spielbericht'!$S$72","v":0}]
[null,null,null,null,null,null,null,null,null,null,null,{"$f":"+$E$9","v":"Postamt 2"},{"$f":"COUNTIF(Uebersicht_1_06,\">1\")*12","v":168},null,null,null,{"$f":"IF(Q41=\"1\",+Q40+0.5,+Q40)","v":5},3,6,2,4,1,7,7,{"$error":"#N/A"},{"$error":"#N/A"},"0","0",null,null,"4. Antritt",{"$f":"+'Anhang zum Spielbericht'!$G$99","v":1777},{"$f":"+'Anhang zum Spielbericht'!$H$99","v":1733},{"$f":"+'Anhang zum Spielbericht'!$I$99","v":1788},{"$f":"+'Anhang zum Spielbericht'!$J$99","v":1714},{"$f":"+'Anhang zum Spielbericht'!$K$99","v":1734},{"$f":"+'Anhang zum Spielbericht'!$L$99","v":1659},{"$f":"+'Anhang zum Spielbericht'!$M$99","v":1952},{"$f":"+'Anhang zum Spielbericht'!$N$99","v":0},{"$f":"+'Anhang zum Spielbericht'!$R$99","v":0},{"$f":"+'Anhang zum Spielbericht'!$S$99","v":0}]
[null,null,null,null,null,null,null,null,null,null,null,{"$f":"+$E$10","v":"Körber Sports 2"},{"$f":"COUNTIF(Uebersicht_1_07,\">1\")*12","v":168},null,null,null,{"$f":"IF(Q7>0,RANK(Q7,$Q$7:$W$7,7),\"0\")","v":5},3,6,2,4,1,7,7,{"$error":"#N/A"},{"$error":"#N/A"},"0","0",null,null,"5. Antritt",{"$f":"+'Anhang zum Spielbericht'!$G$126","v":1907},{"$f":"+'Anhang zum Spielbericht'!$H$126","v":1849},{"$f":"+'Anhang zum Spielbericht'!$I$126","v":1806},{"$f":"+'Anhang zum Spielbericht'!$J$126","v":1897},{"$f":"+'Anhang zum Spielbericht'!$K$126","v":1811},{"$f":"+'Anhang zum Spielbericht'!$L$126","v":1759},{"$f":"+'Anhang zum Spielbericht'!$M$126","v":1914},{"$f":"+'Anhang zum Spielbericht'!$N$126","v":0},{"$f":"+'Anhang zum Spielbericht'!$R$126","v":0},{"$f":"+'Anhang zum Spielbericht'!$S$126","v":0}]
[null,null,null,null,null,null,null,null,null,null,null,{"$f":"+$E$11","v":"Panasonic 1"},{"$f":"COUNTIF(Uebersicht_1_08,\">1\")*12","v":168},null,null,null,{"$f":"IF(COUNTIF($Q$7:$W$7,Q7)>1,\"1\",\"\")","v":""},"","","","","","","","","","","",null,null,"6. Antritt",{"$f":"+'Anhang zum Spielbericht'!$G$153","v":1880},{"$f":"+'Anhang zum Spielbericht'!$H$153","v":1968},{"$f":"+'Anhang zum Spielbericht'!$I$153","v":1853},{"$f":"+'Anhang zum Spielbericht'!$J$153","v":2011},{"$f":"+'Anhang zum Spielbericht'!$K$153","v":1961},{"$f":"+'Anhang zum Spielbericht'!$L$153","v":1692},{"$f":"+'Anhang zum Spielbericht'!$M$153","v":1445},{"$f":"+'Anhang zum Spielbericht'!$N$153","v":0},{"$f":"+'Anhang zum Spielbericht'!$R$153","v":0},{"$f":"+'Anhang zum Spielbericht'!$S$153","v":0}]
[null,null,null,null,null,null,null,null,null,null,null,{"$f":"+$E$12","v":"Dataport 2"},{"$f":"COUNTIF('Übersicht der Klasse B4'!H24:U24,\">1\")*12","v":0},null,null,null,null,null,null,null,null,null,null,null,null,null,null,null,null,null,"7. Antritt",{"$f":"+'Anhang zum Spielbericht'!$G$180","v":1686},{"$f":"+'Anhang zum Spielbericht'!$H$180","v":1822},{"$f":"+'Anhang zum Spielbericht'!$I$180","v":1724},{"$f":"+'Anhang zum Spielbericht'!$J$180","v":1830},{"$f":"+'Anhang zum Spielbericht'!$K$180","v":1754},{"$f":"+'Anhang zum Spielbericht'!$L$180","v":1749},{"$f":"+'Anhang zum Spielbericht'!$M$180","v":1777},{"$f":"+'Anhang zum Spielbericht'!$N$180","v":0},{"$f":"+'Anhang zum Spielbericht'!$R$180","v":0},{"$f":"+'Anhang zum Spielbericht'!$S$180","v":0}]
[null,null,null,null,null,null,null,null,null,null,null,{"$f":"+$E$13","v":"Still 3"},{"$f":"COUNTIF(Uebersicht_1_10,\">1\")*12","v":0},null,null,null,"5. Antritt",null,null,null,null,null,null,null,null,null,null,null,null,null,"8. Antritt",{"$f":"+'Anhang zum Spielbericht'!$G$207","v":1817},{"$f":"+'Anhang zum Spielbericht'!$H$207","v":1940},{"$f":"+'Anhang zum Spielbericht'!$I$207","v":1778},{"$f":"+'Anhang zum Spielbericht'!$J$207","v":1822},{"$f":"+'Anhang zum Spielbericht'!$K$207","v":1958},{"$f":"+'Anhang zum Spielbericht'!$L$207","v":1824},{"$f":"+'Anhang zum Spielbericht'!$M$207","v":2149},{"$f":"+'Anhang zum Spielbericht'!$N$207","v":0},{"$f":"+'Anhang zum Spielbericht'!$R$207","v":0},{"$f":"+'Anhang zum Spielbericht'!$S$207","v":0}]
[null,null,null,null,null,null,null,null,null,null,null,null,null,null,null,null,{"$f":"IF(Q46=\"1\",+Q45+0.5,+Q45)","v":6},4,2,5,3,1,7,7.5,{"$f":"IF(Y46=\"1\",+Y45+0.5,+Y45)","v":{"$error":"#N/A"}},{"$error":"#N/A"},"0",0.5,null,null,"9. Antritt",{"$f":"+'Anhang zum Spielbericht'!$G$234","v":1832},{"$f":"+'Anhang zum Spielbericht'!$H$234","v":1762},{"$f":"+'Anhang zum Spielbericht'!$I$234","v":1835},{"$f":"+'Anhang zum Spielbericht'!$J$234","v":1661},{"$f":"+'Anhang zum Spielbericht'!$K$234","v":1555},{"$f":"+'Anhang zum Spielbericht'!$L$234","v":1751},{"$f":"+'Anhang zum Spielbericht'!$M$234","v":2014},{"$f":"+'Anhang zum Spielbericht'!$N$234","v":0},{"$f":"+'Anhang zum Spielbericht'!$R$234","v":0},{"$f":"+'Anhang zum Spielbericht'!$S$234","v":0}]
[null,null,null,null,null,null,null,null,null,null,null,null,null,null,null,null,{"$f":"IF(Q8>0,RANK(Q8,$Q$8:$W$8,7),\"0\")","v":6},4,2,5,3,1,7,7,{"$error":"#N/A"},{"$error":"#N/A"},"0","0",null,null,"10. Antritt",{"$f":"+'Anhang zum Spielbericht'!$G$262","v":2017},{"$f":"+'Anhang zum Spielbericht'!$H$262","v":1842},{"$f":"+'Anhang zum Spielbericht'!$I$262","v":1718},{"$f":"+'Anhang zum Spielbericht'!$J$262","v":1706},{"$f":"+'Anhang zum Spielbericht'!$K$262","v":1756},{"$f":"+'Anhang zum Spielbericht'!$L$262","v":1633},{"$f":"+'Anhang zum Spielbericht'!$M$262","v":1974},{"$f":"+'Anhang zum Spielbericht'!$N$262","v":0},{"$f":"+'Anhang zum Spielbericht'!$R$262","v":0},{"$f":"+'Anhang zum Spielbericht'!$S$262","v":0},null,null,null,null,null,null,null,null,{"$error":"#VALUE!"},null,null,null,null,{"$error":"#VALUE!"},null,null,null,null,null,null,null,null,null,null,null,null,{"$error":"#VALUE!"},null,null,null,null,null,null,null,null,null,null,null,{"$error":"#VALUE!"}]
[null,null,null,null,null,null,null,null,null,null,null,null,null,null,null,null,{"$f":"IF(COUNTIF(Q8:$W$8,Q8)>1,\"1\",\"\")","v":""},{"$f":"IF(COUNTIF(R8:$W$8,R8)>1,\"1\",\"\")","v":""},{"$f":"IF(COUNTIF(S8:$W$8,S8)>1,\"1\",\"\")","v":""},{"$f":"IF(COUNTIF(T8:$W$8,T8)>1,\"1\",\"\")","v":""},{"$f":"IF(COUNTIF(U8:$W$8,U8)>1,\"1\",\"\")","v":""},{"$f":"IF(COUNTIF(V8:$W$8,V8)>1,\"1\",\"\")","v":""},{"$f":"IF(COUNTIF(W8:$W$8,W8)>1,\"1\",\"\")","v":""},{"$f":"IF(COUNTIF($W8:X$8,X8)>1,\"1\",\"\")","v":"1"},{"$f":"IF(COUNTIF(Q8:$W$8,Y8)>1,\"1\",\"\")","v":""},{"$f":"IF(COUNTIF($W8:Z$8,Z8)>1,\"1\",\"\")","v":"1"},{"$f":"IF(COUNTIF($Z8:AA$8,AA8)>1,\"1\",\"\")","v":""},{"$f":"IF(COUNTIF($Z8:AB$8,AB8)>1,\"1\",\"\")","v":"1"},null,null,"11. Antritt",{"$f":"+'Anhang zum Spielbericht'!$G$289","v":1867},{"$f":"+'Anhang zum Spielbericht'!$H$289","v":1952},{"$f":"+'Anhang zum Spielbericht'!$I$289","v":1639},{"$f":"+'Anhang zum Spielbericht'!$J$289","v":1953},{"$f":"+'Anhang zum Spielbericht'!$K$289","v":1418},{"$f":"+'Anhang zum Spielbericht'!$L$289","v":2062},{"$f":"+'Anhang zum Spielbericht'!$M$289","v":1757},{"$f":"+'Anhang zum Spielbericht'!$N$289","v":0},{"$f":"+'Anhang zum Spielbericht'!$R$289","v":0},{"$f":"+'Anhang zum Spielbericht'!$S$289","v":0}]
[null,null,null,null,null,null,null,null,null,null,null,null,null,null,null,null,null,null,null,null,null,null,null,null,null,null,null,null,null,null,"12. Antritt",{"$f":"+'Anhang zum Spielbericht'!$G$316","v":1845},{"$f":"+'Anhang zum Spielbericht'!$H$316","v":1888},{"$f":"+'Anhang zum Spielbericht'!$I$316","v":1899},{"$f":"+'Anhang zum Spielbericht'!$J$316","v":1984},{"$f":"+'Anhang zum Spielbericht'!$K$316","v":1802},{"$f":"+'Anhang zum Spielbericht'!$L$316","v":1718},{"$f":"+'Anhang zum Spielbericht'!$M$316","v":2017},{"$f":"+'Anhang zum Spielbericht'!$N$316","v":0},{"$f":"+'Anhang zum Spielbericht'!$R$316","v":0},{"$f":"+'Anhang zum Spielbericht'!$S$316","v":0}]
[null,null,null,null,null,null,null,null,null,null,null,null,null,null,null,null,"6. Antritt",null,null,null,null,null,null,null,null,null,null,null,null,null,"13. Antritt",{"$f":"+'Anhang zum Spielbericht'!$G$343","v":1900},{"$f":"+'Anhang zum Spielbericht'!$H$343","v":1733},{"$f":"+'Anhang zum Spielbericht'!$I$343","v":1906},{"$f":"+'Anhang zum Spielbericht'!$J$343","v":1542},{"$f":"+'Anhang zum Spielbericht'!$K$343","v":1841},{"$f":"+'Anhang zum Spielbericht'!$L$343","v":1793},{"$f":"+'Anhang zum Spielbericht'!$M$343","v":1922},{"$f":"+'Anhang zum Spielbericht'!$N$343","v":0},{"$f":"+'Anhang zum Spielbericht'!$R$343","v":1031},{"$f":"+'Anhang zum Spielbericht'!$S$343","v":1241}]
[null,null,null,null,null,null,null,null,null,null,null,null,null,null,null,null,{"$f":"IF(Q51=\"1\",+Q50+0.5,+Q50)","v":4},6,3,7,5,2,1,1,{"$error":"#N/A"},{"$error":"#N/A"},"0","0",null,null,"14. Antritt",{"$f":"+'Anhang zum Spielbericht'!$G$370","v":1925},{"$f":"+'Anhang zum Spielbericht'!$H$370","v":1832},{"$f":"+'Anhang zum Spielbericht'!$I$370","v":1653},{"$f":"+'Anhang zum Spielbericht'!$J$370","v":1813},{"$f":"+'Anhang zum Spielbericht'!$K$370","v":2045},{"$f":"+'Anhang zum Spielbericht'!$L$370","v":1841},{"$f":"+'Anhang zum Spielbericht'!$M$370","v":2091},{"$f":"+'Anhang zum Spielbericht'!$N$370","v":0},{"$f":"+'Anhang zum Spielbericht'!$R$370","v":0},{"$f":"+'Anhang zum Spielbericht'!$S$370","v":0}]
[null,null,null,null,null,null,null,null,null,null,null,null,null,null,null,null,{"$f":"IF(Q9>0,RANK(Q9,$Q$9:$W$9,7),\"0\")","v":4},6,3,7,5,2,1,1,{"$error":"#N/A"},{"$error":"#N/A"},"0","0",null,null,"Gesamt Pins:",{"$f":"SUM(AF36:AF49)","v":26254},25261,24708,24600,24257,24763,25432,1300,2843,3091,null,null,null,null,null,null,null,null,"S R H  1",null,null,null,null,"B W V  4",null,null,null,null,null,null,null,null,null,null,null,null,"S R H  1",null,null,null,null,null,null,null,null,null,null,null,"B W V  4"]
[null,null,null,null,null,null,null,null,null,null,null,null,null,null,null,null,{"$f":"IF(COUNTIF($Q$9:$W$9,Q9)>1,\"1\",\"\")","v":""},"","","","","","","","","","",""]
[null,null,null,null,null,null,null,null,null,null,null,null,null,null,null,null,null,null,null,null,null,null,null,null,null,null,null,null,null,null,null,"1. Antritt","2. Antritt","3. Antritt","4. Antritt","5. Antritt","6. Antritt","7. Antritt","8. Antritt","9. Antritt","10. Antritt","11. Antritt","12. Antritt","13. Antritt","14. Antritt","Gesamt Pins:"]
[null,null,null,null,null,null,null,null,null,null,null,null,null,null,null,null,"7. Antritt",null,null,null,null,null,null,null,null,null,null,null,null,null,{"$f":"+'Spielbogen 7er'!I10","v":"PAN 1"},{"$f":"+'Anhang zum Spielbericht'!$G$19","v":1914},{"$f":"+'Anhang zum Spielbericht'!$G$45","v":1912},{"$f":"+'Anhang zum Spielbericht'!$G$72","v":1975},{"$f":"+'Anhang zum Spielbericht'!$G$99","v":1777},{"$f":"+'Anhang zum Spielbericht'!$G$126","v":1907},{"$f":"+'Anhang zum Spielbericht'!$G$153","v":1880},{"$f":"+'Anhang zum Spielbericht'!$G$180","v":1686},{"$f":"+'Anhang zum Spielbericht'!$G$207","v":1817},{"$f":"+'Anhang zum Spielbericht'!$G$234","v":1832},{"$f":"+'Anhang zum Spielbericht'!$G$262","v":2017},{"$f":"+'Anhang zum Spielbericht'!$G$289","v":1867},{"$f":"+'Anhang zum Spielbericht'!$G$316","v":1845},{"$f":"+'Anhang zum Spielbericht'!$G$343","v":1900},{"$f":"+'Anhang zum Spielbericht'!$G$370","v":1925},{"$f":"SUM(AF53:AS53)","v":26254},null,null,null,null,null,null,null,null,null,null,null,null,null,null,null,null,null,null,null,null,null,{"$error":"#VALUE!"},null,null,null,null,null,null,null,null,null,null,null,{"$error":"#VALUE!"}]
[null,null,null,null,null,null,null,null,null,null,null,null,null,null,null,null,{"$f":"IF(Q56=\"1\",+Q55+0.5,+Q55)","v":1},6,2,7,4,3,5,5,{"$error":"#N/A"},{"$error":"#N/A"},"0","0",null,null,{"$f":"+'Spielbogen 7er'!I11","v":"DAT 2"},{"$f":"+'Anhang zum Spielbericht'!$H$19","v":1586},{"$f":"+'Anhang zum Spielbericht'!$H$45","v":1748},{"$f":"+'Anhang zum Spielbericht'!$H$72","v":1606},{"$f":"+'Anhang zum Spielbericht'!$H$99","v":1733},{"$f":"+'Anhang zum Spielbericht'!$H$126","v":1849},{"$f":"+'Anhang zum Spielbericht'!$H$153","v":1968},{"$f":"+'Anhang zum Spielbericht'!$H$180","v":1822},{"$f":"+'Anhang zum Spielbericht'!$H$207","v":1940},{"$f":"+'Anhang zum Spielbericht'!$H$234","v":1762},{"$f":"+'Anhang zum Spielbericht'!$H$262","v":1842},{"$f":"+'Anhang zum Spielbericht'!$H$289","v":1952},{"$f":"+'Anhang zum Spielbericht'!$H$316","v":1888},{"$f":"+'Anhang zum Spielbericht'!$H$343","v":1733},{"$f":"+'Anhang zum Spielbericht'!$H$370","v":1832},25261,null,null,null,{"$error":"#VALUE!"},null,null,null,null,{"$error":"#VALUE!"}]
[null,null,null,null,null,null,"KAH 1","DAT 2"," ",null,null,null,null,null,null,null,{"$f":"IF(Q10>0,RANK(Q10,$Q$10:$W$10,7),\"0\")","v":1},6,2,7,4,3,5,5,{"$error":"#N/A"},{"$error":"#N/A"},"0","0",null,null,{"$f":"+'Spielbogen 7er'!I12","v":"STI 3"},{"$f":"+'Anhang zum Spielbericht'!$I$19","v":1732},{"$f":"+'Anhang zum Spielbericht'!$I$45","v":1572},{"$f":"+'Anhang zum Spielbericht'!$I$72","v":1805},{"$f":"+'Anhang zum Spielbericht'!$I$99","v":1788},{"$f":"+'Anhang zum Spielbericht'!$I$126","v":1806},{"$f":"+'Anhang zum Spielbericht'!$I$153","v":1853},{"$f":"+'Anhang zum Spielbericht'!$I$180","v":1724},{"$f":"+'Anhang zum Spielbericht'!$I$207","v":1778},{"$f":"+'Anhang zum Spielbericht'!$I$234","v":1835},{"$f":"+'Anhang zum Spielbericht'!$I$262","v":1718},{"$f":"+'Anhang zum Spielbericht'!$I$289","v":1639},{"$f":"+'Anhang zum Spielbericht'!$I$316","v":1899},{"$f":"+'Anhang zum Spielbericht'!$I$343","v":1906},{"$f":"+'Anhang zum Spielbericht'!$I$370","v":1653},24708]
[null,null,null,null,null,null,"BAS 2","JUS 2"," ",null,null,null,null,null,null,null,{"$f":"IF(COUNTIF($Q$10:$W$10,Q7)>1,\"1\",\"\")","v":""},"","","","","","","","","","","",null,null,{"$f":"+'Spielbogen 7er'!I13","v":"SGS 1"},{"$f":"+'Anhang zum Spielbericht'!$J$19","v":1528},{"$f":"+'Anhang zum Spielbericht'!$J$45","v":1637},{"$f":"+'Anhang zum Spielbericht'!$J$72","v":1502},{"$f":"+'Anhang zum Spielbericht'!$J$99","v":1714},{"$f":"+'Anhang zum Spielbericht'!$J$126","v":1897},{"$f":"+'Anhang zum Spielbericht'!$J$153","v":2011},{"$f":"+'Anhang zum Spielbericht'!$J$180","v":1830},{"$f":"+'Anhang zum Spielbericht'!$J$207","v":1822},{"$f":"+'Anhang zum Spielbericht'!$J$234","v":1661},{"$f":"+'Anhang zum Spielbericht'!$J$262","v":1706},{"$f":"+'Anhang zum Spielbericht'!$J$289","v":1953},{"$f":"+'Anhang zum Spielbericht'!$J$316","v":1984},{"$f":"+'Anhang zum Spielbericht'!$J$343","v":1542},{"$f":"+'Anhang zum Spielbericht'!$J$370","v":1813},24600]
[null,null,null,null,null,null,"SGS 1","GAS 1"," ",null,null,null,null,null,null,null,null,null,null,null,null,null,null,null,null,null,null,null,null,null,{"$f":"+'Spielbogen 7er'!I14","v":"JUS 2"},{"$f":"+'Anhang zum Spielbericht'!$K$19","v":1349},{"$f":"+'Anhang zum Spielbericht'!$K$45","v":1664},{"$f":"+'Anhang zum Spielbericht'!$K$72","v":1609},{"$f":"+'Anhang zum Spielbericht'!$K$99","v":1734},{"$f":"+'Anhang zum Spielbericht'!$K$126","v":1811},{"$f":"+'Anhang zum Spielbericht'!$K$153","v":1961},{"$f":"+'Anhang zum Spielbericht'!$K$180","v":1754},{"$f":"+'Anhang zum Spielbericht'!$K$207","v":1958},{"$f":"+'Anhang zum Spielbericht'!$K$234","v":1555},{"$f":"+'Anhang zum Spielbericht'!$K$262","v":1756},{"$f":"+'Anhang zum Spielbericht'!$K$289","v":1418},{"$f":"+'Anhang zum Spielbericht'!$K$316","v":1802},{"$f":"+'Anhang zum Spielbericht'!$K$343","v":1841},{"$f":"+'Anhang zum Spielbericht'!$K$370","v":2045},24257]
[null,null,null,null,null,null,"FAH 2","FAH 3"," ",null,null,null,null,null,null,null,"8. Antritt",null,null,null,null,null,null,null,null,null,null,null,null,null,{"$f":"+'Spielbogen 7er'!I15","v":"P2 2"},{"$f":"+'Anhang zum Spielbericht'!$L$19","v":1740},{"$f":"+'Anhang zum Spielbericht'!$L$45","v":1761},{"$f":"+'Anhang zum Spielbericht'!$L$72","v":1781},{"$f":"+'Anhang zum Spielbericht'!$L$99","v":1659},{"$f":"+'Anhang zum Spielbericht'!$L$126","v":1759},{"$f":"+'Anhang zum Spielbericht'!$L$153","v":1692},{"$f":"+'Anhang zum Spielbericht'!$L$180","v":1749},{"$f":"+'Anhang zum Spielbericht'!$L$207","v":1824},{"$f":"+'Anhang zum Spielbericht'!$L$234","v":1751},{"$f":"+'Anhang zum Spielbericht'!$L$262","v":1633},{"$f":"+'Anhang zum Spielbericht'!$L$289","v":2062},{"$f":"+'Anhang zum Spielbericht'!$L$316","v":1718},{"$f":"+'Anhang zum Spielbericht'!$L$343","v":1793},{"$f":"+'Anhang zum Spielbericht'!$L$370","v":1841},24763,null,null,null,"E D  2",null,null,null,null,"E L B  1",null,null,null,null,null,null,null,null,null,null,null,null,"E D  2",null,null,null,null,null,null,null,null,null,null,null,"E L B  1"]
[null,null,null,null,null,null,"CLP 1","OTT 3"," ",null,null,null,null,null,null,null,{"$f":"IF(Q61=\"1\",+Q60+0.5,+Q60)","v":2},5,1,3,6,4,7,7,{"$error":"#N/A"},{"$error":"#N/A"},"0","0",null,null,{"$f":"+'Spielbogen 7er'!I16","v":"KS 2"},{"$f":"+'Anhang zum Spielbericht'!$M$19","v":1229},{"$f":"+'Anhang zum Spielbericht'!$M$45","v":1282},{"$f":"+'Anhang zum Spielbericht'!$M$72","v":1909},{"$f":"+'Anhang zum Spielbericht'!$M$99","v":1952},{"$f":"+'Anhang zum Spielbericht'!$M$126","v":1914},{"$f":"+'Anhang zum Spielbericht'!$M$153","v":1445},{"$f":"+'Anhang zum Spielbericht'!$M$180","v":1777},{"$f":"+'Anhang zum Spielbericht'!$M$207","v":2149},{"$f":"+'Anhang zum Spielbericht'!$M$234","v":2014},{"$f":"+'Anhang zum Spielbericht'!$M$262","v":1974},{"$f":"+'Anhang zum Spielbericht'!$M$289","v":1757},{"$f":"+'Anhang zum Spielbericht'!$M$316","v":2017},{"$f":"+'Anhang zum Spielbericht'!$M$343","v":1922},{"$f":"+'Anhang zum Spielbericht'!$M$370","v":2091},25432]
[null,null,null,null,null,null,"TRE 1","HAS 7"," ",null,null,null,null,null,null,null,{"$f":"IF(Q11>0,RANK(Q11,$Q$11:$W$11,7),\"0\")","v":2},5,1,3,6,4,7,7,{"$error":"#N/A"},{"$error":"#N/A"},"0","0",null,null,{"$f":"+'Spielbogen 7er'!I17","v":0},{"$f":"+'Anhang zum Spielbericht'!$N$19","v":1300},{"$f":"+'Anhang zum Spielbericht'!$N$45","v":0},{"$f":"+'Anhang zum Spielbericht'!$N$72","v":0},{"$f":"+'Anhang zum Spielbericht'!$N$99","v":0},{"$f":"+'Anhang zum Spielbericht'!$N$126","v":0},{"$f":"+'Anhang zum Spielbericht'!$N$153","v":0},{"$f":"+'Anhang zum Spielbericht'!$N$180","v":0},{"$f":"+'Anhang zum Spielbericht'!$N$207","v":0},{"$f":"+'Anhang zum Spielbericht'!$N$234","v":0},{"$f":"+'Anhang zum Spielbericht'!$N$262","v":0},{"$f":"+'Anhang zum Spielbericht'!$N$289","v":0},{"$f":"+'Anhang zum Spielbericht'!$N$316","v":0},{"$f":"+'Anhang zum Spielbericht'!$N$343","v":0},{"$f":"+'Anhang zum Spielbericht'!$N$370","v":0},1300]
[null,null,null,null,null,null," ",null,null,null,null,null,null,null,null,null,{"$f":"IF(COUNTIF($Q$11:$W$11,Q11)>1,\"1\",\"\")","v":""},"","","","","","","","","","","",null,null,{"$f":"+'Spielbogen 7er'!$G$17","v":0},{"$f":"+'Anhang zum Spielbericht'!$R$19","v":1812},{"$f":"+'Anhang zum Spielbericht'!$R$45","v":0},{"$f":"+'Anhang zum Spielbericht'!$R$72","v":0},{"$f":"+'Anhang zum Spielbericht'!$R$99","v":0},{"$f":"+'Anhang zum Spielbericht'!$R$126","v":0},{"$f":"+'Anhang zum Spielbericht'!$R$153","v":0},{"$f":"+'Anhang zum Spielbericht'!$R$180","v":0},{"$f":"+'Anhang zum Spielbericht'!$R$207","v":0},{"$f":"+'Anhang zum Spielbericht'!$R$234","v":0},{"$f":"+'Anhang zum Spielbericht'!$R$262","v":0},{"$f":"+'Anhang zum Spielbericht'!$R$289","v":0},{"$f":"+'Anhang zum Spielbericht'!$R$316","v":0},{"$f":"+'Anhang zum Spielbericht'!$R$343","v":1031},{"$f":"+'Anhang zum Spielbericht'!$R$370","v":0},2843,null,null,null,null,null,null,null,null,null,null,null,null,null,null,null,null,null,null,null,null,null,{"$error":"#VALUE!"},null,null,null,null,null,null,null,null,null,null,null,{"$error":"#VALUE!"}]
[null,null,null,null,null,null," ",null,null,null,null,null,null,null,null,null,null,null,null,null,null,null,null,null,null,null,null,null,null,null,{"$f":"+'Spielbogen 7er'!$G$18","v":0},{"$f":"+'Anhang zum Spielbericht'!$S$19","v":1850},{"$f":"+'Anhang zum Spielbericht'!$S$45","v":0},{"$f":"+'Anhang zum Spielbericht'!$S$72","v":0},{"$f":"+'Anhang zum Spielbericht'!$S$99","v":0},{"$f":"+'Anhang zum Spielbericht'!$S$126","v":0},{"$f":"+'Anhang zum Spielbericht'!$S$153","v":0},{"$f":"+'Anhang zum Spielbericht'!$S$180","v":0},{"$f":"+'Anhang zum Spielbericht'!$S$207","v":0},{"$f":"+'Anhang zum Spielbericht'!$S$234","v":0},{"$f":"+'Anhang zum Spielbericht'!$S$262","v":0},{"$f":"+'Anhang zum Spielbericht'!$S$289","v":0},{"$f":"+'Anhang zum Spielbericht'!$S$316","v":0},{"$f":"+'Anhang zum Spielbericht'!$S$343","v":1241},{"$f":"+'Anhang zum Spielbericht'!$S$370","v":0},3091,null,null,null,{"$error":"#VALUE!"},null,null,null,null,{"$error":"#VALUE!"}]
[null,null,null,null,null,null,null,null,null,null,null,null,null,null,null,null,"9. Antritt"]
[null,null,null,null,null,null,null,null,null,null,null,null,null,null,null,null,{"$f":"IF(Q66=\"1\",+Q65+0.5,+Q65)","v":5},4,6,2,1,3,7,7,{"$error":"#N/A"},{"$error":"#N/A"},"0","0"]
[null,null,null,null,null,null,null,null,null,null,null,null,null,null,null,null,{"$f":"IF(Q12>0,RANK(Q12,$Q$12:$W$12,7),\"0\")","v":5},4,6,2,1,3,7,7,{"$error":"#N/A"},{"$error":"#N/A"},"0","0"]
[null,null,null,null,null,null,null,null,null,null,null,null,null,null,null,null,{"$f":"IF(COUNTIF($Q$12:$W$12,Q12)>1,\"1\",\"\")","v":""},"","","","","","","","","","","",null,null,null,null,null,null,null,null,null,null,null,null,null,null,null,null,null,null,null,null,null,"D K Y  1",null,null,null,null,"J U L  1",null,null,null,null,null,null,null,null,null,null,null,null,"D K Y  1",null,null,null,null,null,null,null,null,null,null,null,"J U L  1"]
[]
[null,null,null,null,null,null,null,null,null,null,null,null,null,null,null,null,"10. Antritt"]
[null,null,null,null,null,null,null,null,null,null,null,null,null,null,null,null,{"$f":"IF(Q71=\"1\",+Q70+0.5,+Q70)","v":7},5,3,2,4,1,6,6,{"$error":"#N/A"},{"$error":"#N/A"},"0","0",null,null,null,null,null,null,null,null,null,null,null,null,null,null,null,null,null,null,null,null,null,null,null,null,null,null,null,null,null,null,null,null,null,null,null,null,null,null,null,{"$error":"#VALUE!"},null,null,null,null,null,null,null,null,null,null,null,{"$error":"#VALUE!"}]
[null,null,null,null,null,null,null,null,null,null,null,null,null,null,null,null,{"$f":"IF(Q13>0,RANK(Q13,$Q$13:$W$13,7),\"0\")","v":7},5,3,2,4,1,6,6,{"$error":"#N/A"},{"$error":"#N/A"},"0","0",null,null,null,null,null,null,null,null,null,null,null,null,null,null,null,null,null,null,null,null,null,{"$error":"#VALUE!"},null,null,null,null,{"$error":"#VALUE!"}]
[null,null,null,null,null,null,null,null,null,null,null,null,null,null,null,null,{"$f":"IF(COUNTIF($Q$13:$W$13,Q13)>1,\"1\",\"\")","v":""},"","","","","","","","","","",""]
[]
[null,null,null,null,null,null,null,null,null,null,null,null,null,null,null,null,"11. Antritt"]
[null,null,null,null,null,null,null,null,null,null,null,null,null,null,null,null,{"$f":"IF(Q76=\"1\",+Q75+0.5,+Q75)","v":4},5,2,6,1,7,3,3,{"$error":"#N/A"},{"$error":"#N/A"},"0","0",null,null,null,null,null,null,null,null,null,null,null,null,null,null,null,null,null,null,null,null,null,"H P A  1",null,null,null,null,"D A T  1",null,null,null,null,null,null,null,null,null,null,null,null,"H P A  1",null,null,null,null,null,null,null,null,null,null,null,"D A T  1"]
[null,null,null,null,null,null,null,null,null,null,null,null,null,null,null,null,{"$f":"IF(Q14>0,RANK(Q14,$Q$14:$W$14,7),\"0\")","v":4},5,2,6,1,7,3,3,{"$error":"#N/A"},{"$error":"#N/A"},"0","0"]
[null,null,null,null,null,null,null,null,null,null,null,null,null,null,null,null,{"$f":"IF(COUNTIF($Q$14:$W$14,Q14)>1,\"1\",\"\")","v":""},"","","","","","","","","","",""]
[null,null,null,null,null,null,null,null,null,null,null,null,null,null,null,null,null,null,null,null,null,null,null,null,null,null,null,null,null,null,null,null,null,null,null,null,null,null,null,null,null,null,null,null,null,null,null,null,null,null,null,null,null,null,null,null,null,null,null,null,null,null,null,null,null,null,null,{"$error":"#VALUE!"},null,null,null,null,null,null,null,null,null,null,null,{"$error":"#VALUE!"}]
[null,null,null,null,null,null,null,null,null,null,null,null,null,null,null,null,"12. Antritt",null,null,null,null,null,null,null,null,null,null,null,null,null,null,null,null,null,null,null,null,null,null,null,null,null,null,null,null,null,null,null,null,{"$error":"#VALUE!"},null,null,null,null,{"$error":"#VALUE!"}]
[null,null,null,null,null,null,null,null,null,null,null,null,null,null,null,null,{"$f":"IF(Q81=\"1\",+Q80+0.5,+Q80)","v":3},4,5,6,2,1,7,7,{"$error":"#N/A"},{"$error":"#N/A"},"0","0"]
[null,null,null,null,null,null,null,null,null,null,null,null,null,null,null,null,{"$f":"IF(Q15>0,RANK(Q15,$Q$15:$W$15,7),\"0\")","v":3},4,5,6,2,1,7,7,{"$error":"#N/A"},{"$error":"#N/A"},"0","0"]
[null,null,null,null,null,null,null,null,null,null,null,null,null,null,null,null,{"$f":"IF(COUNTIF($Q$15:$W$15,Q15)>1,\"1\",\"\")","v":""},"","","","","","","","","","",""]
[null,null,null,null,null,null,null,null,null,null,null,null,null,null,null,null,null,null,null,null,null,null,null,null,null,null,null,null,null,null,null,null,null,null,null,null,null,null,null,null,null,null,null,null,null,null,null,null,null,"K S  2",null,null,null,null,"P A N  1",null,null,null,null,null,null,null,null,null,null,null,null,"K S  2",null,null,null,null,null,null,null,null,null,null,null,"P A N  1"]
[null,null,null,null,null,null,null,null,null,null,null,null,null,null,null,null,"13. Antritt"]
[null,null,null,null,null,null,null,null,null,null,null,null,null,null,null,null,{"$f":"IF(Q86=\"1\",+Q85+0.5,+Q85)","v":5},2,6,1,4,3,7,7,{"$error":"#N/A"},{"$error":"#N/A"},"0","0"]
[null,null,null,null,null,null,null,null,null,null,null,null,null,null,null,null,{"$f":"IF(Q16>0,RANK(Q16,$Q$16:$W$16,7),\"0\")","v":5},2,6,1,4,3,7,7,{"$error":"#N/A"},{"$error":"#N/A"},"0","0"]
[null,null,null,null,null,null,null,null,null,null,null,null,null,null,null,null,{"$f":"IF(COUNTIF($Q$16:$W$16,Q16)>1,\"1\",\"\")","v":""},"","","","","","","","","","",""]
[]
[null,null,null,null,null,null,null,null,null,null,null,null,null,null,null,null,"14. Antritt"]
[null,null,null,null,null,null,null,null,null,null,null,null,null,null,null,null,{"$f":"IF(Q91=\"1\",+Q90+0.5,+Q90)","v":5},3,1,2,6,4,7,7,{"$error":"#N/A"},{"$error":"#N/A"},"0","0"]
[null,null,null,null,null,null,null,null,null,null,null,null,null,null,null,null,{"$f":"IF(Q17>0,RANK(Q17,$Q$17:$W$17,7),\"0\")","v":5},3,1,2,6,4,7,7,{"$error":"#N/A"},{"$error":"#N/A"},"0","0"]
[null,null,null,null,null,null,null,null,null,null,null,null,null,null,null,null,{"$f":"IF(COUNTIF($Q$17:$W$17,Q17)>1,\"1\",\"\")","v":""},"","","","","","","","","","",""]

{"sheet":"Anhang zum Spielbericht","index":19,"n_rows":376,"n_cols":219,"rows_kept":376,"cut":false,"hidden":false,"merged":[[361,1,361,2],[362,1,362,2],[37,1,37,2],[38,1,38,2],[65,1,65,2],[373,4,373,5],[133,4,133,5],[159,4,159,5],[186,4,186,5],[213,4,213,5],[240,4,240,5],[268,4,268,5],[295,4,295,5],[322,4,322,5],[350,4,350,5],[368,4,368,5],[369,4,369,5],[370,4,370,5],[371,4,371,5],[262,4,262,5],[263,4,263,5],[260,4,260,5],[228,4,228,5],[303,4,303,5],[261,4,261,5],[258,4,258,5],[259,4,259,5],[254,1,254,2],[280,1,280,2],[281,1,281,2],[83,0,83,2],[110,0,110,2],[137,0,137,2],[164,0,164,2],[191,0,191,2],[218,0,218,2],[245,0,245,2],[273,0,273,2],[128,4,128,5],[152,4,152,5],[153,4,153,5],[117,4,119,5],[113,4,113,5],[106,4,106,5],[198,4,200,5],[202,4,202,5],[203,4,203,5],[121,4,121,5],[300,0,300,2],[91,1,91,2],[92,1,92,2],[118,1,118,2],[172,1,172,2],[173,1,173,2],[119,1,119,2],[145,1,145,2],[146,1,146,2],[198,1,198,2],[199,1,199,2],[225,1,225,2],[226,1,226,2],[253,1,253,2],[334,1,334,2],[335,1,335,2],[327,0,327,2],[354,0,354,2],[307,1,307,2],[308,1,308,2],[337,4,337,5],[312,4,312,5],[316,4,316,5],[317,4,317,5],[310,4,310,5],[313,4,313,5],[0,207,0,208],[1,207,1,208],[372,4,372,5],[361,4,363,5],[365,4,365,5],[366,4,366,5],[357,4,357,5],[367,4,367,5],[0,191,0,192],[1,191,1,192],[343,4,343,5],[344,4,344,5],[0,175,0,176],[1,175,1,176],[345,4,345,5],[334,4,336,5],[276,4,276,5],[286,4,286,5],[287,4,287,5],[311,4,311,5],[182,4,182,5],[205,4,205,5],[206,4,206,5],[201,4,201,5],[0,159,0,160],[1,159,1,160],[289,4,289,5],[290,4,290,5],[0,143,0,144],[1,143,1,144],[0,127,0,128],[1,127,1,128],[234,4,234,5],[235,4,235,5],[0,111,0,112],[1,111,1,112],[264,4,264,5],[253,4,255,5],[257,4,257,5],[147,4,147,5],[0,95,0,96],[1,95,1,96],[180,4,180,5],[181,4,181,5],[0,79,0,80],[1,79,1,80],[0,63,0,64],[1,63,1,64],[0,47,0,48],[1,47,1,48],[155,4,155,5],[144,4,146,5],[148,4,148,5],[149,4,149,5],[140,4,140,5],[150,4,150,5],[0,31,0,32],[1,31,1,32],[69,4,69,5],[70,4,70,5],[71,4,71,5],[101,4,101,5],[86,4,86,5],[74,4,74,5],[73,4,73,5],[67,4,67,5],[66,4,66,5],[93,4,93,5],[68,4,68,5],[51,4,51,5],[79,4,79,5],[126,4,126,5],[0,0,0,1],[1,0,1,1],[7,4,7,5],[11,4,13,5],[64,1,64,2],[46,4,46,5],[59,4,59,5],[4,0,4,2],[29,0,29,2],[56,0,56,2],[47,4,47,5],[36,4,38,5],[40,4,40,5],[41,4,41,5],[32,4,32,5],[63,4,65,5],[14,4,14,5],[15,4,15,5],[16,4,16,5],[17,4,17,5],[18,4,18,5],[19,4,19,5],[43,4,43,5],[44,4,44,5],[39,4,39,5],[42,4,42,5],[45,4,45,5],[98,4,98,5],[99,4,99,5],[100,4,100,5],[90,4,92,5],[94,4,94,5],[95,4,95,5],[96,4,96,5],[97,4,97,5],[72,4,72,5],[122,4,122,5],[123,4,123,5],[124,4,124,5],[125,4,125,5],[151,4,151,5],[120,4,120,5],[154,4,154,5],[176,4,176,5],[167,4,167,5],[174,4,174,5],[171,4,173,5],[175,4,175,5],[177,4,177,5],[178,4,178,5],[179,4,179,5],[127,4,127,5],[364,4,364,5],[291,4,291,5],[280,4,282,5],[284,4,284,5],[285,4,285,5],[341,4,341,5],[342,4,342,5],[283,4,283,5],[338,4,338,5],[339,4,339,5],[330,4,330,5],[340,4,340,5],[318,4,318,5],[307,4,309,5],[314,4,314,5],[315,4,315,5],[288,4,288,5],[209,4,209,5],[207,4,207,5],[208,4,208,5],[256,4,256,5],[236,4,236,5],[194,4,194,5],[204,4,204,5],[225,4,227,5],[248,4,248,5],[229,4,229,5],[230,4,230,5],[221,4,221,5],[231,4,231,5],[232,4,232,5],[233,4,233,5]]}
["Start",null,null,null,null,null,null,null,null,null,null,null,null,null,null,null,null,null,null,null,null,null,null,null,null,null,null,null,null,null,null,"Start",null,null,null,null,null,null,null,null,null,null,null,null,null,null,null,null,null,null,null,null,null,null,null,null,null,null,null,null,null,null,null,null,null,null,null,null,null,null,null,null,null,null,null,null,null,null,null,null,null,null,null,null,null,null,null,null,null,null,null,null,null,null,null,null,null,null,null,null,null,null,null,null,null,null,null,null,null,null,null,null,null,null,null,null,null,null,null,null,null,null,null,null,null,null,null,null,null,null,null,null,null,null,null,null,null,null,null,null,null,null,null,"Start",null,null,null,null,null,null,null,null,null,null,null,null,null,null,null,"Start",null,null,null,null,null,null,null,null,null,null,null,null,null,null,null,"Start",null,null,null,null,null,null,null,null,null,null,null,null,null,null,null,"Start",null,null,null,null,null,null,null,null,null,null,null,null,null,null,null,"Start"]
["Rangliste",null,null,null,null,null,null,null,null,null,null,null,null,null,null,null,null,null,null,null,null,null,null,null,null,null,null,null,null,null,null,"Rangliste",null,null,null,null,null,null,null,null,null,null,null,null,null,null,null,null,null,null,null,null,null,null,null,null,null,null,null,null,null,null,null,null,null,null,null,null,null,null,null,null,null,null,null,null,null,null,null,null,null,null,null,null,null,null,null,null,null,null,null,null,null,null,null,null,null,null,null,null,null,null,null,null,null,null,null,null,null,null,null,null,null,null,null,null,null,null,null,null,null,null,null,null,null,null,null,null,null,null,null,null,null,null,null,null,null,null,null,null,null,null,null,"Rangliste",null,null,null,null,null,null,null,null,null,null,null,null,null,null,null,"Rangliste",null,null,null,null,null,null,null,null,null,null,null,null,null,null,null,"Rangliste",null,null,null,null,null,null,null,null,null,null,null,null,null,null,null,"Rangliste",null,null,null,null,null,null,null,null,null,null,null,null,null,null,null,"Rangliste"]
[]
[null,null,null,null,"Anhang zum Spielbericht  B O W L I N G"]
["Anhang auswählen",null,null,null,null,null,null,null,null,null,null,null,null,"Punktspielserie"]
[null,null,null,null,"alle Felder sind unbedingt auszufüllen und mit dem Original-Spielbericht einzusenden."]
[]
[null,null,null,null,"Klasse:",null,{"$f":"+Hilfstabelle!$G$5","v":"B4"},"Antritt-Nr. :",1,"Datum :",{"$f":"VLOOKUP(I8,Hilfstabelle!$I$5:$J$18,2,0)","v":"2024-09-12"},"Halle :",{"$f":"VLOOKUP(I8,Hilfstabelle!$I$5:$L$18,3,0)","v":"Othmarschen"}]
[]
[null,null,null,null,null,null,"Ausrichter BSG:",{"$f":"VLOOKUP(I8,Hilfstabelle!$I$5:$L$18,4,0)","v":"Panasonic 1"},"Mannschaftsführer: Michael Wetzel",null,null,"Telefon: 0172/412 45 69"]
[null,null,null,null,null,null,"Bahn:","Bahn:","Bahn:","Bahn:","Bahn:","Bahn:","Bahn:","Bahn:",null,null,null,"Bahn:","Bahn:"]
[null,null,null,null,"Durch-\ngänge",null,"BSG","BSG","BSG","BSG","BSG","BSG","BSG","BSG",null,null,null,"BSG","BSG"]
["Drucken",null,null,null,null,null,{"$f":"VLOOKUP(G14,Hilfstabelle!$L$5:$M$16,2,0)","v":"PAN 1"},{"$f":"VLOOKUP(H14,Hilfstabelle!$L$5:$M$16,2,0)","v":"DAT 2"},{"$f":"VLOOKUP(I14,Hilfstabelle!$L$5:$M$16,2,0)","v":"STI 3"},{"$f":"VLOOKUP(J14,Hilfstabelle!$L$5:$M$16,2,0)","v":"SGS 1"},{"$f":"VLOOKUP(K14,Hilfstabelle!$L$5:$M$16,2,0)","v":"JUS 2"},{"$f":"VLOOKUP(L14,Hilfstabelle!$L$5:$M$16,2,0)","v":"P2 2"},{"$f":"VLOOKUP(M14,Hilfstabelle!$L$5:$M$16,2,0)","v":"KS 2"},{"$f":"VLOOKUP(N14,Hilfstabelle!$L$5:$M$16,2,0)","v":"PAN 1"},null,null,null,{"$f":"VLOOKUP(R14,Hilfstabelle!$L$5:$M$16,2,0)","v":"DAT 2"},{"$f":"VLOOKUP(S14,Hilfstabelle!$L$5:$M$16,2,0)","v":"STI 3"}]
[null,null,null,null,null,null,{"$f":"+Hilfstabelle!L5","v":"Panasonic 1"},{"$f":"+Hilfstabelle!L6","v":"Dataport 2"},{"$f":"+Hilfstabelle!L7","v":"Still 3"},{"$f":"+Hilfstabelle!L8","v":"SG Stern Hamburg 1"},{"$f":"+Hilfstabelle!L9","v":"Justitzbehörde 2"},{"$f":"+Hilfstabelle!L10","v":"Postamt 2"},{"$f":"+Hilfstabelle!L11","v":"Körber Sports 2"},{"$f":"+Hilfstabelle!L12","v":"Panasonic 1"},null,null,null,{"$f":"+Hilfstabelle!L13","v":"Dataport 2"},{"$f":"+Hilfstabelle!$L14","v":"Still 3"}]
[null,null,null,null,1,null,651,555,543,478,457,641,382,606,null,null,null,561,576]
[null,null,null,null,2,null,674,504,580,517,475,598,406,694,null,null,null,702,617]
[null,null,null,null,"1 + 2",null,{"$f":"+G16+G15","v":1325},1059,1123,995,932,1239,788,1300,null,null,null,{"$f":"+R16+R15","v":1263},{"$f":"+S16+S15","v":1193}]
[null,null,null,null,3,null,589,527,609,533,417,501,441,null,null,null,null,549,657]
[null,null,null,null,"Pins\nGesamt",null,{"$f":"+G18+G17","v":1914},1586,1732,1528,1349,1740,1229,1300,null,null,null,{"$f":"+R18+R17","v":1812},{"$f":"+S18+S17","v":1850}]
[null,null,null,null,"Punkte\nAntritt",null,{"$f":"IF(G23=\"1\",+G22+0.5,+G22)","v":7},4,5,3,2,6,1,{"$error":"#N/A"},null,null,null,{"$f":"IF(R23=\"1\",+R22+0.5,+R22)","v":8},{"$f":"IF(S23=\"1\",+S22+0.5,+S22)","v":9}]
[]
[null,null,null,null,null,null,{"$f":"IF(G15>0,RANK(G19,$G$19:$M$19,7),\"0\")","v":7},{"$f":"IF(H15>0,RANK(H19,$G$19:$M$19,7),\"0\")","v":4},5,3,2,6,1,{"$f":"IF(N15>0,RANK(N19,$G$19:$M$19,8),\"0\")","v":{"$error":"#N/A"}},null,null,null,{"$f":"IF(R15>0,RANK(R19,$G$19:$S$19,10),\"0\")","v":8},{"$f":"IF(S15>0,RANK(S19,$G$19:$S$19,10),\"0\")","v":9}]
[null,null,null,null,null,null,{"$f":"IF(COUNTIF($G$22:$M$22,G22)>1,\"1\",\"\")","v":""},{"$f":"IF(COUNTIF($G$22:$M$22,H22)>1,\"1\",\"\")","v":""},"","","","","",{"$f":"IF(COUNTIF($G$22:$M$22,N22)>1,\"1\",\"\")","v":""},null,null,null,{"$f":"IF(COUNTIF($G$22:$S$22,R22)>1,\"1\",\"\")","v":""},{"$f":"IF(COUNTIF($G$22:$S$22,S22)>1,\"1\",\"\")","v":""}]
[]
[]
[]
[null,null,null,null,null,null,null,null,null,null,null,null,null,null,null,null,null,null,null,null,null,null,null,null,null,null,null,null,null,null,null,null,null,{"$f":"+AH26+1","v":1},1,1,1,1,null,null,null,null,null,null,null,null,null,null,null,null,null,null,null,null,null,null,null,null,null,null,null,null,null,null,null,null,null,null,null,null,null,null,null,null,null,null,null,null,null,null,null,null,null,null,null,null,null,null,null,null,null,null,null,null,null,null,null,null,null,null,null,null,null,null,null,null,null,null,null,null,null,null,null,null,null,null,null,null,null,null,null,null,null,null,null,null,null,null,null,null,null,null,null,null,null,null,null,null,{"$f":"+EI26+1","v":1},null,null,null,null,null,null,{"$f":"+EP26+1","v":1},1,1,1,1,1,1,1,1,1,null,null,null,null,null,null,{"$f":"+FF26+1","v":1},1,1,1,1,1,1,1,1,1,null,null,null,null,null,null,{"$f":"+FV26+1","v":1},1,1,1,1,1,1,1,1,1,null,null,null,null,null,null,{"$f":"+GL26+1","v":1},1,1,1,1,1,1,1,1,1,null,null,null,null,null,null,{"$f":"+HB26+1","v":1},1,1,1,1,1,1,1,1,1]
[null,null,null,null,null,null,null,null,null,null,null,null,null,null,null,null,null,null,null,{"$f":"+T27+1","v":1},1,null,1,1,1,1,1,1,1,null,null,null,null,{"$f":"+AH27/2","v":0.5},0.5,0.5,0.5,0.5,null,null,null,null,null,null,null,null,null,null,null,null,null,null,null,null,null,null,null,null,null,null,null,null,null,null,null,null,null,null,null,null,null,null,null,null,null,null,null,null,null,null,null,null,null,null,null,null,null,null,null,null,null,null,null,null,null,null,null,null,null,null,null,null,null,null,null,null,null,null,null,null,null,null,null,null,null,null,null,null,null,null,null,null,null,null,null,null,null,null,null,null,null,null,null,null,null,null,null,null,{"$f":"+EI27/2","v":0.5},null,null,null,null,null,null,{"$f":"+EP27/2","v":0.5},0.5,0.5,0.5,0.5,0.5,0.5,0.5,0.5,0.5,null,null,null,null,null,null,{"$f":"+FF27/2","v":0.5},0.5,0.5,0.5,0.5,0.5,0.5,0.5,0.5,0.5,null,null,null,null,null,null,{"$f":"+FV27/2","v":0.5},0.5,0.5,0.5,0.5,0.5,0.5,0.5,0.5,0.5,null,null,null,null,null,null,{"$f":"+GL27/2","v":0.5},0.5,0.5,0.5,0.5,0.5,0.5,0.5,0.5,0.5,null,null,null,null,null,null,{"$f":"+HB27/2","v":0.5},0.5,0.5,0.5,0.5,0.5,0.5,0.5,0.5,0.5]
[null,null,null,null,"Anhang zum Spielbericht  B O W L I N G",null,null,null,null,null,null,null,null,null,null,null,null,null,null,{"$f":"+T28/2","v":0.5},0.5,null,0.5,0.5,0.5,0.5,0.5,0.5,0.5]
["Anhang auswählen",null,null,null,null,null,null,null,null,null,null,null,null,"Punktspielserie"]
[null,null,null,null,"alle Felder sind unbedingt auszufüllen und mit dem Original-Spielbericht einzusenden."]
[]
[null,null,null,null,"Klasse:",null,{"$f":"+Hilfstabelle!$G$5","v":"B4"},"Antritt-Nr. :",2,"Datum :",{"$f":"VLOOKUP(I33,Hilfstabelle!$I$5:$J$18,2,0)","v":"2024-09-26"},"Halle :",{"$f":"VLOOKUP(I33,Hilfstabelle!$I$5:$L$18,3,0)","v":"Othmarschen"}]
[]
[null,null,null,null,null,null,"Ausrichter BSG:",{"$f":"VLOOKUP(I33,Hilfstabelle!$I$5:$L$18,4,0)","v":"Dataport 2"},"Mannschaftsführer: Michael Wetzel",null,null,"Telefon: 0172/412 45 69"]
[null,null,null,null,null,null,"Bahn:","Bahn:","Bahn:","Bahn:","Bahn:","Bahn:","Bahn:","Bahn:",null,null,null,"Bahn:","Bahn:"]
[null,null,null,null,"Durch-\ngänge",null,"BSG","BSG","BSG","BSG","BSG","BSG","BSG","BSG",null,null,null,"BSG","BSG"]
["Drucken","Start",null,null,null,null,{"$f":"VLOOKUP(G39,Hilfstabelle!$L$5:$M$16,2,0)","v":"PAN 1"},{"$f":"VLOOKUP(H39,Hilfstabelle!$L$5:$M$16,2,0)","v":"DAT 2"},{"$f":"VLOOKUP(I39,Hilfstabelle!$L$5:$M$16,2,0)","v":"STI 3"},{"$f":"VLOOKUP(J39,Hilfstabelle!$L$5:$M$16,2,0)","v":"SGS 1"},{"$f":"VLOOKUP(K39,Hilfstabelle!$L$5:$M$16,2,0)","v":"JUS 2"},{"$f":"VLOOKUP(L39,Hilfstabelle!$L$5:$M$16,2,0)","v":"P2 2"},{"$f":"VLOOKUP(M39,Hilfstabelle!$L$5:$M$16,2,0)","v":"KS 2"},{"$f":"VLOOKUP(N39,Hilfstabelle!$L$5:$M$16,2,0)","v":"PAN 1"},null,null,null,{"$f":"VLOOKUP(R39,Hilfstabelle!$L$5:$M$16,2,0)","v":"DAT 2"},{"$f":"VLOOKUP(S39,Hilfstabelle!$L$5:$M$16,2,0)","v":"STI 3"}]
[null,"Rangliste",null,null,null,null,{"$f":"+Hilfstabelle!L5","v":"Panasonic 1"},{"$f":"+Hilfstabelle!L6","v":"Dataport 2"},{"$f":"+Hilfstabelle!L7","v":"Still 3"},{"$f":"+Hilfstabelle!L8","v":"SG Stern Hamburg 1"},{"$f":"+Hilfstabelle!L9","v":"Justitzbehörde 2"},{"$f":"+Hilfstabelle!L10","v":"Postamt 2"},{"$f":"+Hilfstabelle!L11","v":"Körber Sports 2"},{"$f":"+Hilfstabelle!L12","v":"Panasonic 1"},null,null,null,{"$f":"+Hilfstabelle!L13","v":"Dataport 2"},{"$f":"+Hilfstabelle!$L14","v":"Still 3"}]
[null,null,null,null,"Platz",null,{"$f":"HLOOKUP(G39,Hilfstabelle!$H$20:$Q$21,2,0)","v":"2."},{"$f":"HLOOKUP(H39,Hilfstabelle!$H$20:$Q$21,2,0)","v":"3."},{"$f":"HLOOKUP(I39,Hilfstabelle!$H$20:$Q$21,2,0)","v":"5."},{"$f":"HLOOKUP(J39,Hilfstabelle!$H$20:$Q$21,2,0)","v":"4."},{"$f":"HLOOKUP(K39,Hilfstabelle!$H$20:$Q$21,2,0)","v":"6."},{"$f":"HLOOKUP(L39,Hilfstabelle!$H$20:$Q$21,2,0)","v":"7."},{"$f":"HLOOKUP(M39,Hilfstabelle!$H$20:$Q$21,2,0)","v":"1."},{"$f":"HLOOKUP(N39,Hilfstabelle!$H$20:$Q$21,2,0)","v":"2."},null,null,null,{"$f":"HLOOKUP(R39,Hilfstabelle!$H$20:$Q$21,2,0)","v":"3."},{"$f":"HLOOKUP(S39,Hilfstabelle!$H$20:$Q$21,2,0)","v":"5."}]
[null,null,null,null,1,null,599,604,526,524,544,576,372]
[null,null,null,null,2,null,615,575,515,567,535,550,447]
[null,null,null,null,"1 + 2",null,{"$f":"+G42+G41","v":1214},1179,1041,1091,1079,1126,819,0,null,null,null,{"$f":"+R42+R41","v":0},{"$f":"+S42+S41","v":0}]
[null,null,null,null,3,null,698,569,531,546,585,635,463]
[null,null,null,null,"Pins\nGesamt",null,{"$f":"+G44+G43","v":1912},{"$f":"+H44+H43","v":1748},1572,1637,1664,1761,1282,0,null,null,null,{"$f":"+R44+R43","v":0},{"$f":"+S44+S43","v":0}]
[null,null,null,null,"Punkte\nAntritt",null,{"$f":"IF(G51=\"1\",+G50+0.5,+G50)","v":7},{"$f":"IF(H51=\"1\",+H50+0.5,+H50)","v":5},2,3,4,6,1,"0",null,null,null,{"$f":"IF(R51=\"1\",+R50+0.5,+R50)","v":0.5},{"$f":"IF(S51=\"1\",+S50+0.5,+S50)","v":0.5}]
[null,null,null,null,"Punkte\nA L T",null,{"$f":"+G20","v":7},4,5,3,2,6,1,{"$error":"#N/A"},null,null,null,{"$f":"+R20","v":8},{"$f":"+S20","v":9}]
[null,null,null,null,"Punkte\nN E U",null,{"$f":"IF(G41>0,+G47+G46,\" \")","v":14},9,7,6,6,12,2," ",null,null,null,{"$f":"IF(R41>0,+R47+R46,\" \")","v":" "},{"$f":"IF(S41>0,+S47+S46,\" \")","v":" "}]
[]
[null,null,null,null,null,null,{"$f":"IF(G41>0,RANK(G45,$G$45:$M$45,7),\"0\")","v":7},{"$f":"IF(H41>0,RANK(H45,$G$45:$M$45,7),\"0\")","v":5},2,3,4,6,1,{"$f":"IF(N41>0,RANK(N45,$G$45:$M$45,8),\"0\")","v":"0"},{"$f":"IF(O41>0,RANK(O45,$G$45:$P$45,10),\"0\")","v":"0"},"0",null,{"$f":"IF(R41>0,RANK(R45,$G$45:$S$45,10),\"0\")","v":"0"},{"$f":"IF(S41>0,RANK(S45,$G$45:$S$45,10),\"0\")","v":"0"}]
[null,null,null,null,null,null,{"$f":"IF(COUNTIF($G$50:$M$50,G50)>1,\"1\",\"\")","v":""},{"$f":"IF(COUNTIF($G$50:$M$50,H50)>1,\"1\",\"\")","v":""},"","","","","",{"$f":"IF(COUNTIF($G$50:$M$50,N50)>1,\"1\",\"\")","v":""},{"$f":"IF(COUNTIF($G$50:$P$50,O50)>1,\"1\",\"\")","v":"1"},"1",null,{"$f":"IF(COUNTIF($G$50:$S$50,R50)>1,\"1\",\"\")","v":"1"},{"$f":"IF(COUNTIF($G$50:$S$50,S50)>1,\"1\",\"\")","v":"1"}]
[null,null,null,null,"Gesamt Pins",null,{"$f":"+G45+G19","v":3826},{"$f":"+H45+H19","v":3334},3304,3165,3013,3501,2511,1300,null,null,null,{"$f":"+R45+R19","v":1812},{"$f":"+S45+S19","v":1850}]
[]
[]
[]
[null,null,null,null,"Anhang zum Spielbericht  B O W L I N G"]
["Anhang auswählen",null,null,null,null,null,null,null,null,null,null,null,null,"Punktspielserie"]
[null,null,null,null,"alle Felder sind unbedingt auszufüllen und mit dem Original-Spielbericht einzusenden."]
[]
[null,null,null,null,"Klasse:",null,{"$f":"+Hilfstabelle!$G$5","v":"B4"},"Antritt-Nr. :",3,"Datum :",{"$f":"VLOOKUP(I60,Hilfstabelle!$I$5:$J$18,2,0)","v":"2024-10-10"},"Halle :",{"$f":"VLOOKUP(I60,Hilfstabelle!$I$5:$L$18,3,0)","v":"Wandsbek"}]
[]
[null,null,null,null,null,null,"Ausrichter BSG:",{"$f":"VLOOKUP(I60,Hilfstabelle!$I$5:$L$18,4,0)","v":"Still 3"},"Mannschaftsführer: Michael Wetzel",null,null,"Telefon: 0172/412 45 69"]
[null,null,null,null,null,null,"Bahn:","Bahn:","Bahn:","Bahn:","Bahn:","Bahn:","Bahn:","Bahn:",null,null,null,"Bahn:","Bahn:"]
[null,null,null,null,"Durch-\ngänge",null,"BSG","BSG","BSG","BSG","BSG","BSG","BSG","BSG",null,null,null,"BSG","BSG"]
["Drucken","Start",null,null,null,null,{"$f":"VLOOKUP(G66,Hilfstabelle!$L$5:$M$16,2,0)","v":"PAN 1"},{"$f":"VLOOKUP(H66,Hilfstabelle!$L$5:$M$16,2,0)","v":"DAT 2"},{"$f":"VLOOKUP(I66,Hilfstabelle!$L$5:$M$16,2,0)","v":"STI 3"},{"$f":"VLOOKUP(J66,Hilfstabelle!$L$5:$M$16,2,0)","v":"SGS 1"},{"$f":"VLOOKUP(K66,Hilfstabelle!$L$5:$M$16,2,0)","v":"JUS 2"},{"$f":"VLOOKUP(L66,Hilfstabelle!$L$5:$M$16,2,0)","v":"P2 2"},{"$f":"VLOOKUP(M66,Hilfstabelle!$L$5:$M$16,2,0)","v":"KS 2"},{"$f":"VLOOKUP(N66,Hilfstabelle!$L$5:$M$16,2,0)","v":"PAN 1"},null,null,null,{"$f":"VLOOKUP(R66,Hilfstabelle!$L$5:$M$16,2,0)","v":"DAT 2"},{"$f":"VLOOKUP(S66,Hilfstabelle!$L$5:$M$16,2,0)","v":"STI 3"}]
[null,"Rangliste",null,null,null,null,{"$f":"+Hilfstabelle!L5","v":"Panasonic 1"},{"$f":"+Hilfstabelle!L6","v":"Dataport 2"},{"$f":"+Hilfstabelle!L7","v":"Still 3"},{"$f":"+Hilfstabelle!L8","v":"SG Stern Hamburg 1"},{"$f":"+Hilfstabelle!L9","v":"Justitzbehörde 2"},{"$f":"+Hilfstabelle!L10","v":"Postamt 2"},{"$f":"+Hilfstabelle!L11","v":"Körber Sports 2"},{"$f":"+Hilfstabelle!L12","v":"Panasonic 1"},null,null,null,{"$f":"+Hilfstabelle!L13","v":"Dataport 2"},{"$f":"+Hilfstabelle!$L14","v":"Still 3"}]
[null,null,null,null,"Platz",null,{"$f":"HLOOKUP(G66,Hilfstabelle!$H$20:$Q$21,2,0)","v":"2."},{"$f":"HLOOKUP(H66,Hilfstabelle!$H$20:$Q$21,2,0)","v":"3."},{"$f":"HLOOKUP(I66,Hilfstabelle!$H$20:$Q$21,2,0)","v":"5."},{"$f":"HLOOKUP(J66,Hilfstabelle!$H$20:$Q$21,2,0)","v":"4."},{"$f":"HLOOKUP(K66,Hilfstabelle!$H$20:$Q$21,2,0)","v":"6."},{"$f":"HLOOKUP(L66,Hilfstabelle!$H$20:$Q$21,2,0)","v":"7."},{"$f":"HLOOKUP(M66,Hilfstabelle!$H$20:$Q$21,2,0)","v":"1."},{"$f":"HLOOKUP(N66,Hilfstabelle!$H$20:$Q$21,2,0)","v":"2."},null,null,null,{"$f":"HLOOKUP(R66,Hilfstabelle!$H$20:$Q$21,2,0)","v":"3."},{"$f":"HLOOKUP(S66,Hilfstabelle!$H$20:$Q$21,2,0)","v":"5."}]
[null,null,null,null,1,null,608,589,624,494,501,569,690]
[null,null,null,null,2,null,637,497,567,502,524,602,590]
[null,null,null,null,"1 + 2",null,{"$f":"+G69+G68","v":1245},1086,1191,996,1025,1171,1280,{"$f":"+N69+N68","v":0},null,null,null,{"$f":"+R69+R68","v":0},{"$f":"+S69+S68","v":0}]
[null,null,null,null,3,null,730,520,614,506,584,610,629]
[null,null,null,null,"Pins\nGesamt",null,{"$f":"+G71+G70","v":1975},1606,1805,1502,1609,1781,1909,0,null,null,null,{"$f":"+R71+R70","v":0},{"$f":"+S71+S70","v":0}]
[null,null,null,null,"Punkte\nAntritt",null,{"$f":"IF(G78=\"1\",+G77+0.5,+G77)","v":7},{"$f":"IF(H78=\"1\",+H77+0.5,+H77)","v":2},5,1,3,4,6,"0",null,null,null,{"$f":"IF(R78=\"1\",+R77+0.5,+R77)","v":0.5},{"$f":"IF(S78=\"1\",+S77+0.5,+S77)","v":0.5}]
[null,null,null,null,"Punkte\nA L T",null,{"$f":"+G48","v":14},{"$f":"+H48","v":9},{"$f":"+I48","v":7},6,6,12,2," ",null,null,null,{"$f":"+R48","v":" "},{"$f":"+S48","v":" "}]
[null,null,null,null,"Punkte\nN E U",null,{"$f":"IF(G68>0,+G74+G73,\" \")","v":21},11,12,7,9,16,8," ",null,null,null,{"$f":"IF(R68>0,+R74+R73,\" \")","v":" "},{"$f":"IF(S68>0,+S74+S73,\" \")","v":" "}]
[null,null,null,null,null,null,null,null,null,null,null,null,null,null,null,null,null,{"$f":"IF(R70>0,RANK(R74,$G$47:$S$47,10),\"0\")","v":"0"},{"$f":"IF(S70>0,RANK(S74,$G$47:$S$47,10),\"0\")","v":"0"}]
[null,null,null,null,null,null,{"$f":"IF(G68>0,RANK(G72,$G$72:$M$72,7),\"0\")","v":7},{"$f":"IF(H68>0,RANK(H72,$G$72:$M$72,7),\"0\")","v":2},5,1,3,4,6,{"$f":"IF(N68>0,RANK(N72,$G$72:$M$72,8),\"0\")","v":"0"},null,null,null,{"$f":"IF(R68>0,RANK(R72,$G$72:$S$72,10),\"0\")","v":"0"},{"$f":"IF(S68>0,RANK(S72,$G$72:$S$72,10),\"0\")","v":"0"}]
[null,null,null,null,null,null,{"$f":"IF(COUNTIF($G$77:$M$77,G77)>1,\"1\",\"\")","v":""},{"$f":"IF(COUNTIF($G$77:$M$77,H77)>1,\"1\",\"\")","v":""},"","","","","",{"$f":"IF(COUNTIF($G$77:$M$77,N77)>1,\"1\",\"\")","v":""},null,null,null,{"$f":"IF(COUNTIF($G$77:$S$77,R77)>1,\"1\",\"\")","v":"1"},{"$f":"IF(COUNTIF($G$77:$S$77,S77)>1,\"1\",\"\")","v":"1"}]
[null,null,null,null,null,null,{"$f":"IF(COUNTIF($F$20:$M$20,G77)>1,\"1\",\"\")","v":""},"","","","","","","",null,null,null,{"$f":"IF(COUNTIF($F$20:$M$20,R77)>1,\"1\",\"\")","v":""},{"$f":"IF(COUNTIF($F$20:$M$20,S77)>1,\"1\",\"\")","v":""}]
[null,null,null,null,"Gesamt Pins",null,{"$f":"+G72+G52","v":5801},{"$f":"+H72+H52","v":4940},5109,4667,4622,5282,4420,1300,null,null,null,{"$f":"+R72+R52","v":1812},{"$f":"+S72+S52","v":1850}]
[]
[]
[null,null,null,null,"Anhang zum Spielbericht  B O W L I N G"]
["Anhang auswählen",null,null,null,null,null,null,null,null,null,null,null,null,"Punktspielserie"]
[null,null,null,null,"alle Felder sind unbedingt auszufüllen und mit dem Original-Spielbericht einzusenden."]
[]
[null,null,null,null,"Klasse:",null,{"$f":"+Hilfstabelle!$G$5","v":"B4"},"Antritt-Nr. :",4,"Datum :",{"$f":"VLOOKUP(I87,Hilfstabelle!$I$5:$J$18,2,0)","v":"2024-10-24"},"Halle :",{"$f":"VLOOKUP(I87,Hilfstabelle!$I$5:$L$18,3,0)","v":"Othmarschen"}]
[]
[null,null,null,null,null,null,"Ausrichter BSG:",{"$f":"VLOOKUP(I87,Hilfstabelle!$I$5:$L$18,4,0)","v":"SG Stern Hamburg 1"},"Mannschaftsführer: Michael Wetzel",null,null,"Telefon: 0172/412 45 69"]
[null,null,null,null,null,null,"Bahn:","Bahn:","Bahn:","Bahn:","Bahn:","Bahn:","Bahn:","Bahn:",null,null,null,"Bahn:","Bahn:"]
[null,null,null,null,"Durch-\ngänge",null,"BSG","BSG","BSG","BSG","BSG","BSG","BSG","BSG",null,null,null,"BSG","BSG"]
["Drucken","Start",null,null,null,null,{"$f":"VLOOKUP(G93,Hilfstabelle!$L$5:$M$16,2,0)","v":"PAN 1"},{"$f":"VLOOKUP(H93,Hilfstabelle!$L$5:$M$16,2,0)","v":"DAT 2"},{"$f":"VLOOKUP(I93,Hilfstabelle!$L$5:$M$16,2,0)","v":"STI 3"},{"$f":"VLOOKUP(J93,Hilfstabelle!$L$5:$M$16,2,0)","v":"SGS 1"},{"$f":"VLOOKUP(K93,Hilfstabelle!$L$5:$M$16,2,0)","v":"JUS 2"},{"$f":"VLOOKUP(L93,Hilfstabelle!$L$5:$M$16,2,0)","v":"P2 2"},{"$f":"VLOOKUP(M93,Hilfstabelle!$L$5:$M$16,2,0)","v":"KS 2"},{"$f":"VLOOKUP(N93,Hilfstabelle!$L$5:$M$16,2,0)","v":"PAN 1"},null,null,null,{"$f":"VLOOKUP(R93,Hilfstabelle!$L$5:$M$16,2,0)","v":"DAT 2"},{"$f":"VLOOKUP(S93,Hilfstabelle!$L$5:$M$16,2,0)","v":"STI 3"}]
[null,"Rangliste",null,null,null,null,{"$f":"+Hilfstabelle!L5","v":"Panasonic 1"},{"$f":"+Hilfstabelle!L6","v":"Dataport 2"},{"$f":"+Hilfstabelle!L7","v":"Still 3"},{"$f":"+Hilfstabelle!L8","v":"SG Stern Hamburg 1"},{"$f":"+Hilfstabelle!L9","v":"Justitzbehörde 2"},{"$f":"+Hilfstabelle!L10","v":"Postamt 2"},{"$f":"+Hilfstabelle!L11","v":"Körber Sports 2"},{"$f":"+Hilfstabelle!L12","v":"Panasonic 1"},null,null,null,{"$f":"+Hilfstabelle!L13","v":"Dataport 2"},{"$f":"+Hilfstabelle!$L14","v":"Still 3"}]
[null,null,null,null,"Platz",null,{"$f":"HLOOKUP(G93,Hilfstabelle!$H$20:$Q$21,2,0)","v":"2."},{"$f":"HLOOKUP(H93,Hilfstabelle!$H$20:$Q$21,2,0)","v":"3."},{"$f":"HLOOKUP(I93,Hilfstabelle!$H$20:$Q$21,2,0)","v":"5."},{"$f":"HLOOKUP(J93,Hilfstabelle!$H$20:$Q$21,2,0)","v":"4."},{"$f":"HLOOKUP(K93,Hilfstabelle!$H$20:$Q$21,2,0)","v":"6."},{"$f":"HLOOKUP(L93,Hilfstabelle!$H$20:$Q$21,2,0)","v":"7."},{"$f":"HLOOKUP(M93,Hilfstabelle!$H$20:$Q$21,2,0)","v":"1."},{"$f":"HLOOKUP(N93,Hilfstabelle!$H$20:$Q$21,2,0)","v":"2."},null,{"$f":"MIN(G94:M94)","v":0},null,{"$f":"HLOOKUP(R93,Hilfstabelle!$H$20:$Q$21,2,0)","v":"3."},{"$f":"HLOOKUP(S93,Hilfstabelle!$H$20:$Q$21,2,0)","v":"5."}]
[null,null,null,null,1,null,547,580,571,589,536,521,651]
[null,null,null,null,2,null,598,558,615,564,580,643,642]
[null,null,null,null,"1 + 2",null,{"$f":"+G96+G95","v":1145},1138,1186,1153,1116,1164,1293,{"$f":"+N96+N95","v":0},null,null,null,{"$f":"+R96+R95","v":0},{"$f":"+S96+S95","v":0}]
[null,null,null,null,3,null,632,595,602,561,618,495,659]
[null,null,null,null,"Pins\nGesamt",null,{"$f":"+G98+G97","v":1777},1733,1788,1714,1734,1659,1952,0,null,null,null,{"$f":"+R98+R97","v":0},{"$f":"+S98+S97","v":0}]
[null,null,null,null,"Punkte\nAntritt",null,{"$f":"IF(G105=\"1\",+G104+0.5,+G104)","v":5},{"$f":"IF(H105=\"1\",+H104+0.5,+H104)","v":3},6,2,4,1,7,"0",null,null,null,{"$f":"IF(R105=\"1\",+R104+0.5,+R104)","v":0.5},{"$f":"IF(S105=\"1\",+S104+0.5,+S104)","v":0.5}]
[null,null,null,null,"Punkte\nA L T",null,{"$f":"+G75","v":21},{"$f":"+H75","v":11},12,7,9,16,8," ",null,null,null,{"$f":"+R75","v":" "},{"$f":"+S75","v":" "}]
[null,null,null,null,"Punkte\nN E U",null,{"$f":"IF(G95>0,+G101+G100,\" \")","v":26},14,18,9,13,17,15," ",null,null,null,{"$f":"IF(R95>0,+R101+R100,\" \")","v":" "},{"$f":"IF(S95>0,+S101+S100,\" \")","v":" "}]
[]
[null,null,null,null,null,null,{"$f":"IF(G95>0,RANK(G99,$G$99:$M$99,7),\"0\")","v":5},{"$f":"IF(H95>0,RANK(H99,$G$99:$M$99,7),\"0\")","v":3},6,2,4,1,7,{"$f":"IF(N95>0,RANK(N99,$G$99:$M$99,8),\"0\")","v":"0"},null,null,null,{"$f":"IF(R95>0,RANK(R99,$G$99:$S$99,10),\"0\")","v":"0"},{"$f":"IF(S95>0,RANK(S99,$G$99:$S$99,10),\"0\")","v":"0"}]
[null,null,null,null,null,null,{"$f":"IF(COUNTIF($G$104:$M$104,G104)>1,\"1\",\"\")","v":""},{"$f":"IF(COUNTIF($G$104:$M$104,H104)>1,\"1\",\"\")","v":""},"","","","","",{"$f":"IF(COUNTIF($G$104:$M$104,N104)>1,\"1\",\"\")","v":""},null,null,null,{"$f":"IF(COUNTIF($G$104:$S$104,R104)>1,\"1\",\"\")","v":"1"},{"$f":"IF(COUNTIF($G$104:$S$104,S104)>1,\"1\",\"\")","v":"1"}]
[]
[null,null,null,null,"Gesamt Pins",null,{"$f":"+G99+G80","v":7578},{"$f":"+H99+H80","v":6673},6897,6381,6356,6941,6372,1300,null,null,null,{"$f":"+R99+R80","v":1812},{"$f":"+S99+S80","v":1850}]
[]
[]
[null,null,null,null,"Anhang zum Spielbericht  B O W L I N G"]
["Anhang auswählen",null,null,null,null,null,null,null,null,null,null,null,null,"Punktspielserie"]
[null,null,null,null,"alle Felder sind unbedingt auszufüllen und mit dem Original-Spielbericht einzusenden."]
[]
[null,null,null,null,"Klasse:",null,{"$f":"+Hilfstabelle!$G$5","v":"B4"},"Antritt-Nr. :",5,"Datum :",{"$f":"VLOOKUP(I114,Hilfstabelle!$I$5:$J$18,2,0)","v":"2024-11-07"},"Halle :",{"$f":"VLOOKUP(I114,Hilfstabelle!$I$5:$L$18,3,0)","v":"Wandsbek"}]
[]
[null,null,null,null,null,null,"Ausrichter BSG:",{"$f":"VLOOKUP(I114,Hilfstabelle!$I$5:$L$18,4,0)","v":"Justitzbehörde 2"},"Mannschaftsführer: Michael Wetzel",null,null,"Telefon: 0172/412 45 69"]
[null,null,null,null,null,null,"Bahn:","Bahn:","Bahn:","Bahn:","Bahn:","Bahn:","Bahn:","Bahn:",null,null,null,"Bahn:","Bahn:"]
[null,null,null,null,"Durch-\ngänge",null,"BSG","BSG","BSG","BSG","BSG","BSG","BSG","BSG",null,null,null,"BSG","BSG"]
["Drucken","Start",null,null,null,null,{"$f":"VLOOKUP(G120,Hilfstabelle!$L$5:$M$16,2,0)","v":"PAN 1"},{"$f":"VLOOKUP(H120,Hilfstabelle!$L$5:$M$16,2,0)","v":"DAT 2"},{"$f":"VLOOKUP(I120,Hilfstabelle!$L$5:$M$16,2,0)","v":"STI 3"},{"$f":"VLOOKUP(J120,Hilfstabelle!$L$5:$M$16,2,0)","v":"SGS 1"},{"$f":"VLOOKUP(K120,Hilfstabelle!$L$5:$M$16,2,0)","v":"JUS 2"},{"$f":"VLOOKUP(L120,Hilfstabelle!$L$5:$M$16,2,0)","v":"P2 2"},{"$f":"VLOOKUP(M120,Hilfstabelle!$L$5:$M$16,2,0)","v":"KS 2"},{"$f":"VLOOKUP(N120,Hilfstabelle!$L$5:$M$16,2,0)","v":"PAN 1"},null,null,null,{"$f":"VLOOKUP(R120,Hilfstabelle!$L$5:$M$16,2,0)","v":"DAT 2"},{"$f":"VLOOKUP(S120,Hilfstabelle!$L$5:$M$16,2,0)","v":"STI 3"}]
[null,"Rangliste",null,null,null,null,{"$f":"+Hilfstabelle!L5","v":"Panasonic 1"},{"$f":"+Hilfstabelle!L6","v":"Dataport 2"},{"$f":"+Hilfstabelle!L7","v":"Still 3"},{"$f":"+Hilfstabelle!L8","v":"SG Stern Hamburg 1"},{"$f":"+Hilfstabelle!L9","v":"Justitzbehörde 2"},{"$f":"+Hilfstabelle!L10","v":"Postamt 2"},{"$f":"+Hilfstabelle!L11","v":"Körber Sports 2"},{"$f":"+Hilfstabelle!L12","v":"Panasonic 1"},null,null,null,{"$f":"+Hilfstabelle!L13","v":"Dataport 2"},{"$f":"+Hilfstabelle!$L14","v":"Still 3"}]
[null,null,null,null,"Platz",null,{"$f":"HLOOKUP(G120,Hilfstabelle!$H$20:$Q$21,2,0)","v":"2."},{"$f":"HLOOKUP(H120,Hilfstabelle!$H$20:$Q$21,2,0)","v":"3."},{"$f":"HLOOKUP(I120,Hilfstabelle!$H$20:$Q$21,2,0)","v":"5."},{"$f":"HLOOKUP(J120,Hilfstabelle!$H$20:$Q$21,2,0)","v":"4."},{"$f":"HLOOKUP(K120,Hilfstabelle!$H$20:$Q$21,2,0)","v":"6."},{"$f":"HLOOKUP(L120,Hilfstabelle!$H$20:$Q$21,2,0)","v":"7."},{"$f":"HLOOKUP(M120,Hilfstabelle!$H$20:$Q$21,2,0)","v":"1."},{"$f":"HLOOKUP(N120,Hilfstabelle!$H$20:$Q$21,2,0)","v":"2."},null,null,null,{"$f":"HLOOKUP(R120,Hilfstabelle!$H$20:$Q$21,2,0)","v":"3."},{"$f":"HLOOKUP(S120,Hilfstabelle!$H$20:$Q$21,2,0)","v":"5."}]
[null,null,null,null,1,null,688,610,583,654,529,527,591]
[null,null,null,null,2,null,579,606,623,605,649,592,665]
[null,null,null,null,"1 + 2",null,{"$f":"+G123+G122","v":1267},1216,1206,1259,1178,1119,1256,{"$f":"+N123+N122","v":0},null,null,null,{"$f":"+R123+R122","v":0},{"$f":"+S123+S122","v":0}]
[null,null,null,null,3,null,640,633,600,638,633,640,658]
[null,null,null,null,"Pins\nGesamt",null,{"$f":"+G125+G124","v":1907},1849,1806,1897,1811,1759,1914,0,null,null,null,{"$f":"+R125+R124","v":0},{"$f":"+S125+S124","v":0}]
[null,null,null,null,"Punkte\nAntritt",null,{"$f":"IF(G132=\"1\",+G131+0.5,+G131)","v":6},{"$f":"IF(H132=\"1\",+H131+0.5,+H131)","v":4},2,5,3,1,7,"0",null,null,null,{"$f":"IF(R132=\"1\",+R131+0.5,+R131)","v":0.5},{"$f":"IF(S132=\"1\",+S131+0.5,+S131)","v":0.5}]
[null,null,null,null,"Punkte\nA L T",null,{"$f":"+G102","v":26},{"$f":"+H102","v":14},18,{"$f":"+J102","v":9},13,17,15," ",null,null,null,{"$f":"+R102","v":" "},{"$f":"+S102","v":" "}]
[null,null,null,null,"Punkte\nN E U",null,{"$f":"IF(G122>0,+G128+G127,\" \")","v":32},18,20,14,16,18,22," ",null,null,null,{"$f":"IF(R122>0,+R128+R127,\" \")","v":" "},{"$f":"IF(S122>0,+S128+S127,\" \")","v":" "}]
[]
[null,null,null,null,null,null,{"$f":"IF(G122>0,RANK(G126,$G$126:$M$126,7),\"0\")","v":6},{"$f":"IF(H122>0,RANK(H126,$G$126:$M$126,7),\"0\")","v":4},2,5,3,1,7,{"$f":"IF(N122>0,RANK(N126,$G$126:$M$126,8),\"0\")","v":"0"},null,null,null,{"$f":"IF(R122>0,RANK(R126,$G$126:$S$126,10),\"0\")","v":"0"},{"$f":"IF(S122>0,RANK(S126,$G$126:$S$126,10),\"0\")","v":"0"}]
[null,null,null,null,null,null,{"$f":"IF(COUNTIF($G$131:$M$131,G131)>1,\"1\",\"\")","v":""},{"$f":"IF(COUNTIF($G$131:$M$131,H131)>1,\"1\",\"\")","v":""},"","","","","",{"$f":"IF(COUNTIF($G$131:$M$131,N131)>1,\"1\",\"\")","v":""},null,null,null,{"$f":"IF(COUNTIF($G$131:$S$131,R131)>1,\"1\",\"\")","v":"1"},{"$f":"IF(COUNTIF($G$131:$S$131,S131)>1,\"1\",\"\")","v":"1"}]
[]
[null,null,null,null,"Gesamt Pins",null,{"$f":"+G126+G107","v":9485},{"$f":"+H126+H107","v":8522},8703,8278,8167,8700,8286,1300,null,null,null,{"$f":"+R126+R107","v":1812},{"$f":"+S126+S107","v":1850}]
[]
[]
[null,null,null,null,"Anhang zum Spielbericht  B O W L I N G"]
["Anhang auswählen",null,null,null,null,null,null,null,null,null,null,null,null,"Punktspielserie"]
[null,null,null,null,"alle Felder sind unbedingt auszufüllen und mit dem Original-Spielbericht einzusenden."]
[]
[null,null,null,null,"Klasse:",null,{"$f":"+Hilfstabelle!$G$5","v":"B4"},"Antritt-Nr. :",6,"Datum :",{"$f":"VLOOKUP(I141,Hilfstabelle!$I$5:$J$18,2,0)","v":"2025-01-16"},"Halle :",{"$f":"VLOOKUP(I141,Hilfstabelle!$I$5:$L$18,3,0)","v":"Wandsbek"}]
[]
[null,null,null,null,null,null,"Ausrichter BSG:",{"$f":"VLOOKUP(I141,Hilfstabelle!$I$5:$L$18,4,0)","v":"Postamt 2"},"Mannschaftsführer: Michael Wetzel",null,null,"Telefon: 0172/412 45 69"]
[null,null,null,null,null,null,"Bahn:","Bahn:","Bahn:","Bahn:","Bahn:","Bahn:","Bahn:","Bahn:",null,null,null,"Bahn:","Bahn:"]
[null,null,null,null,"Durch-\ngänge",null,"BSG","BSG","BSG","BSG","BSG","BSG","BSG","BSG",null,null,null,"BSG","BSG"]
["Drucken","Start",null,null,null,null,{"$f":"VLOOKUP(G147,Hilfstabelle!$L$5:$M$16,2,0)","v":"PAN 1"},{"$f":"VLOOKUP(H147,Hilfstabelle!$L$5:$M$16,2,0)","v":"DAT 2"},{"$f":"VLOOKUP(I147,Hilfstabelle!$L$5:$M$16,2,0)","v":"STI 3"},{"$f":"VLOOKUP(J147,Hilfstabelle!$L$5:$M$16,2,0)","v":"SGS 1"},{"$f":"VLOOKUP(K147,Hilfstabelle!$L$5:$M$16,2,0)","v":"JUS 2"},{"$f":"VLOOKUP(L147,Hilfstabelle!$L$5:$M$16,2,0)","v":"P2 2"},{"$f":"VLOOKUP(M147,Hilfstabelle!$L$5:$M$16,2,0)","v":"KS 2"},{"$f":"VLOOKUP(N147,Hilfstabelle!$L$5:$M$16,2,0)","v":"PAN 1"},null,null,null,{"$f":"VLOOKUP(R147,Hilfstabelle!$L$5:$M$16,2,0)","v":"DAT 2"},{"$f":"VLOOKUP(S147,Hilfstabelle!$L$5:$M$16,2,0)","v":"STI 3"}]
[null,"Rangliste",null,null,null,null,{"$f":"+Hilfstabelle!L5","v":"Panasonic 1"},{"$f":"+Hilfstabelle!L6","v":"Dataport 2"},{"$f":"+Hilfstabelle!L7","v":"Still 3"},{"$f":"+Hilfstabelle!L8","v":"SG Stern Hamburg 1"},{"$f":"+Hilfstabelle!L9","v":"Justitzbehörde 2"},{"$f":"+Hilfstabelle!L10","v":"Postamt 2"},{"$f":"+Hilfstabelle!L11","v":"Körber Sports 2"},{"$f":"+Hilfstabelle!L12","v":"Panasonic 1"},null,null,null,{"$f":"+Hilfstabelle!L13","v":"Dataport 2"},{"$f":"+Hilfstabelle!$L14","v":"Still 3"}]
[null,null,null,null,"Platz",null,{"$f":"HLOOKUP(G147,Hilfstabelle!$H$20:$Q$21,2,0)","v":"2."},{"$f":"HLOOKUP(H147,Hilfstabelle!$H$20:$Q$21,2,0)","v":"3."},{"$f":"HLOOKUP(I147,Hilfstabelle!$H$20:$Q$21,2,0)","v":"5."},{"$f":"HLOOKUP(J147,Hilfstabelle!$H$20:$Q$21,2,0)","v":"4."},{"$f":"HLOOKUP(K147,Hilfstabelle!$H$20:$Q$21,2,0)","v":"6."},{"$f":"HLOOKUP(L147,Hilfstabelle!$H$20:$Q$21,2,0)","v":"7."},{"$f":"HLOOKUP(M147,Hilfstabelle!$H$20:$Q$21,2,0)","v":"1."},{"$f":"HLOOKUP(N147,Hilfstabelle!$H$20:$Q$21,2,0)","v":"2."},null,null,null,{"$f":"HLOOKUP(R147,Hilfstabelle!$H$20:$Q$21,2,0)","v":"3."},{"$f":"HLOOKUP(S147,Hilfstabelle!$H$20:$Q$21,2,0)","v":"5."}]
[null,null,null,null,1,null,616,626,601,702,585,538,453]
[null,null,null,null,2,null,624,689,661,598,625,610,487]
[null,null,null,null,"1 + 2",null,{"$f":"+G150+G149","v":1240},1315,1262,1300,1210,1148,940,{"$f":"+N150+N149","v":0},null,null,null,{"$f":"+R150+R149","v":0},{"$f":"+S150+S149","v":0}]
[null,null,null,null,3,null,640,653,591,711,751,544,505]
[null,null,null,null,"Pins\nGesamt",null,{"$f":"+G152+G151","v":1880},1968,1853,2011,1961,1692,1445,0,null,null,null,{"$f":"+R152+R151","v":0},{"$f":"+S152+S151","v":0}]
[null,null,null,null,"Punkte\nAntritt",null,{"$f":"IF(G159=\"1\",+G158+0.5,+G158)","v":4},{"$f":"IF(H159=\"1\",+H158+0.5,+H158)","v":6},3,7,5,2,1,"0",null,null,null,{"$f":"IF(R159=\"1\",+R158+0.5,+R158)","v":0.5},{"$f":"IF(S159=\"1\",+S158+0.5,+S158)","v":0.5}]
[null,null,null,null,"Punkte\nA L T",null,{"$f":"+G129","v":32},{"$f":"+H129","v":18},20,14,16,18,22," ",null,null,null,{"$f":"+R129","v":" "},{"$f":"+S129","v":" "}]
[null,null,null,null,"Punkte\nN E U",null,{"$f":"IF(G149>0,+G155+G154,\" \")","v":36},24,23,21,21,20,23," ",null,null,null,{"$f":"IF(R149>0,+R155+R154,\" \")","v":" "},{"$f":"IF(S149>0,+S155+S154,\" \")","v":" "}]
[]
[null,null,null,null,null,null,{"$f":"IF(G149>0,RANK(G153,$G$153:$M$153,7),\"0\")","v":4},{"$f":"IF(H149>0,RANK(H153,$G$153:$M$153,7),\"0\")","v":6},3,7,5,2,1,{"$f":"IF(N149>0,RANK(N153,$G$153:$M$153,8),\"0\")","v":"0"},null,null,null,{"$f":"IF(R149>0,RANK(R153,$G$153:$S$153,10),\"0\")","v":"0"},{"$f":"IF(S149>0,RANK(S153,$G$153:$S$153,10),\"0\")","v":"0"}]
[null,null,null,null,null,null,{"$f":"IF(COUNTIF($G$158:$M$158,G158)>1,\"1\",\"\")","v":""},{"$f":"IF(COUNTIF($G$158:$M$158,H158)>1,\"1\",\"\")","v":""},"","","","","",{"$f":"IF(COUNTIF($G$158:$M$158,N158)>1,\"1\",\"\")","v":""},null,null,null,{"$f":"IF(COUNTIF($G$158:$S$158,R158)>1,\"1\",\"\")","v":"1"},{"$f":"IF(COUNTIF($G$158:$S$158,S158)>1,\"1\",\"\")","v":"1"}]
[null,null,null,null,"Gesamt Pins",null,{"$f":"+G153+G134","v":11365},{"$f":"+H153+H134","v":10490},10556,10289,10128,10392,9731,1300,null,null,null,{"$f":"+R153+R134","v":1812},{"$f":"+S153+S134","v":1850}]
[]
[]
[]
[null,null,null,null,"Anhang zum Spielbericht  B O W L I N G"]
["Anhang auswählen",null,null,null,null,null,null,null,null,null,null,null,null,"Punktspielserie"]
[null,null,null,null,"alle Felder sind unbedingt auszufüllen und mit dem Original-Spielbericht einzusenden."]
[]
[null,null,null,null,"Klasse:",null,{"$f":"+Hilfstabelle!$G$5","v":"B4"},"Antritt-Nr. :",7,"Datum :",{"$f":"VLOOKUP(I168,Hilfstabelle!$I$5:$J$18,2,0)","v":"2025-01-30"},"Halle :",{"$f":"VLOOKUP(I168,Hilfstabelle!$I$5:$L$18,3,0)","v":"Othmarschen"}]
[]
[null,null,null,null,null,null,"Ausrichter BSG:",{"$f":"VLOOKUP(I168,Hilfstabelle!$I$5:$L$18,4,0)","v":"Körber Sports 2"},"Mannschaftsführer: Michael Wetzel",null,null,"Telefon: 0172/412 45 69"]
[null,null,null,null,null,null,"Bahn:","Bahn:","Bahn:","Bahn:","Bahn:","Bahn:","Bahn:","Bahn:",null,null,null,"Bahn:","Bahn:"]
[null,null,null,null,"Durch-\ngänge",null,"BSG","BSG","BSG","BSG","BSG","BSG","BSG","BSG",null,null,null,"BSG","BSG"]
["Drucken","Start",null,null,null,null,{"$f":"VLOOKUP(G174,Hilfstabelle!$L$5:$M$16,2,0)","v":"PAN 1"},{"$f":"VLOOKUP(H174,Hilfstabelle!$L$5:$M$16,2,0)","v":"DAT 2"},{"$f":"VLOOKUP(I174,Hilfstabelle!$L$5:$M$16,2,0)","v":"STI 3"},{"$f":"VLOOKUP(J174,Hilfstabelle!$L$5:$M$16,2,0)","v":"SGS 1"},{"$f":"VLOOKUP(K174,Hilfstabelle!$L$5:$M$16,2,0)","v":"JUS 2"},{"$f":"VLOOKUP(L174,Hilfstabelle!$L$5:$M$16,2,0)","v":"P2 2"},{"$f":"VLOOKUP(M174,Hilfstabelle!$L$5:$M$16,2,0)","v":"KS 2"},{"$f":"VLOOKUP(N174,Hilfstabelle!$L$5:$M$16,2,0)","v":"PAN 1"},null,null,null,{"$f":"VLOOKUP(R174,Hilfstabelle!$L$5:$M$16,2,0)","v":"DAT 2"},{"$f":"VLOOKUP(S174,Hilfstabelle!$L$5:$M$16,2,0)","v":"STI 3"}]
[null,"Rangliste",null,null,null,null,{"$f":"+Hilfstabelle!L5","v":"Panasonic 1"},{"$f":"+Hilfstabelle!L6","v":"Dataport 2"},{"$f":"+Hilfstabelle!L7","v":"Still 3"},{"$f":"+Hilfstabelle!L8","v":"SG Stern Hamburg 1"},{"$f":"+Hilfstabelle!L9","v":"Justitzbehörde 2"},{"$f":"+Hilfstabelle!L10","v":"Postamt 2"},{"$f":"+Hilfstabelle!L11","v":"Körber Sports 2"},{"$f":"+Hilfstabelle!L12","v":"Panasonic 1"},null,null,null,{"$f":"+Hilfstabelle!L13","v":"Dataport 2"},{"$f":"+Hilfstabelle!$L14","v":"Still 3"}]
[null,null,null,null,"Platz",null,{"$f":"HLOOKUP(G174,Hilfstabelle!$H$20:$Q$21,2,0)","v":"2."},{"$f":"HLOOKUP(H174,Hilfstabelle!$H$20:$Q$21,2,0)","v":"3."},{"$f":"HLOOKUP(I174,Hilfstabelle!$H$20:$Q$21,2,0)","v":"5."},{"$f":"HLOOKUP(J174,Hilfstabelle!$H$20:$Q$21,2,0)","v":"4."},{"$f":"HLOOKUP(K174,Hilfstabelle!$H$20:$Q$21,2,0)","v":"6."},{"$f":"HLOOKUP(L174,Hilfstabelle!$H$20:$Q$21,2,0)","v":"7."},{"$f":"HLOOKUP(M174,Hilfstabelle!$H$20:$Q$21,2,0)","v":"1."},{"$f":"HLOOKUP(N174,Hilfstabelle!$H$20:$Q$21,2,0)","v":"2."},null,null,null,{"$f":"HLOOKUP(R174,Hilfstabelle!$H$20:$Q$21,2,0)","v":"3."},{"$f":"HLOOKUP(S174,Hilfstabelle!$H$20:$Q$21,2,0)","v":"5."}]
[null,null,null,null,1,null,545,587,614,693,610,557,568]
[null,null,null,null,2,null,585,593,606,571,576,578,612]
[null,null,null,null,"1 + 2",null,{"$f":"+G177+G176","v":1130},1180,1220,1264,1186,1135,1180,{"$f":"+N177+N176","v":0},null,null,null,{"$f":"+R177+R176","v":0},{"$f":"+S177+S176","v":0}]
[null,null,null,null,3,null,556,642,504,566,568,614,597]
[null,null,null,null,"Pins\nGesamt",null,{"$f":"+G179+G178","v":1686},1822,1724,1830,1754,1749,1777,0,null,null,null,{"$f":"+R179+R178","v":0},{"$f":"+S179+S178","v":0}]
[null,null,null,null,"Punkte\nAntritt",null,{"$f":"IF(G186=\"1\",+G185+0.5,+G185)","v":1},{"$f":"IF(H186=\"1\",+H185+0.5,+H185)","v":6},2,7,4,3,5,"0",null,null,null,{"$f":"IF(R186=\"1\",+R185+0.5,+R185)","v":0.5},{"$f":"IF(S186=\"1\",+S185+0.5,+S185)","v":0.5}]
[null,null,null,null,"Punkte\nA L T",null,{"$f":"+G156","v":36},{"$f":"+H156","v":24},23,21,21,20,23," ",null,null,null,{"$f":"+R156","v":" "},{"$f":"+S156","v":" "}]
[null,null,null,null,"Punkte\nN E U",null,{"$f":"IF(G176>0,+G182+G181,\" \")","v":37},30,25,28,25,23,28," ",null,null,null,{"$f":"IF(R176>0,+R182+R181,\" \")","v":" "},{"$f":"IF(S176>0,+S182+S181,\" \")","v":" "}]
[]
[null,null,null,null,null,null,{"$f":"IF(G176>0,RANK(G180,$G$180:$M$180,7),\"0\")","v":1},{"$f":"IF(H176>0,RANK(H180,$G$180:$M$180,7),\"0\")","v":6},2,7,4,3,5,{"$f":"IF(N176>0,RANK(N180,$G$180:$M$180,8),\"0\")","v":"0"},null,null,null,{"$f":"IF(R176>0,RANK(R180,$G$180:$S$180,10),\"0\")","v":"0"},{"$f":"IF(S176>0,RANK(S180,$G$180:$S$180,10),\"0\")","v":"0"}]
[null,null,null,null,null,null,{"$f":"IF(COUNTIF($G$185:$M$185,G185)>1,\"1\",\"\")","v":""},{"$f":"IF(COUNTIF($G$185:$M$185,H185)>1,\"1\",\"\")","v":""},"","","","","",{"$f":"IF(COUNTIF($G$185:$M$185,N185)>1,\"1\",\"\")","v":""},null,null,null,{"$f":"IF(COUNTIF($G$185:$S$185,R185)>1,\"1\",\"\")","v":"1"},{"$f":"IF(COUNTIF($G$185:$S$185,S185)>1,\"1\",\"\")","v":"1"}]
[null,null,null,null,"Gesamt Pins",null,{"$f":"+G180+G160","v":13051},{"$f":"+H180+H160","v":12312},12280,12119,11882,12141,11508,1300,null,null,null,{"$f":"+R180+R160","v":1812},{"$f":"+S180+S160","v":1850}]
[]
[]
[]
[null,null,null,null,"Anhang zum Spielbericht  B O W L I N G"]
["Anhang auswählen",null,null,null,null,null,null,null,null,null,null,null,null,"Punktspielserie"]
[null,null,null,null,"alle Felder sind unbedingt auszufüllen und mit dem Original-Spielbericht einzusenden."]
[]
[null,null,null,null,"Klasse:",null,{"$f":"+Hilfstabelle!$G$5","v":"B4"},"Antritt-Nr. :",8,"Datum :",{"$f":"VLOOKUP(I195,Hilfstabelle!$I$5:$J$18,2,0)","v":"2025-02-13"},"Halle :",{"$f":"VLOOKUP(I195,Hilfstabelle!$I$5:$L$18,3,0)","v":"Wandsbek"}]
[]
[null,null,null,null,null,null,"Ausrichter BSG:",{"$f":"VLOOKUP(I195,Hilfstabelle!$I$5:$L$18,4,0)","v":"Panasonic 1"},"Mannschaftsführer: Michael Wetzel",null,null,"Telefon: 0172/412 45 69"]
[null,null,null,null,null,null,"Bahn:","Bahn:","Bahn:","Bahn:","Bahn:","Bahn:","Bahn:","Bahn:",null,null,null,"Bahn:","Bahn:"]
["Drucken","Start",null,null,"Durch-\ngänge",null,"BSG","BSG","BSG","BSG","BSG","BSG","BSG","BSG",null,null,null,"BSG","BSG"]
[null,"Rangliste",null,null,null,null,{"$f":"VLOOKUP(G201,Hilfstabelle!$L$5:$M$16,2,0)","v":"PAN 1"},{"$f":"VLOOKUP(H201,Hilfstabelle!$L$5:$M$16,2,0)","v":"DAT 2"},{"$f":"VLOOKUP(I201,Hilfstabelle!$L$5:$M$16,2,0)","v":"STI 3"},{"$f":"VLOOKUP(J201,Hilfstabelle!$L$5:$M$16,2,0)","v":"SGS 1"},{"$f":"VLOOKUP(K201,Hilfstabelle!$L$5:$M$16,2,0)","v":"JUS 2"},{"$f":"VLOOKUP(L201,Hilfstabelle!$L$5:$M$16,2,0)","v":"P2 2"},{"$f":"VLOOKUP(M201,Hilfstabelle!$L$5:$M$16,2,0)","v":"KS 2"},{"$f":"VLOOKUP(N201,Hilfstabelle!$L$5:$M$16,2,0)","v":"PAN 1"},null,null,null,{"$f":"VLOOKUP(R201,Hilfstabelle!$L$5:$M$16,2,0)","v":"DAT 2"},{"$f":"VLOOKUP(S201,Hilfstabelle!$L$5:$M$16,2,0)","v":"STI 3"}]
[null,null,null,null,null,null,{"$f":"+Hilfstabelle!L5","v":"Panasonic 1"},{"$f":"+Hilfstabelle!L6","v":"Dataport 2"},{"$f":"+Hilfstabelle!L7","v":"Still 3"},{"$f":"+Hilfstabelle!L8","v":"SG Stern Hamburg 1"},{"$f":"+Hilfstabelle!L9","v":"Justitzbehörde 2"},{"$f":"+Hilfstabelle!L10","v":"Postamt 2"},{"$f":"+Hilfstabelle!L11","v":"Körber Sports 2"},{"$f":"+Hilfstabelle!L12","v":"Panasonic 1"},null,null,null,{"$f":"+Hilfstabelle!L13","v":"Dataport 2"},{"$f":"+Hilfstabelle!$L14","v":"Still 3"}]
[null,null,null,null,"Platz",null,{"$f":"HLOOKUP(G201,Hilfstabelle!$H$20:$Q$21,2,0)","v":"2."},{"$f":"HLOOKUP(H201,Hilfstabelle!$H$20:$Q$21,2,0)","v":"3."},{"$f":"HLOOKUP(I201,Hilfstabelle!$H$20:$Q$21,2,0)","v":"5."},{"$f":"HLOOKUP(J201,Hilfstabelle!$H$20:$Q$21,2,0)","v":"4."},{"$f":"HLOOKUP(K201,Hilfstabelle!$H$20:$Q$21,2,0)","v":"6."},{"$f":"HLOOKUP(L201,Hilfstabelle!$H$20:$Q$21,2,0)","v":"7."},{"$f":"HLOOKUP(M201,Hilfstabelle!$H$20:$Q$21,2,0)","v":"1."},{"$f":"HLOOKUP(N201,Hilfstabelle!$H$20:$Q$21,2,0)","v":"2."},null,null,null,{"$f":"HLOOKUP(R201,Hilfstabelle!$H$20:$Q$21,2,0)","v":"3."},{"$f":"HLOOKUP(S201,Hilfstabelle!$H$20:$Q$21,2,0)","v":"5."}]
[null,null,null,null,1,null,611,671,516,597,691,629,720]
[null,null,null,null,2,null,601,646,632,617,609,574,716]
[null,null,null,null,"1 + 2",null,{"$f":"+G204+G203","v":1212},1317,1148,1214,1300,1203,1436,{"$f":"+N204+N203","v":0},null,null,null,{"$f":"+R204+R203","v":0},{"$f":"+S204+S203","v":0}]
[null,null,null,null,3,null,605,623,630,608,658,621,713]
[null,null,null,null,"Pins\nGesamt",null,{"$f":"+G206+G205","v":1817},1940,1778,1822,1958,1824,2149,0,null,null,null,{"$f":"+R206+R205","v":0},{"$f":"+S206+S205","v":0}]
[null,null,null,null,"Punkte\nAntritt",null,{"$f":"IF(G213=\"1\",+G212+0.5,+G212)","v":2},{"$f":"IF(H213=\"1\",+H212+0.5,+H212)","v":5},1,3,6,4,7,"0",null,null,null,{"$f":"IF(R213=\"1\",+R212+0.5,+R212)","v":0.5},{"$f":"IF(S213=\"1\",+S212+0.5,+S212)","v":0.5}]
[null,null,null,null,"Punkte\nA L T",null,{"$f":"+G183","v":37},{"$f":"+H183","v":30},25,28,25,23,28,{"$f":"+'Anhang zum Spielbericht'!N183","v":" "},null,null,null,{"$f":"+'Anhang zum Spielbericht'!R183","v":" "},{"$f":"+'Anhang zum Spielbericht'!S183","v":" "}]
[null,null,null,null,"Punkte\nN E U",null,{"$f":"IF(G203>0,+G209+G208,\" \")","v":39},35,26,31,31,27,35," ",null,null,null,{"$f":"IF(R203>0,+R209+R208,\" \")","v":" "},{"$f":"IF(S203>0,+S209+S208,\" \")","v":" "}]
[]
[null,null,null,null,null,null,{"$f":"IF(G203>0,RANK(G207,$G$207:$M$207,7),\"0\")","v":2},{"$f":"IF(H203>0,RANK(H207,$G$207:$M$207,7),\"0\")","v":5},1,3,6,4,7,{"$f":"IF(N203>0,RANK(N207,$G$207:$M$207,7),\"0\")","v":"0"},null,null,null,{"$f":"IF(R203>0,RANK(R207,$G$207:$S$207,10),\"0\")","v":"0"},{"$f":"IF(S203>0,RANK(S207,$G$207:$S$207,10),\"0\")","v":"0"}]
[null,null,null,null,null,null,{"$f":"IF(COUNTIF($G$212:$M$212,G212)>1,\"1\",\"\")","v":""},{"$f":"IF(COUNTIF($G$212:$M$212,H212)>1,\"1\",\"\")","v":""},"","","","","",{"$f":"IF(COUNTIF($G$212:$M$212,N212)>1,\"1\",\"\")","v":""},null,null,null,{"$f":"IF(COUNTIF($G$212:$S$212,R212)>1,\"1\",\"\")","v":"1"},{"$f":"IF(COUNTIF($G$212:$S$212,S212)>1,\"1\",\"\")","v":"1"}]
[null,null,null,null,"Gesamt Pins",null,{"$f":"+G207+G187","v":14868},{"$f":"+H207+H187","v":14252},14058,13941,13840,13965,13657,1300,null,null,null,{"$f":"+R207+R187","v":1812},{"$f":"+S207+S187","v":1850}]
[]
[]
[]
[null,null,null,null,"Anhang zum Spielbericht  B O W L I N G"]
["Anhang auswählen",null,null,null,null,null,null,null,null,null,null,null,null,"Punktspielserie"]
[null,null,null,null,"alle Felder sind unbedingt auszufüllen und mit dem Original-Spielbericht einzusenden."]
[]
[null,null,null,null,"Klasse:",null,{"$f":"+Hilfstabelle!$G$5","v":"B4"},"Antritt-Nr. :",9,"Datum :",{"$f":"VLOOKUP(I222,Hilfstabelle!$I$5:$J$18,2,0)","v":"2025-02-27"},"Halle :",{"$f":"VLOOKUP(I222,Hilfstabelle!$I$5:$L$18,3,0)","v":"Othmarschen"}]
[]
[null,null,null,null,null,null,"Ausrichter BSG:",{"$f":"VLOOKUP(I222,Hilfstabelle!$I$5:$L$18,4,0)","v":"Dataport 2"},"Mannschaftsführer: Michael Wetzel",null,null,"Telefon: 0172/412 45 69"]
[null,null,null,null,null,null,"Bahn:","Bahn:","Bahn:","Bahn:","Bahn:","Bahn:","Bahn:","Bahn:",null,null,null,"Bahn:","Bahn:"]
["Drucken","Start",null,null,"Durch-\ngänge",null,"BSG","BSG","BSG","BSG","BSG","BSG","BSG","BSG",null,null,null,"BSG","BSG"]
[null,"Rangliste",null,null,null,null,{"$f":"VLOOKUP(G228,Hilfstabelle!$L$5:$M$16,2,0)","v":"PAN 1"},{"$f":"VLOOKUP(H228,Hilfstabelle!$L$5:$M$16,2,0)","v":"DAT 2"},{"$f":"VLOOKUP(I228,Hilfstabelle!$L$5:$M$16,2,0)","v":"STI 3"},{"$f":"VLOOKUP(J228,Hilfstabelle!$L$5:$M$16,2,0)","v":"SGS 1"},{"$f":"VLOOKUP(K228,Hilfstabelle!$L$5:$M$16,2,0)","v":"JUS 2"},{"$f":"VLOOKUP(L228,Hilfstabelle!$L$5:$M$16,2,0)","v":"P2 2"},{"$f":"VLOOKUP(M228,Hilfstabelle!$L$5:$M$16,2,0)","v":"KS 2"},{"$f":"VLOOKUP(N228,Hilfstabelle!$L$5:$M$16,2,0)","v":"PAN 1"},null,null,null,{"$f":"VLOOKUP(R228,Hilfstabelle!$L$5:$M$16,2,0)","v":"DAT 2"},{"$f":"VLOOKUP(S228,Hilfstabelle!$L$5:$M$16,2,0)","v":"STI 3"}]
[null,null,null,null,null,null,{"$f":"+Hilfstabelle!L5","v":"Panasonic 1"},{"$f":"+Hilfstabelle!L6","v":"Dataport 2"},{"$f":"+Hilfstabelle!L7","v":"Still 3"},{"$f":"+Hilfstabelle!L8","v":"SG Stern Hamburg 1"},{"$f":"+Hilfstabelle!L9","v":"Justitzbehörde 2"},{"$f":"+Hilfstabelle!L10","v":"Postamt 2"},{"$f":"+Hilfstabelle!L11","v":"Körber Sports 2"},{"$f":"+Hilfstabelle!L12","v":"Panasonic 1"},null,null,null,{"$f":"+Hilfstabelle!L13","v":"Dataport 2"},{"$f":"+Hilfstabelle!$L14","v":"Still 3"}]
[null,null,null,null,"Platz",null,{"$f":"HLOOKUP(G228,Hilfstabelle!$H$20:$Q$21,2,0)","v":"2."},{"$f":"HLOOKUP(H228,Hilfstabelle!$H$20:$Q$21,2,0)","v":"3."},{"$f":"HLOOKUP(I228,Hilfstabelle!$H$20:$Q$21,2,0)","v":"5."},{"$f":"HLOOKUP(J228,Hilfstabelle!$H$20:$Q$21,2,0)","v":"4."},{"$f":"HLOOKUP(K228,Hilfstabelle!$H$20:$Q$21,2,0)","v":"6."},{"$f":"HLOOKUP(L228,Hilfstabelle!$H$20:$Q$21,2,0)","v":"7."},{"$f":"HLOOKUP(M228,Hilfstabelle!$H$20:$Q$21,2,0)","v":"1."},{"$f":"HLOOKUP(N228,Hilfstabelle!$H$20:$Q$21,2,0)","v":"2."},null,null,null,{"$f":"HLOOKUP(R228,Hilfstabelle!$H$20:$Q$21,2,0)","v":"3."},{"$f":"HLOOKUP(S228,Hilfstabelle!$H$20:$Q$21,2,0)","v":"5."}]
[null,null,null,null,1,null,574,617,604,512,477,593,610]
[null,null,null,null,2,null,652,602,643,602,556,590,697]
[null,null,null,null,"1 + 2",null,{"$f":"+G231+G230","v":1226},1219,1247,1114,1033,1183,1307,{"$f":"+N231+N230","v":0},null,null,null,{"$f":"+R231+R230","v":0},{"$f":"+S231+S230","v":0}]
[null,null,null,null,3,null,606,543,588,547,522,568,707]
[null,null,null,null,"Pins\nGesamt",null,{"$f":"+G233+G232","v":1832},1762,1835,1661,1555,1751,2014,0,null,null,null,{"$f":"+R233+R232","v":0},{"$f":"+S233+S232","v":0}]
[null,null,null,null,"Punkte\nAntritt",null,{"$f":"IF(G240=\"1\",+G239+0.5,+G239)","v":5},4,6,2,1,3,7,"0",null,null,null,{"$f":"IF(R240=\"1\",+R239+0.5,+R239)","v":0.5},{"$f":"IF(S240=\"1\",+S239+0.5,+S239)","v":0.5}]
[null,null,null,null,"Punkte\nA L T",null,{"$f":"+G210","v":39},{"$f":"+H210","v":35},26,31,31,27,35,{"$f":"+'Anhang zum Spielbericht'!N210","v":" "},null,null,null,{"$f":"+'Anhang zum Spielbericht'!R210","v":" "},{"$f":"+'Anhang zum Spielbericht'!S210","v":" "}]
[null,null,null,null,"Punkte\nN E U",null,{"$f":"IF(G230>0,+G236+G235,\" \")","v":44},39,32,33,32,30,42," ",null,null,null,{"$f":"IF(R230>0,+R236+R235,\" \")","v":" "},{"$f":"IF(S230>0,+S236+S235,\" \")","v":" "}]
[]
[null,null,null,null,null,null,{"$f":"IF(G230>0,RANK(G234,$G$234:$M$234,8),\"0\")","v":5},{"$f":"IF(H230>0,RANK(H234,$G$234:$M$234,8),\"0\")","v":4},6,2,1,3,7,{"$f":"IF(N230>0,RANK(N234,$G$234:$M$234,8),\"0\")","v":"0"},null,null,null,{"$f":"IF(R230>0,RANK(R234,$G$234:$S$234,10),\"0\")","v":"0"},{"$f":"IF(S230>0,RANK(S234,$G$234:$S$234,10),\"0\")","v":"0"}]
[null,null,null,null,null,null,{"$f":"IF(COUNTIF($G$239:$M$239,G239)>1,\"1\",\"\")","v":""},{"$f":"IF(COUNTIF($G$239:$M$239,H239)>1,\"1\",\"\")","v":""},"","","","","",{"$f":"IF(COUNTIF($G$239:$M$239,N239)>1,\"1\",\"\")","v":""},null,null,null,{"$f":"IF(COUNTIF($G$239:$S$239,R239)>1,\"1\",\"\")","v":"1"},{"$f":"IF(COUNTIF($G$239:$S$239,S239)>1,\"1\",\"\")","v":"1"}]
[null,null,null,null,"Gesamt Pins",null,{"$f":"+G234+G214","v":16700},{"$f":"+H234+H214","v":16014},15893,15602,15395,15716,15671,1300,null,null,null,{"$f":"+R234+R214","v":1812},{"$f":"+S234+S214","v":1850}]
[]
[]
[]
[null,null,null,null,"Anhang zum Spielbericht  B O W L I N G"]
["Anhang auswählen",null,null,null,null,null,null,null,null,null,null,null,null,"Punktspielserie"]
[null,null,null,null,"alle Felder sind unbedingt auszufüllen und mit dem Original-Spielbericht einzusenden."]
[]
[null,null,null,null,"Klasse:",null,{"$f":"+Hilfstabelle!$G$5","v":"B4"},"Antritt-Nr. :",10,"Datum :",{"$f":"VLOOKUP(I249,Hilfstabelle!$I$5:$J$18,2,0)","v":"2025-03-13"},"Halle :",{"$f":"VLOOKUP(I249,Hilfstabelle!$I$5:$L$18,3,0)","v":"Wandsbek"}]
[]
[null,null,null,null,null,null,"Ausrichter BSG:",{"$f":"VLOOKUP(I249,Hilfstabelle!$I$5:$L$18,4,0)","v":"Still 3"},"Mannschaftsführer: Michael Wetzel",null,null,"Telefon: 0172/412 45 69"]
[]
[null,null,null,null,null,null,"Bahn:","Bahn:","Bahn:","Bahn:","Bahn:","Bahn:","Bahn:"]
["Drucken","Start",null,null,"Durch-\ngänge",null,"BSG","BSG","BSG","BSG","BSG","BSG","BSG","BSG",null,null,null,"BSG","BSG"]
[null,"Rangliste",null,null,null,null,{"$f":"VLOOKUP(G256,Hilfstabelle!$L$5:$M$16,2,0)","v":"PAN 1"},{"$f":"VLOOKUP(H256,Hilfstabelle!$L$5:$M$16,2,0)","v":"DAT 2"},{"$f":"VLOOKUP(I256,Hilfstabelle!$L$5:$M$16,2,0)","v":"STI 3"},{"$f":"VLOOKUP(J256,Hilfstabelle!$L$5:$M$16,2,0)","v":"SGS 1"},{"$f":"VLOOKUP(K256,Hilfstabelle!$L$5:$M$16,2,0)","v":"JUS 2"},{"$f":"VLOOKUP(L256,Hilfstabelle!$L$5:$M$16,2,0)","v":"P2 2"},{"$f":"VLOOKUP(M256,Hilfstabelle!$L$5:$M$16,2,0)","v":"KS 2"},{"$f":"VLOOKUP(N256,Hilfstabelle!$L$5:$M$16,2,0)","v":"PAN 1"},null,null,null,{"$f":"VLOOKUP(R256,Hilfstabelle!$L$5:$M$16,2,0)","v":"DAT 2"},{"$f":"VLOOKUP(S256,Hilfstabelle!$L$5:$M$16,2,0)","v":"STI 3"}]
[null,null,null,null,null,null,{"$f":"+Hilfstabelle!L5","v":"Panasonic 1"},{"$f":"+Hilfstabelle!L6","v":"Dataport 2"},{"$f":"+Hilfstabelle!L7","v":"Still 3"},{"$f":"+Hilfstabelle!L8","v":"SG Stern Hamburg 1"},{"$f":"+Hilfstabelle!L9","v":"Justitzbehörde 2"},{"$f":"+Hilfstabelle!L10","v":"Postamt 2"},{"$f":"+Hilfstabelle!L11","v":"Körber Sports 2"},{"$f":"+Hilfstabelle!L12","v":"Panasonic 1"},null,null,null,{"$f":"+Hilfstabelle!L13","v":"Dataport 2"},{"$f":"+Hilfstabelle!$L14","v":"Still 3"}]
[null,null,null,null,"Platz",null,{"$f":"HLOOKUP(G256,Hilfstabelle!$H$20:$Q$21,2,0)","v":"2."},{"$f":"HLOOKUP(H256,Hilfstabelle!$H$20:$Q$21,2,0)","v":"3."},{"$f":"HLOOKUP(I256,Hilfstabelle!$H$20:$Q$21,2,0)","v":"5."},{"$f":"HLOOKUP(J256,Hilfstabelle!$H$20:$Q$21,2,0)","v":"4."},{"$f":"HLOOKUP(K256,Hilfstabelle!$H$20:$Q$21,2,0)","v":"6."},{"$f":"HLOOKUP(L256,Hilfstabelle!$H$20:$Q$21,2,0)","v":"7."},{"$f":"HLOOKUP(M256,Hilfstabelle!$H$20:$Q$21,2,0)","v":"1."},{"$f":"HLOOKUP(N256,Hilfstabelle!$H$20:$Q$21,2,0)","v":"2."},null,null,null,{"$f":"HLOOKUP(R256,Hilfstabelle!$H$20:$Q$21,2,0)","v":"3."},{"$f":"HLOOKUP(S256,Hilfstabelle!$H$20:$Q$21,2,0)","v":"5."}]
[null,null,null,null,1,null,654,551,595,516,626,582,630]
[null,null,null,null,2,null,730,659,568,584,580,538,693]
[null,null,null,null,"1 + 2",null,{"$f":"+G259+G258","v":1384},1210,1163,1100,1206,1120,1323,{"$f":"+N259+N258","v":0},null,null,null,{"$f":"+R259+R258","v":0},{"$f":"+S259+S258","v":0}]
[null,null,null,null,3,null,633,632,555,606,550,513,651]
[null,null,null,null,"Pins\nGesamt",null,{"$f":"+G261+G260","v":2017},1842,1718,1706,1756,1633,1974,0,null,null,null,{"$f":"+R261+R260","v":0},{"$f":"+S261+S260","v":0}]
[null,null,null,null,"Punkte\nAntritt",null,{"$f":"IF(G268=\"1\",+G267+0.5,+G267)","v":7},5,3,2,4,1,6,"0",null,null,null,{"$f":"IF(R268=\"1\",+R267+0.5,+R267)","v":0.5},{"$f":"IF(S268=\"1\",+S267+0.5,+S267)","v":0.5}]
[null,null,null,null,"Punkte\nA L T",null,{"$f":"+G237","v":44},{"$f":"+H237","v":39},32,33,32,30,42,{"$f":"+'Anhang zum Spielbericht'!N237","v":" "},null,null,null,{"$f":"+'Anhang zum Spielbericht'!R237","v":" "},{"$f":"+'Anhang zum Spielbericht'!S237","v":" "}]
[null,null,null,null,"Punkte\nN E U",null,{"$f":"IF(G258>0,+G264+G263,\" \")","v":51},44,35,35,36,31,48," ",null,null,null,{"$f":"IF(R258>0,+R264+R263,\" \")","v":" "},{"$f":"IF(S258>0,+S264+S263,\" \")","v":" "}]
[]
[null,null,null,null,null,null,{"$f":"IF(G258>0,RANK(G262,$G$262:$M$262,8),\"0\")","v":7},{"$f":"IF(H258>0,RANK(H262,$G$262:$M$262,8),\"0\")","v":5},3,2,4,1,6,{"$f":"IF(N258>0,RANK(N262,$G$262:$M$262,8),\"0\")","v":"0"},null,null,null,{"$f":"IF(R258>0,RANK(R262,$G$262:$S$262,10),\"0\")","v":"0"},{"$f":"IF(S258>0,RANK(S262,$G$262:$S$262,10),\"0\")","v":"0"}]
[null,null,null,null,null,null,{"$f":"IF(COUNTIF($G$267:$M$267,G267)>1,\"1\",\"\")","v":""},"","","","","","","",null,null,null,{"$f":"IF(COUNTIF($G$267:$S$267,R267)>1,\"1\",\"\")","v":"1"},{"$f":"IF(COUNTIF($G$267:$S$267,S267)>1,\"1\",\"\")","v":"1"}]
[null,null,null,null,"Gesamt Pins",null,{"$f":"+G262+G241","v":18717},{"$f":"+H262+H241","v":17856},17611,17308,17151,17349,17645,1300,null,null,null,{"$f":"+R262+R241","v":1812},{"$f":"+S262+S241","v":1850}]
[]
[]
[]
[null,null,null,null,"Anhang zum Spielbericht  B O W L I N G"]
["Anhang auswählen",null,null,null,null,null,null,null,null,null,null,null,null,"Punktspielserie"]
[null,null,null,null,"alle Felder sind unbedingt auszufüllen und mit dem Original-Spielbericht einzusenden."]
[]
[null,null,null,null,"Klasse:",null,{"$f":"+Hilfstabelle!$G$5","v":"B4"},"Antritt-Nr. :",11,"Datum :",{"$f":"VLOOKUP(I277,Hilfstabelle!$I$5:$J$18,2,0)","v":"2025-03-27"},"Halle :",{"$f":"VLOOKUP(I277,Hilfstabelle!$I$5:$L$18,3,0)","v":"Othmarschen"}]
[]
[null,null,null,null,null,null,"Ausrichter BSG:",{"$f":"VLOOKUP(I277,Hilfstabelle!$I$5:$L$18,4,0)","v":"SG Stern Hamburg 1"},"Mannschaftsführer: Michael Wetzel",null,null,"Telefon: 0172/412 45 69"]
[null,null,null,null,null,null,"Bahn:","Bahn:","Bahn:","Bahn:","Bahn:","Bahn:","Bahn:","Bahn:",null,null,null,"Bahn:","Bahn:"]
["Drucken","Start",null,null,"Durch-\ngänge",null,"BSG","BSG","BSG","BSG","BSG","BSG","BSG","BSG",null,null,null,"BSG","BSG"]
[null,"Rangliste",null,null,null,null,{"$f":"VLOOKUP(G283,Hilfstabelle!$L$5:$M$16,2,0)","v":"PAN 1"},{"$f":"VLOOKUP(H283,Hilfstabelle!$L$5:$M$16,2,0)","v":"DAT 2"},{"$f":"VLOOKUP(I283,Hilfstabelle!$L$5:$M$16,2,0)","v":"STI 3"},{"$f":"VLOOKUP(J283,Hilfstabelle!$L$5:$M$16,2,0)","v":"SGS 1"},{"$f":"VLOOKUP(K283,Hilfstabelle!$L$5:$M$16,2,0)","v":"JUS 2"},{"$f":"VLOOKUP(L283,Hilfstabelle!$L$5:$M$16,2,0)","v":"P2 2"},{"$f":"VLOOKUP(M283,Hilfstabelle!$L$5:$M$16,2,0)","v":"KS 2"},{"$f":"VLOOKUP(N283,Hilfstabelle!$L$5:$M$16,2,0)","v":"PAN 1"},null,null,null,{"$f":"VLOOKUP(R283,Hilfstabelle!$L$5:$M$16,2,0)","v":"DAT 2"},{"$f":"VLOOKUP(S283,Hilfstabelle!$L$5:$M$16,2,0)","v":"STI 3"}]
[null,null,null,null,null,null,{"$f":"+Hilfstabelle!L5","v":"Panasonic 1"},{"$f":"+Hilfstabelle!L6","v":"Dataport 2"},{"$f":"+Hilfstabelle!L7","v":"Still 3"},{"$f":"+Hilfstabelle!L8","v":"SG Stern Hamburg 1"},{"$f":"+Hilfstabelle!L9","v":"Justitzbehörde 2"},{"$f":"+Hilfstabelle!L10","v":"Postamt 2"},{"$f":"+Hilfstabelle!L11","v":"Körber Sports 2"},{"$f":"+Hilfstabelle!L12","v":"Panasonic 1"},null,null,null,{"$f":"+Hilfstabelle!L13","v":"Dataport 2"},{"$f":"+Hilfstabelle!$L14","v":"Still 3"}]
[null,null,null,null,"Platz",null,{"$f":"HLOOKUP(G283,Hilfstabelle!$H$20:$Q$21,2,0)","v":"2."},{"$f":"HLOOKUP(H283,Hilfstabelle!$H$20:$Q$21,2,0)","v":"3."},{"$f":"HLOOKUP(I283,Hilfstabelle!$H$20:$Q$21,2,0)","v":"5."},{"$f":"HLOOKUP(J283,Hilfstabelle!$H$20:$Q$21,2,0)","v":"4."},{"$f":"HLOOKUP(K283,Hilfstabelle!$H$20:$Q$21,2,0)","v":"6."},{"$f":"HLOOKUP(L283,Hilfstabelle!$H$20:$Q$21,2,0)","v":"7."},{"$f":"HLOOKUP(M283,Hilfstabelle!$H$20:$Q$21,2,0)","v":"1."},{"$f":"HLOOKUP(N283,Hilfstabelle!$H$20:$Q$21,2,0)","v":"2."},null,null,null,{"$f":"HLOOKUP(R283,Hilfstabelle!$H$20:$Q$21,2,0)","v":"3."},{"$f":"HLOOKUP(S283,Hilfstabelle!$H$20:$Q$21,2,0)","v":"5."}]
[null,null,null,null,1,null,626,686,546,678,442,684,608]
[null,null,null,null,2,null,650,628,540,661,485,722,580]
[null,null,null,null,"1 + 2",null,{"$f":"+G286+G285","v":1276},1314,1086,1339,927,1406,1188,{"$f":"+N286+N285","v":0},null,null,null,{"$f":"+R286+R285","v":0},{"$f":"+S286+S285","v":0}]
[null,null,null,null,3,null,591,638,553,614,491,656,569]
[null,null,null,null,"Pins\nGesamt",null,{"$f":"+G288+G287","v":1867},{"$f":"+H288+H287","v":1952},1639,1953,1418,2062,1757,0,null,null,null,{"$f":"+R288+R287","v":0},{"$f":"+S288+S287","v":0}]
[null,null,null,null,"Punkte\nAntritt",null,{"$f":"IF(G295=\"1\",+G294+0.5,+G294)","v":4},5,2,6,1,7,3,"0",null,null,null,{"$f":"IF(R295=\"1\",+R294+0.5,+R294)","v":0.5},{"$f":"IF(S295=\"1\",+S294+0.5,+S294)","v":0.5}]
[null,null,null,null,"Punkte\nA L T",null,{"$f":"+G265","v":51},44,35,35,36,31,48,{"$f":"+'Anhang zum Spielbericht'!N265","v":" "},null,null,null,{"$f":"+'Anhang zum Spielbericht'!R265","v":" "},{"$f":"+'Anhang zum Spielbericht'!S265","v":" "}]
[null,null,null,null,"Punkte\nN E U",null,{"$f":"IF(G285>0,+G291+G290,\" \")","v":55},49,37,41,37,38,51," ",null,null,null,{"$f":"IF(R285>0,+R291+R290,\" \")","v":" "},{"$f":"IF(S285>0,+S291+S290,\" \")","v":" "}]
[]
[null,null,null,null,null,null,{"$f":"IF(G285>0,RANK(G289,$G$289:$M$289,7),\"0\")","v":4},{"$f":"IF(H285>0,RANK(H289,$G$289:$M$289,7),\"0\")","v":5},2,6,1,7,3,{"$f":"IF(N285>0,RANK(N289,$G$289:$M$289,8),\"0\")","v":"0"},null,null,null,{"$f":"IF(R285>0,RANK(R289,$G$289:$S$289,10),\"0\")","v":"0"},{"$f":"IF(S285>0,RANK(S289,$G$289:$S$289,10),\"0\")","v":"0"}]
[null,null,null,null,null,null,{"$f":"IF(COUNTIF($G$294:$M$294,G294)>1,\"1\",\"\")","v":""},"","","","","","","",null,null,null,{"$f":"IF(COUNTIF($G$294:$S$294,R294)>1,\"1\",\"\")","v":"1"},{"$f":"IF(COUNTIF($G$294:$S$294,S294)>1,\"1\",\"\")","v":"1"}]
[null,null,null,null,"Gesamt Pins",null,{"$f":"+G289+G269","v":20584},{"$f":"+H289+H269","v":19808},19250,19261,18569,19411,19402,1300,null,null,null,{"$f":"+R289+R269","v":1812},{"$f":"+S289+S269","v":1850}]
[]
[]
[]
[null,null,null,null,"Anhang zum Spielbericht  B O W L I N G"]
["Anhang auswählen",null,null,null,null,null,null,null,null,null,null,null,null,"Punktspielserie"]
[null,null,null,null,"alle Felder sind unbedingt auszufüllen und mit dem Original-Spielbericht einzusenden."]
[]
[null,null,null,null,"Klasse:",null,{"$f":"+Hilfstabelle!$G$5","v":"B4"},"Antritt-Nr. :",12,"Datum :",{"$f":"VLOOKUP(I304,Hilfstabelle!$I$5:$J$18,2,0)","v":"2025-04-10"},"Halle :",{"$f":"VLOOKUP(I304,Hilfstabelle!$I$5:$L$18,3,0)","v":"Wandsbek"}]
[]
[null,null,null,null,null,null,"Ausrichter BSG:",{"$f":"VLOOKUP(I304,Hilfstabelle!$I$5:$L$18,4,0)","v":"Justitzbehörde 2"},"Mannschaftsführer: Michael Wetzel",null,null,"Telefon: 0172/412 45 69"]
[null,null,null,null,null,null,"Bahn:","Bahn:","Bahn:","Bahn:","Bahn:","Bahn:","Bahn:","Bahn:",null,null,null,"Bahn:","Bahn:"]
["Drucken","Start",null,null,"Durch-\ngänge",null,"BSG","BSG","BSG","BSG","BSG","BSG","BSG","BSG",null,null,null,"BSG","BSG"]
[null,"Rangliste",null,null,null,null,{"$f":"VLOOKUP(G310,Hilfstabelle!$L$5:$M$16,2,0)","v":"PAN 1"},{"$f":"VLOOKUP(H310,Hilfstabelle!$L$5:$M$16,2,0)","v":"DAT 2"},{"$f":"VLOOKUP(I310,Hilfstabelle!$L$5:$M$16,2,0)","v":"STI 3"},{"$f":"VLOOKUP(J310,Hilfstabelle!$L$5:$M$16,2,0)","v":"SGS 1"},{"$f":"VLOOKUP(K310,Hilfstabelle!$L$5:$M$16,2,0)","v":"JUS 2"},{"$f":"VLOOKUP(L310,Hilfstabelle!$L$5:$M$16,2,0)","v":"P2 2"},{"$f":"VLOOKUP(M310,Hilfstabelle!$L$5:$M$16,2,0)","v":"KS 2"},{"$f":"VLOOKUP(N310,Hilfstabelle!$L$5:$M$16,2,0)","v":"PAN 1"},null,null,null,{"$f":"VLOOKUP(R310,Hilfstabelle!$L$5:$M$16,2,0)","v":"DAT 2"},{"$f":"VLOOKUP(S310,Hilfstabelle!$L$5:$M$16,2,0)","v":"STI 3"}]
[null,null,null,null,null,null,{"$f":"+Hilfstabelle!L5","v":"Panasonic 1"},{"$f":"+Hilfstabelle!L6","v":"Dataport 2"},{"$f":"+Hilfstabelle!L7","v":"Still 3"},{"$f":"+Hilfstabelle!L8","v":"SG Stern Hamburg 1"},{"$f":"+Hilfstabelle!L9","v":"Justitzbehörde 2"},{"$f":"+Hilfstabelle!L10","v":"Postamt 2"},{"$f":"+Hilfstabelle!L11","v":"Körber Sports 2"},{"$f":"+Hilfstabelle!L12","v":"Panasonic 1"},null,null,null,{"$f":"+Hilfstabelle!L13","v":"Dataport 2"},{"$f":"+Hilfstabelle!$L14","v":"Still 3"}]
[null,null,null,null,"Platz",null,{"$f":"HLOOKUP(G310,Hilfstabelle!$H$20:$Q$21,2,0)","v":"2."},{"$f":"HLOOKUP(H310,Hilfstabelle!$H$20:$Q$21,2,0)","v":"3."},{"$f":"HLOOKUP(I310,Hilfstabelle!$H$20:$Q$21,2,0)","v":"5."},{"$f":"HLOOKUP(J310,Hilfstabelle!$H$20:$Q$21,2,0)","v":"4."},{"$f":"HLOOKUP(K310,Hilfstabelle!$H$20:$Q$21,2,0)","v":"6."},{"$f":"HLOOKUP(L310,Hilfstabelle!$H$20:$Q$21,2,0)","v":"7."},{"$f":"HLOOKUP(M310,Hilfstabelle!$H$20:$Q$21,2,0)","v":"1."},{"$f":"HLOOKUP(N310,Hilfstabelle!$H$20:$Q$21,2,0)","v":"2."},null,null,null,{"$f":"HLOOKUP(R310,Hilfstabelle!$H$20:$Q$21,2,0)","v":"3."},{"$f":"HLOOKUP(S310,Hilfstabelle!$H$20:$Q$21,2,0)","v":"5."}]
[null,null,null,null,1,null,582,654,637,646,575,596,676]
[null,null,null,null,2,null,575,677,600,673,646,603,589]
[null,null,null,null,"1 + 2",null,{"$f":"+G313+G312","v":1157},1331,1237,1319,1221,1199,1265,{"$f":"+N313+N312","v":0},null,null,null,{"$f":"+R313+R312","v":0},{"$f":"+S313+S312","v":0}]
[null,null,null,null,3,null,688,557,662,665,581,519,752]
[null,null,null,null,"Pins\nGesamt",null,{"$f":"+G315+G314","v":1845},1888,1899,1984,1802,1718,2017,0,null,null,null,{"$f":"+R315+R314","v":0},{"$f":"+S315+S314","v":0}]
[null,null,null,null,"Punkte\nAntritt",null,{"$f":"IF(G322=\"1\",+G321+0.5,+G321)","v":3},4,5,6,2,1,7,"0",null,null,null,{"$f":"IF(R322=\"1\",+R321+0.5,+R321)","v":0.5},{"$f":"IF(S322=\"1\",+S321+0.5,+S321)","v":0.5}]
[null,null,null,null,"Punkte\nA L T",null,{"$f":"+G292","v":55},{"$f":"+H292","v":49},37,41,37,38,51,{"$f":"+'Anhang zum Spielbericht'!N292","v":" "},null,null,null,{"$f":"+'Anhang zum Spielbericht'!R292","v":" "},{"$f":"+'Anhang zum Spielbericht'!S292","v":" "}]
[null,null,null,null,"Punkte\nN E U",null,{"$f":"IF(G312>0,+G318+G317,\" \")","v":58},53,42,47,39,39,58," ",null,null,null,{"$f":"IF(R312>0,+R318+R317,\" \")","v":" "},{"$f":"IF(S312>0,+S318+S317,\" \")","v":" "}]
[]
[null,null,null,null,null,null,{"$f":"IF(G312>0,RANK(G316,$G$316:$M$316,7),\"0\")","v":3},{"$f":"IF(H312>0,RANK(H316,$G$316:$M$316,7),\"0\")","v":4},5,6,2,1,7,{"$f":"IF(N312>0,RANK(N316,$G$316:$M$316,8),\"0\")","v":"0"},null,null,null,{"$f":"IF(R312>0,RANK(R316,$G$316:$S$316,10),\"0\")","v":"0"},{"$f":"IF(S312>0,RANK(S316,$G$316:$S$316,10),\"0\")","v":"0"}]
[null,null,null,null,null,null,{"$f":"IF(COUNTIF($G$321:$M$321,G321)>1,\"1\",\"\")","v":""},"","","","","","","",null,null,null,{"$f":"IF(COUNTIF($G$321:$S$321,R321)>1,\"1\",\"\")","v":"1"},{"$f":"IF(COUNTIF($G$321:$S$321,S321)>1,\"1\",\"\")","v":"1"}]
[null,null,null,null,"Gesamt Pins",null,{"$f":"+G316+G296","v":22429},{"$f":"+H316+H296","v":21696},21149,21245,20371,21129,21419,1300,null,null,null,{"$f":"+R316+R296","v":1812},{"$f":"+S316+S296","v":1850}]
[]
[]
[]
[null,null,null,null,"Anhang zum Spielbericht  B O W L I N G"]
["Anhang auswählen",null,null,null,null,null,null,null,null,null,null,null,null,"Punktspielserie"]
[null,null,null,null,"alle Felder sind unbedingt auszufüllen und mit dem Original-Spielbericht einzusenden."]
[]
[null,null,null,null,"Klasse:",null,{"$f":"+Hilfstabelle!$G$5","v":"B4"},"Antritt-Nr. :",13,"Datum :",{"$f":"VLOOKUP(I331,Hilfstabelle!$I$5:$J$18,2,0)","v":"2025-04-24"},"Halle :",{"$f":"VLOOKUP(I331,Hilfstabelle!$I$5:$L$18,3,0)","v":"Othmarschen"}]
[]
[null,null,null,null,null,null,"Ausrichter BSG:",{"$f":"VLOOKUP(I331,Hilfstabelle!$I$5:$L$18,4,0)","v":"Postamt 2"},"Mannschaftsführer: Michael Wetzel",null,null,"Telefon: 0172/412 45 69"]
[null,null,null,null,null,null,"Bahn:","Bahn:","Bahn:","Bahn:","Bahn:","Bahn:","Bahn:","Bahn:",null,null,null,"Bahn:","Bahn:"]
["Drucken","Start",null,null,"Durch-\ngänge",null,"BSG","BSG","BSG","BSG","BSG","BSG","BSG","BSG",null,null,null,"BSG","BSG"]
[null,"Rangliste",null,null,null,null,{"$f":"VLOOKUP(G337,Hilfstabelle!$L$5:$M$16,2,0)","v":"PAN 1"},{"$f":"VLOOKUP(H337,Hilfstabelle!$L$5:$M$16,2,0)","v":"DAT 2"},{"$f":"VLOOKUP(I337,Hilfstabelle!$L$5:$M$16,2,0)","v":"STI 3"},{"$f":"VLOOKUP(J337,Hilfstabelle!$L$5:$M$16,2,0)","v":"SGS 1"},{"$f":"VLOOKUP(K337,Hilfstabelle!$L$5:$M$16,2,0)","v":"JUS 2"},{"$f":"VLOOKUP(L337,Hilfstabelle!$L$5:$M$16,2,0)","v":"P2 2"},{"$f":"VLOOKUP(M337,Hilfstabelle!$L$5:$M$16,2,0)","v":"KS 2"},{"$f":"VLOOKUP(N337,Hilfstabelle!$L$5:$M$16,2,0)","v":"PAN 1"},null,null,null,{"$f":"VLOOKUP(R337,Hilfstabelle!$L$5:$M$16,2,0)","v":"DAT 2"},{"$f":"VLOOKUP(S337,Hilfstabelle!$L$5:$M$16,2,0)","v":"STI 3"}]
[null,null,null,null,null,null,{"$f":"+Hilfstabelle!L5","v":"Panasonic 1"},{"$f":"+Hilfstabelle!L6","v":"Dataport 2"},{"$f":"+Hilfstabelle!L7","v":"Still 3"},{"$f":"+Hilfstabelle!L8","v":"SG Stern Hamburg 1"},{"$f":"+Hilfstabelle!L9","v":"Justitzbehörde 2"},{"$f":"+Hilfstabelle!L10","v":"Postamt 2"},{"$f":"+Hilfstabelle!L11","v":"Körber Sports 2"},{"$f":"+Hilfstabelle!L12","v":"Panasonic 1"},null,null,null,{"$f":"+Hilfstabelle!L13","v":"Dataport 2"},{"$f":"+Hilfstabelle!$L14","v":"Still 3"}]
[null,null,null,null,"Platz",null,{"$f":"HLOOKUP(G337,Hilfstabelle!$H$20:$Q$21,2,0)","v":"2."},{"$f":"HLOOKUP(H337,Hilfstabelle!$H$20:$Q$21,2,0)","v":"3."},{"$f":"HLOOKUP(I337,Hilfstabelle!$H$20:$Q$21,2,0)","v":"5."},{"$f":"HLOOKUP(J337,Hilfstabelle!$H$20:$Q$21,2,0)","v":"4."},{"$f":"HLOOKUP(K337,Hilfstabelle!$H$20:$Q$21,2,0)","v":"6."},{"$f":"HLOOKUP(L337,Hilfstabelle!$H$20:$Q$21,2,0)","v":"7."},{"$f":"HLOOKUP(M337,Hilfstabelle!$H$20:$Q$21,2,0)","v":"1."},{"$f":"HLOOKUP(N337,Hilfstabelle!$H$20:$Q$21,2,0)","v":"2."},null,null,null,{"$f":"HLOOKUP(R337,Hilfstabelle!$H$20:$Q$21,2,0)","v":"3."},{"$f":"HLOOKUP(S337,Hilfstabelle!$H$20:$Q$21,2,0)","v":"5."}]
[null,null,null,null,1,null,662,513,687,542,637,546,595,null,662,513,687,542,637,546,595]
[null,null,null,null,2,null,600,603,620,489,604,613,660,null,600,603,620,489,604,613,660]
[null,null,null,null,"1 + 2",null,{"$f":"+G340+G339","v":1262},1116,1307,1031,1241,1159,1255,{"$f":"+N340+N339","v":0},null,null,null,{"$f":"+R340+R339","v":1031},{"$f":"+S340+S339","v":1241}]
[null,null,null,null,3,null,638,617,599,511,600,634,667]
[null,null,null,null,"Pins\nGesamt",null,{"$f":"+G342+G341","v":1900},1733,1906,1542,1841,1793,1922,0,null,null,null,{"$f":"+R342+R341","v":1031},{"$f":"+S342+S341","v":1241}]
[null,null,null,null,"Punkte\nAntritt",null,{"$f":"IF(G349=\"1\",+G348+0.5,+G348)","v":5},2,6,1,4,3,7,"0",null,null,null,{"$f":"IF(R349=\"1\",+R348+0.5,+R348)","v":2.5},{"$f":"IF(S349=\"1\",+S348+0.5,+S348)","v":3.5}]
[null,null,null,null,"Punkte\nA L T",null,{"$f":"+G319","v":58},{"$f":"+H319","v":53},42,47,39,39,58,{"$f":"+'Anhang zum Spielbericht'!N319","v":" "},null,null,null,{"$f":"+'Anhang zum Spielbericht'!R319","v":" "},{"$f":"+'Anhang zum Spielbericht'!S319","v":" "}]
[null,null,null,null,"Punkte\nN E U",null,{"$f":"IF(G339>0,+G345+G344,\" \")","v":63},55,48,48,43,42,65," ",null,null,null,{"$f":"IF(R339>0,+R345+R344,\" \")","v":{"$error":"#VALUE!"}},{"$f":"IF(S339>0,+S345+S344,\" \")","v":{"$error":"#VALUE!"}}]
[]
[null,null,null,null,null,null,{"$f":"IF(G339>0,RANK(G343,$G$343:$M$343,7),\"0\")","v":5},{"$f":"IF(H339>0,RANK(H343,$G$343:$M$343,7),\"0\")","v":2},6,1,4,3,7,{"$f":"IF(N339>0,RANK(N343,$G$343:$M$343,8),\"0\")","v":"0"},null,null,null,{"$f":"IF(R339>0,RANK(R343,$G$343:$S$343,10),\"0\")","v":2},{"$f":"IF(S339>0,RANK(S343,$G$343:$S$343,10),\"0\")","v":3}]
[null,null,null,null,null,null,{"$f":"IF(COUNTIF($G$348:$M$348,G348)>1,\"1\",\"\")","v":""},"","","","","","","",null,null,null,{"$f":"IF(COUNTIF($G$348:$S$348,R348)>1,\"1\",\"\")","v":"1"},{"$f":"IF(COUNTIF($G$348:$S$348,S348)>1,\"1\",\"\")","v":"1"}]
[null,null,null,null,null,null,{"$f":"IF(COUNTIF($G$347:$S$347,G347)>1,\"1\",\"\")","v":""},"","","","","","","",null,null,null,{"$f":"IF(COUNTIF($G$347:$S$347,R347)>1,\"1\",\"\")","v":""},{"$f":"IF(COUNTIF($G$347:$S$347,S347)>1,\"1\",\"\")","v":""}]
[null,null,null,null,"Gesamt Pins",null,{"$f":"+G343+G323","v":24329},{"$f":"+H343+H323","v":23429},23055,22787,22212,22922,23341,1300,null,null,null,{"$f":"+R343+R323","v":2843},{"$f":"+S343+S323","v":3091}]
[]
[]
[null,null,null,null,"Anhang zum Spielbericht  B O W L I N G"]
["Anhang auswählen",null,null,null,null,null,null,null,null,null,null,null,null,"Punktspielserie"]
[null,null,null,null,"alle Felder sind unbedingt auszufüllen und mit dem Original-Spielbericht einzusenden."]
[]
[null,null,null,null,"Klasse:",null,{"$f":"+Hilfstabelle!$G$5","v":"B4"},"Antritt-Nr. :",14,"Datum :",{"$f":"VLOOKUP(I358,Hilfstabelle!$I$5:$J$18,2,0)","v":"2025-05-08"},"Halle :",{"$f":"VLOOKUP(I358,Hilfstabelle!$I$5:$L$18,3,0)","v":"Wandsbek"}]
[]
[null,null,null,null,null,null,"Ausrichter BSG:",{"$f":"VLOOKUP(I358,Hilfstabelle!$I$5:$L$18,4,0)","v":"Körber Sports 2"},"Mannschaftsführer: Michael Wetzel",null,null,"Telefon: 0172/412 45 69"]
[null,null,null,null,null,null,"Bahn:","Bahn:","Bahn:","Bahn:","Bahn:","Bahn:","Bahn:","Bahn:",null,null,null,"Bahn:","Bahn:"]
["Drucken","Start",null,null,"Durch-\ngänge",null,"BSG","BSG","BSG","BSG","BSG","BSG","BSG","BSG",null,null,null,"BSG","BSG"]
[null,"Rangliste",null,null,null,null,{"$f":"VLOOKUP(G364,Hilfstabelle!$L$5:$M$16,2,0)","v":"PAN 1"},{"$f":"VLOOKUP(H364,Hilfstabelle!$L$5:$M$16,2,0)","v":"DAT 2"},{"$f":"VLOOKUP(I364,Hilfstabelle!$L$5:$M$16,2,0)","v":"STI 3"},{"$f":"VLOOKUP(J364,Hilfstabelle!$L$5:$M$16,2,0)","v":"SGS 1"},{"$f":"VLOOKUP(K364,Hilfstabelle!$L$5:$M$16,2,0)","v":"JUS 2"},{"$f":"VLOOKUP(L364,Hilfstabelle!$L$5:$M$16,2,0)","v":"P2 2"},{"$f":"VLOOKUP(M364,Hilfstabelle!$L$5:$M$16,2,0)","v":"KS 2"},{"$f":"VLOOKUP(N364,Hilfstabelle!$L$5:$M$16,2,0)","v":"PAN 1"},null,null,null,{"$f":"VLOOKUP(R364,Hilfstabelle!$L$5:$M$16,2,0)","v":"DAT 2"},{"$f":"VLOOKUP(S364,Hilfstabelle!$L$5:$M$16,2,0)","v":"STI 3"}]
[null,null,null,null,null,null,{"$f":"+Hilfstabelle!L5","v":"Panasonic 1"},{"$f":"+Hilfstabelle!L6","v":"Dataport 2"},{"$f":"+Hilfstabelle!L7","v":"Still 3"},{"$f":"+Hilfstabelle!L8","v":"SG Stern Hamburg 1"},{"$f":"+Hilfstabelle!L9","v":"Justitzbehörde 2"},{"$f":"+Hilfstabelle!L10","v":"Postamt 2"},{"$f":"+Hilfstabelle!L11","v":"Körber Sports 2"},{"$f":"+Hilfstabelle!L12","v":"Panasonic 1"},null,null,null,{"$f":"+Hilfstabelle!L13","v":"Dataport 2"},{"$f":"+Hilfstabelle!$L14","v":"Still 3"}]
[null,null,null,null,"Platz",null,{"$f":"HLOOKUP(G364,Hilfstabelle!$H$20:$Q$21,2,0)","v":"2."},{"$f":"HLOOKUP(H364,Hilfstabelle!$H$20:$Q$21,2,0)","v":"3."},{"$f":"HLOOKUP(I364,Hilfstabelle!$H$20:$Q$21,2,0)","v":"5."},{"$f":"HLOOKUP(J364,Hilfstabelle!$H$20:$Q$21,2,0)","v":"4."},{"$f":"HLOOKUP(K364,Hilfstabelle!$H$20:$Q$21,2,0)","v":"6."},{"$f":"HLOOKUP(L364,Hilfstabelle!$H$20:$Q$21,2,0)","v":"7."},{"$f":"HLOOKUP(M364,Hilfstabelle!$H$20:$Q$21,2,0)","v":"1."},{"$f":"HLOOKUP(N364,Hilfstabelle!$H$20:$Q$21,2,0)","v":"2."},null,null,null,{"$f":"HLOOKUP(R364,Hilfstabelle!$H$20:$Q$21,2,0)","v":"3."},{"$f":"HLOOKUP(S364,Hilfstabelle!$H$20:$Q$21,2,0)","v":"5."}]
[null,null,null,null,1,null,613,639,514,569,668,694,662]
[null,null,null,null,2,null,715,582,638,577,708,574,729]
[null,null,null,null,"1 + 2",null,{"$f":"+G367+G366","v":1328},1221,1152,1146,1376,1268,1391,{"$f":"+N367+N366","v":0},null,null,null,{"$f":"+R367+R366","v":0},{"$f":"+S367+S366","v":0}]
[null,null,null,null,3,null,597,611,501,667,669,573,700]
[null,null,null,null,"Pins\nGesamt",null,{"$f":"+G369+G368","v":1925},1832,1653,1813,2045,1841,2091,0,null,null,null,{"$f":"+R369+R368","v":0},{"$f":"+S369+S368","v":0}]
[null,null,null,null,"Punkte\nAntritt",null,{"$f":"IF(G376=\"1\",+G375+0.5,+G375)","v":5},3,1,2,6,4,7,"0",null,null,null,{"$f":"IF(R376=\"1\",+R375+0.5,+R375)","v":"0"},{"$f":"IF(S376=\"1\",+S375+0.5,+S375)","v":"0"}]
[null,null,null,null,"Punkte\nA L T",null,{"$f":"+G346","v":63},{"$f":"+H346","v":55},48,48,43,42,65,{"$f":"+'Anhang zum Spielbericht'!N346","v":" "},null,null,null,{"$f":"+'Anhang zum Spielbericht'!R346","v":{"$error":"#VALUE!"}},{"$f":"+'Anhang zum Spielbericht'!S346","v":{"$error":"#VALUE!"}}]
[null,null,null,null,"Punkte\nN E U",null,{"$f":"IF(G366>0,+G372+G371,\" \")","v":68},58,49,50,49,46,72," ",null,null,null,{"$f":"IF(R366>0,+R372+R371,\" \")","v":" "},{"$f":"IF(S366>0,+S372+S371,\" \")","v":" "}]
[null,null,null,null,"Gesamt Pins",null,{"$f":"+G370+G351","v":26254},25261,24708,24600,24257,24763,25432,1300,null,null,null,{"$f":"+R370+R351","v":2843},{"$f":"+S370+S351","v":3091}]
[null,null,null,null,null,null,{"$f":"IF(G366>0,RANK(G370,$G$370:$M$370,7),\"0\")","v":5},{"$f":"IF(H366>0,RANK(H370,$G$370:$M$370,7),\"0\")","v":3},1,2,6,4,7,{"$f":"IF(N366>0,RANK(N370,$G$370:$M$370,8),\"0\")","v":"0"},null,null,null,{"$f":"IF(R366>0,RANK(R370,$G$343:$S$343,10),\"0\")","v":"0"},{"$f":"IF(S366>0,RANK(S370,$G$343:$S$343,10),\"0\")","v":"0"}]
[null,null,null,null,null,null,{"$f":"IF(COUNTIF($G$375:$M$375,G375)>1,\"1\",\"\")","v":""},"","","","","","","",null,null,null,{"$f":"IF(COUNTIF($G$348:$S$348,R375)>1,\"1\",\"\")","v":""},{"$f":"IF(COUNTIF($G$348:$S$348,S375)>1,\"1\",\"\")","v":""}]

{"sheet":"Spielberichte","index":20,"n_rows":500,"n_cols":16,"rows_kept":500,"cut":false,"hidden":false,"merged":[[310,8,310,11],[295,8,295,11],[274,8,274,11],[259,8,259,11],[5,0,5,4],[10,0,10,4],[7,8,7,11],[22,8,22,11],[43,8,43,11],[238,8,238,11],[223,8,223,11],[202,8,202,11],[187,8,187,11],[166,8,166,11],[403,8,403,11],[382,8,382,11],[367,8,367,11],[346,8,346,11],[331,8,331,11],[492,8,492,11],[476,8,476,11],[455,8,455,11],[439,8,439,11],[418,8,418,11],[13,15,14,15],[13,12,14,12],[13,13,14,13],[13,14,14,14],[151,8,151,11],[130,8,130,11],[115,8,115,11],[94,8,94,11],[58,8,58,11],[79,8,79,11],[28,15,29,15]]}
["Start",null,null,null,null,"Spielbericht"]
["Rangliste",null,null,null,null," Spielbericht BOWLING"]
[null,null,null,null,null,"Betriebssportverband Hamburg e.V.",null,null,null,null,null,null,null,null,null,"Punktspielserie"]
[null,null,null,null,null,"alle Felder sind unbedingt auszufüllen,da sonst der Spielbericht ungültig ist "]
[]
["Spielberichte drucken",null,null,null,null,"Klasse","Herren",{"$f":"+Hilfstabelle!G5","v":"B4"},"     Antritt     Nr.",1,null,"Datum",{"$f":"+Hilfstabelle!B5","v":"2024-09-12"},"BSG","PAN 1"]
[]
[null,null,null,null,null,null,"X)","Pass-Nr.","Vor-und Zuname",null,null,null,"I","II","III","Gesamt"]
[null,null,null,null,null,1,null,{"$f":"IF(I9>0,VLOOKUP(I9,Tabelle2[#Data],2,0),\"\")","v":19222},{"$f":"+Spielereinteilung!B8","v":"Annegret Schmidt"},null,null,null,null,null,null,{"$f":"+O9+N9+M9","v":0}]
[null,null,null,null,null,2,null,{"$f":"IF(I10>0,VLOOKUP(I10,Tabelle2[#Data],2,0),\"\")","v":22115},{"$f":"+Spielereinteilung!B9","v":"Ilona Wetzel"},null,null,null,null,null,null,{"$f":"+O10+N10+M10","v":0}]
["Spielberichte anzeigen",null,null,null,null,3,null,{"$f":"IF(I11>0,VLOOKUP(I11,Tabelle2[#Data],2,0),\"\")","v":22113},{"$f":"+Spielereinteilung!B10","v":"Michael Wetzel"},null,null,null,null,null,null,0]
[null,null,null,null,null,4,null,{"$f":"IF(I12>0,VLOOKUP(I12,Tabelle2[#Data],2,0),\"\")","v":21889},{"$f":"+Spielereinteilung!B11","v":"Kai Roßberg"},null,null,null,null,null,null,0]
[null,null,null,null,null,5]
[null,null,null,null,null,"Bitte mit einem x) versehen",null,null,"     Unterschrift des Spiel-",null,null,null,{"$f":"SUM(M9:M13)","v":0},0,0,{"$f":"SUM(P9:P13)","v":0}]
[null,null,null,null,null,"wenn Ersatzspieler/in",null,null,"     partners"]
[]
[null,null,null,null,null," Spielbericht BOWLING"]
[null,null,null,null,null,"Betriebssportverband Hamburg e.V.",null,null,null,null,null,null,null,null,null,"Punktspielserie"]
[null,null,null,null,null,"alle Felder sind unbedingt auszufüllen,da sonst der Spielbericht ungültig ist "]
[]
[null,null,null,null,null,"Klasse","  Herren",{"$f":"+H6","v":"B4"},"     Antritt     Nr.",{"$f":"J6","v":1},null,"Datum",{"$f":"+M6","v":"2024-09-12"},"BSG",{"$f":"+O6","v":"PAN 1"}]
[]
[null,null,null,null,null,null,"X)","Pass-Nr.","Vor-und Zuname",null,null,null,"I","II","III","Gesamt"]
[null,null,null,null,null,1,{"$f":"G9","v":0},{"$f":"+H9","v":19222},"Annegret Schmidt",null,null,null,null,null,null,{"$f":"+O24+N24+M24","v":0}]
[null,null,null,null,null,2,{"$f":"G10","v":0},22115,"Ilona Wetzel",null,null,null,null,null,null,{"$f":"+O25+N25+M25","v":0}]
[null,null,null,null,null,3,{"$f":"G11","v":0},22113,"Michael Wetzel",null,null,null,null,null,null,0]
[null,null,null,null,null,4,{"$f":"G12","v":0},21889,"Kai Roßberg",null,null,null,null,null,null,0]
[null,null,null,null,null,5,{"$f":"G13","v":0},0,0]
[null,null,null,null,null,"Bitte mit einem x) versehen",null,null,"     Unterschrift des Spiel-",null,null,null,null,null,null,{"$f":"+P27+P25+P24+P26","v":0}]
[null,null,null,null,null,"wenn Ersatzspieler/in",null,null,"     partners"]
[]
[]
[]
[]
[]
[]
[]
[null,null,null,null,null," Spielbericht BOWLING"]
[null,null,null,null,null,"Betriebssportverband Hamburg e.V.",null,null,null,null,null,null,null,null,null,"Punktspielserie"]
[null,null,null,null,null,"alle Felder sind unbedingt auszufüllen,da sonst der Spielbericht ungültig ist "]
[]
[null,null,null,null,null,"Klasse","Herren",{"$f":"+H6","v":"B4"},"     Antritt     Nr.",2,null,"Datum",{"$f":"+Hilfstabelle!B6","v":"2024-09-26"},"BSG","PAN 1"]
[]
[null,null,null,null,null,null,"X)","Pass-Nr.","Vor-und Zuname",null,null,null,"I","II","III","Gesamt"]
[null,null,null,null,null,1,null,{"$f":"IF(I45>0,VLOOKUP(I45,Tabelle2[#Data],2,0),\"\")","v":20137},{"$f":"+Spielereinteilung!K8","v":"Matthias Nolte"}]
[null,null,null,null,null,2,null,{"$f":"IF(I46>0,VLOOKUP(I46,Tabelle2[#Data],2,0),\"\")","v":24775},{"$f":"+Spielereinteilung!K9","v":"Deniz Hagelstein"}]
[null,null,null,null,null,3,null,{"$f":"IF(I47>0,VLOOKUP(I47,Tabelle2[#Data],2,0),\"\")","v":23302},{"$f":"+Spielereinteilung!K10","v":"Mario Jurk"}]
[null,null,null,null,null,4,null,{"$f":"IF(I48>0,VLOOKUP(I48,Tabelle2[#Data],2,0),\"\")","v":21889},{"$f":"+Spielereinteilung!K11","v":"Kai Roßberg"}]
[null,null,null,null,null,5]
[null,null,null,null,null,"Bitte mit einem x) versehen",null,null,"     Unterschrift des Spiel-"]
[null,null,null,null,null,"wenn Ersatzspieler/in",null,null,"     partners"]
[]
[null,null,null,null,null," Spielbericht BOWLING"]
[null,null,null,null,null,"Betriebssportverband Hamburg e.V.",null,null,null,null,null,null,null,null,null,"Punktspielserie"]
[null,null,null,null,null,"alle Felder sind unbedingt auszufüllen,da sonst der Spielbericht ungültig ist "]
[]
[null,null,null,null,null,"Klasse","  Herren",{"$f":"+H42","v":"B4"},"     Antritt     Nr.",{"$f":"J42","v":2},null,"Datum",{"$f":"+M42","v":"2024-09-26"},"BSG",{"$f":"+O42","v":"PAN 1"}]
[]
[null,null,null,null,null,null,"X)","Pass-Nr.","Vor-und Zuname",null,null,null,"I","II","III","Gesamt"]
[null,null,null,null,null,1,{"$f":"G45","v":0},{"$f":"+H45","v":20137},"Matthias Nolte"]
[null,null,null,null,null,2,{"$f":"G46","v":0},24775,"Deniz Hagelstein"]
[null,null,null,null,null,3,{"$f":"G47","v":0},23302,"Mario Jurk"]
[null,null,null,null,null,4,{"$f":"G48","v":0},21889,"Kai Roßberg"]
[null,null,null,null,null,5,{"$f":"G49","v":0},0,0]
[null,null,null,null,null,"Bitte mit einem x) versehen",null,null,"     Unterschrift des Spiel-"]
[null,null,null,null,null,"wenn Ersatzspieler/in",null,null,"     partners"]
[]
[]
[]
[]
[]
[]
[]
[null,null,null,null,null," Spielbericht BOWLING"]
[null,null,null,null,null,"Betriebssportverband Hamburg e.V.",null,null,null,null,null,null,null,null,null,"Punktspielserie"]
[null,null,null,null,null,"alle Felder sind unbedingt auszufüllen,da sonst der Spielbericht ungültig ist "]
[]
[null,null,null,null,null,"Klasse","Herren",{"$f":"+H42","v":"B4"},"     Antritt     Nr.",3,null,"Datum",{"$f":"+Hilfstabelle!B7","v":"2024-10-10"},"BSG","PAN 1"]
[]
[null,null,null,null,null,null,"X)","Pass-Nr.","Vor-und Zuname",null,null,null,"I","II","III","Gesamt"]
[null,null,null,null,null,1,null,{"$f":"IF(I81>0,VLOOKUP(I81,Tabelle2[#Data],2,0),\"\")","v":22115},{"$f":"+Spielereinteilung!T8","v":"Ilona Wetzel"}]
[null,null,null,null,null,2,null,{"$f":"IF(I82>0,VLOOKUP(I82,Tabelle2[#Data],2,0),\"\")","v":19222},{"$f":"+Spielereinteilung!T9","v":"Annegret Schmidt"}]
[null,null,null,null,null,3,null,{"$f":"IF(I83>0,VLOOKUP(I83,Tabelle2[#Data],2,0),\"\")","v":22113},{"$f":"+Spielereinteilung!T10","v":"Michael Wetzel"}]
[null,null,null,null,null,4,null,{"$f":"IF(I84>0,VLOOKUP(I84,Tabelle2[#Data],2,0),\"\")","v":21889},{"$f":"+Spielereinteilung!T11","v":"Kai Roßberg"}]
[null,null,null,null,null,5]
[null,null,null,null,null,"Bitte mit einem x) versehen",null,null,"     Unterschrift des Spiel-"]
[null,null,null,null,null,"wenn Ersatzspieler/in",null,null,"     partners"]
[]
[null,null,null,null,null," Spielbericht BOWLING"]
[null,null,null,null,null,"Betriebssportverband Hamburg e.V.",null,null,null,null,null,null,null,null,null,"Punktspielserie"]
[null,null,null,null,null,"alle Felder sind unbedingt auszufüllen,da sonst der Spielbericht ungültig ist "]
[]
[null,null,null,null,null,"Klasse","  Herren",{"$f":"+H78","v":"B4"},"     Antritt     Nr.",{"$f":"J78","v":3},null,"Datum",{"$f":"+M78","v":"2024-10-10"},"BSG",{"$f":"+O78","v":"PAN 1"}]
[]
[null,null,null,null,null,null,"X)","Pass-Nr.","Vor-und Zuname",null,null,null,"I","II","III","Gesamt"]
[null,null,null,null,null,1,{"$f":"G81","v":0},{"$f":"+H81","v":22115},"Ilona Wetzel"]
[null,null,null,null,null,2,{"$f":"G82","v":0},19222,"Annegret Schmidt"]
[null,null,null,null,null,3,{"$f":"G83","v":0},22113,"Michael Wetzel"]
[null,null,null,null,null,4,{"$f":"G84","v":0},21889,"Kai Roßberg"]
[null,null,null,null,null,5,{"$f":"G85","v":0},0,0]
[null,null,null,null,null,"Bitte mit einem x) versehen",null,null,"     Unterschrift des Spiel-"]
[null,null,null,null,null,"wenn Ersatzspieler/in",null,null,"     partners"]
[]
[]
[]
[]
[]
[]
[]
[null,null,null,null,null," Spielbericht BOWLING"]
[null,null,null,null,null,"Betriebssportverband Hamburg e.V.",null,null,null,null,null,null,null,null,null,"Punktspielserie"]
[null,null,null,null,null,"alle Felder sind unbedingt auszufüllen,da sonst der Spielbericht ungültig ist "]
[]
[null,null,null,null,null,"Klasse","Herren",{"$f":"+H78","v":"B4"},"     Antritt     Nr.",4,null,"Datum",{"$f":"+Hilfstabelle!B8","v":"2024-10-24"},"BSG","PAN 1"]
[]
[null,null,null,null,null,null,"X)","Pass-Nr.","Vor-und Zuname",null,null,null,"I","II","III","Gesamt"]
[null,null,null,null,null,1,null,{"$f":"IF(I117>0,VLOOKUP(I117,Tabelle2[#Data],2,0),\"\")","v":20137},{"$f":"+Spielereinteilung!AC8","v":"Matthias Nolte"}]
[null,null,null,null,null,2,null,{"$f":"IF(I118>0,VLOOKUP(I118,Tabelle2[#Data],2,0),\"\")","v":24775},{"$f":"+Spielereinteilung!AC9","v":"Deniz Hagelstein"}]
[null,null,null,null,null,3,null,{"$f":"IF(I119>0,VLOOKUP(I119,Tabelle2[#Data],2,0),\"\")","v":24774},{"$f":"+Spielereinteilung!AC10","v":"Frank Nijholt"}]
[null,null,null,null,null,4,null,{"$f":"IF(I120>0,VLOOKUP(I120,Tabelle2[#Data],2,0),\"\")","v":22113},{"$f":"+Spielereinteilung!AC11","v":"Michael Wetzel"}]
[null,null,null,null,null,5]
[null,null,null,null,null,"Bitte mit einem x) versehen",null,null,"     Unterschrift des Spiel-"]
[null,null,null,null,null,"wenn Ersatzspieler/in",null,null,"     partners"]
[]
[null,null,null,null,null," Spielbericht BOWLING"]
[null,null,null,null,null,"Betriebssportverband Hamburg e.V.",null,null,null,null,null,null,null,null,null,"Punktspielserie"]
[null,null,null,null,null,"alle Felder sind unbedingt auszufüllen,da sonst der Spielbericht ungültig ist "]
[]
[null,null,null,null,null,"Klasse","  Herren",{"$f":"+H114","v":"B4"},"     Antritt     Nr.",{"$f":"J114","v":4},null,"Datum",{"$f":"+M114","v":"2024-10-24"},"BSG",{"$f":"+O114","v":"PAN 1"}]
[]
[null,null,null,null,null,null,"X)","Pass-Nr.","Vor-und Zuname",null,null,null,"I","II","III","Gesamt"]
[null,null,null,null,null,1,{"$f":"G117","v":0},{"$f":"+H117","v":20137},"Matthias Nolte"]
[null,null,null,null,null,2,{"$f":"G118","v":0},24775,"Deniz Hagelstein"]
[null,null,null,null,null,3,{"$f":"G119","v":0},24774,"Frank Nijholt"]
[null,null,null,null,null,4,{"$f":"G120","v":0},22113,"Michael Wetzel"]
[null,null,null,null,null,5,{"$f":"G121","v":0},0,0]
[null,null,null,null,null,"Bitte mit einem x) versehen",null,null,"     Unterschrift des Spiel-"]
[null,null,null,null,null,"wenn Ersatzspieler/in",null,null,"     partners"]
[]
[]
[]
[]
[]
[]
[]
[null,null,null,null,null," Spielbericht BOWLING"]
[null,null,null,null,null,"Betriebssportverband Hamburg e.V.",null,null,null,null,null,null,null,null,null,"Punktspielserie"]
[null,null,null,null,null,"alle Felder sind unbedingt auszufüllen,da sonst der Spielbericht ungültig ist "]
[]
[null,null,null,null,null,"Klasse","Herren",{"$f":"+H114","v":"B4"},"     Antritt     Nr.",5,null,"Datum",{"$f":"+Hilfstabelle!B9","v":"2024-11-07"},"BSG","PAN 1"]
[]
[null,null,null,null,null,null,"X)","Pass-Nr.","Vor-und Zuname",null,null,null,"I","II","III","Gesamt"]
[null,null,null,null,null,1,null,{"$f":"IF(I153>0,VLOOKUP(I153,Tabelle2[#Data],2,0),\"\")","v":24774},{"$f":"+Spielereinteilung!AL8","v":"Frank Nijholt"}]
[null,null,null,null,null,2,null,{"$f":"IF(I154>0,VLOOKUP(I154,Tabelle2[#Data],2,0),\"\")","v":22115},{"$f":"+Spielereinteilung!AL9","v":"Ilona Wetzel"}]
[null,null,null,null,null,3,null,{"$f":"IF(I155>0,VLOOKUP(I155,Tabelle2[#Data],2,0),\"\")","v":23302},{"$f":"+Spielereinteilung!AL10","v":"Mario Jurk"}]
[null,null,null,null,null,4,null,{"$f":"IF(I156>0,VLOOKUP(I156,Tabelle2[#Data],2,0),\"\")","v":21889},{"$f":"+Spielereinteilung!AL11","v":"Kai Roßberg"}]
[null,null,null,null,null,5]
[null,null,null,null,null,"Bitte mit einem x) versehen",null,null,"     Unterschrift des Spiel-"]
[null,null,null,null,null,"wenn Ersatzspieler/in",null,null,"     partners"]
[]
[null,null,null,null,null," Spielbericht BOWLING"]
[null,null,null,null,null,"Betriebssportverband Hamburg e.V.",null,null,null,null,null,null,null,null,null,"Punktspielserie"]
[null,null,null,null,null,"alle Felder sind unbedingt auszufüllen,da sonst der Spielbericht ungültig ist "]
[]
[null,null,null,null,null,"Klasse","  Herren",{"$f":"+H150","v":"B4"},"     Antritt     Nr.",{"$f":"J150","v":5},null,"Datum",{"$f":"+M150","v":"2024-11-07"},"BSG",{"$f":"+O150","v":"PAN 1"}]
[]
[null,null,null,null,null,null,"X)","Pass-Nr.","Vor-und Zuname",null,null,null,"I","II","III","Gesamt"]
[null,null,null,null,null,1,{"$f":"G153","v":0},{"$f":"+H153","v":24774},"Frank Nijholt"]
[null,null,null,null,null,2,{"$f":"G154","v":0},22115,"Ilona Wetzel"]
[null,null,null,null,null,3,{"$f":"G155","v":0},23302,"Mario Jurk"]
[null,null,null,null,null,4,{"$f":"G156","v":0},21889,"Kai Roßberg"]
[null,null,null,null,null,5,{"$f":"G157","v":0},0,0]
[null,null,null,null,null,"Bitte mit einem x) versehen",null,null,"     Unterschrift des Spiel-"]
[null,null,null,null,null,"wenn Ersatzspieler/in",null,null,"     partners"]
[]
[]
[]
[]
[]
[]
[]
[null,null,null,null,null," Spielbericht BOWLING"]
[null,null,null,null,null,"Betriebssportverband Hamburg e.V.",null,null,null,null,null,null,null,null,null,"Punktspielserie"]
[null,null,null,null,null,"alle Felder sind unbedingt auszufüllen,da sonst der Spielbericht ungültig ist "]
[]
[null,null,null,null,null,"Klasse","Herren",{"$f":"+H150","v":"B4"},"     Antritt     Nr.",6,null,"Datum",{"$f":"+Hilfstabelle!B10","v":"2025-01-16"},"BSG","PAN 1"]
[]
[null,null,null,null,null,null,"X)","Pass-Nr.","Vor-und Zuname",null,null,null,"I","II","III","Gesamt"]
[null,null,null,null,null,1,null,{"$f":"IF(I189>0,VLOOKUP(I189,Tabelle2[#Data],2,0),\"\")","v":19222},{"$f":"+Spielereinteilung!AU8","v":"Annegret Schmidt"}]
[null,null,null,null,null,2,null,{"$f":"IF(I190>0,VLOOKUP(I190,Tabelle2[#Data],2,0),\"\")","v":24774},{"$f":"+Spielereinteilung!AU9","v":"Frank Nijholt"}]
[null,null,null,null,null,3,null,{"$f":"IF(I191>0,VLOOKUP(I191,Tabelle2[#Data],2,0),\"\")","v":23302},{"$f":"+Spielereinteilung!AU10","v":"Mario Jurk"}]
[null,null,null,null,null,4,null,{"$f":"IF(I192>0,VLOOKUP(I192,Tabelle2[#Data],2,0),\"\")","v":21889},{"$f":"+Spielereinteilung!AU11","v":"Kai Roßberg"}]
[null,null,null,null,null,5]
[null,null,null,null,null,"Bitte mit einem x) versehen",null,null,"     Unterschrift des Spiel-"]
[null,null,null,null,null,"wenn Ersatzspieler/in",null,null,"     partners"]
[]
[null,null,null,null,null," Spielbericht BOWLING"]
[null,null,null,null,null,"Betriebssportverband Hamburg e.V.",null,null,null,null,null,null,null,null,null,"Punktspielserie"]
[null,null,null,null,null,"alle Felder sind unbedingt auszufüllen,da sonst der Spielbericht ungültig ist "]
[]
[null,null,null,null,null,"Klasse","  Herren",{"$f":"+H186","v":"B4"},"     Antritt     Nr.",{"$f":"J186","v":6},null,"Datum",{"$f":"+M186","v":"2025-01-16"},"BSG",{"$f":"+O186","v":"PAN 1"}]
[]
[null,null,null,null,null,null,"X)","Pass-Nr.","Vor-und Zuname",null,null,null,"I","II","III","Gesamt"]
[null,null,null,null,null,1,{"$f":"G189","v":0},{"$f":"+H189","v":19222},"Annegret Schmidt"]
[null,null,null,null,null,2,{"$f":"G190","v":0},24774,"Frank Nijholt"]
[null,null,null,null,null,3,{"$f":"G191","v":0},23302,"Mario Jurk"]
[null,null,null,null,null,4,{"$f":"G192","v":0},21889,"Kai Roßberg"]
[null,null,null,null,null,5,{"$f":"G193","v":0},0,0]
[null,null,null,null,null,"Bitte mit einem x) versehen",null,null,"     Unterschrift des Spiel-"]
[null,null,null,null,null,"wenn Ersatzspieler/in",null,null,"     partners"]
[]
[]
[]
[]
[]
[]
[]
[null,null,null,null,null," Spielbericht BOWLING"]
[null,null,null,null,null,"Betriebssportverband Hamburg e.V.",null,null,null,null,null,null,null,null,null,"Punktspielserie"]
[null,null,null,null,null,"alle Felder sind unbedingt auszufüllen,da sonst der Spielbericht ungültig ist "]
[]
[null,null,null,null,null,"Klasse","Herren",{"$f":"+H186","v":"B4"},"     Antritt     Nr.",7,null,"Datum",{"$f":"+Hilfstabelle!B11","v":"2025-01-30"},"BSG","PAN 1"]
[]
[null,null,null,null,null,null,"X)","Pass-Nr.","Vor-und Zuname",null,null,null,"I","II","III","Gesamt"]
[null,null,null,null,null,1,null,{"$f":"IF(I225>0,VLOOKUP(I225,Tabelle2[#Data],2,0),\"\")","v":19222},{"$f":"+Spielereinteilung!B24","v":"Annegret Schmidt"}]
[null,null,null,null,null,2,null,{"$f":"IF(I226>0,VLOOKUP(I226,Tabelle2[#Data],2,0),\"\")","v":24775},{"$f":"+Spielereinteilung!B25","v":"Deniz Hagelstein"}]
[null,null,null,null,null,3,null,{"$f":"IF(I227>0,VLOOKUP(I227,Tabelle2[#Data],2,0),\"\")","v":23302},{"$f":"+Spielereinteilung!B26","v":"Mario Jurk"}]
[null,null,null,null,null,4,null,{"$f":"IF(I228>0,VLOOKUP(I228,Tabelle2[#Data],2,0),\"\")","v":21889},{"$f":"+Spielereinteilung!B27","v":"Kai Roßberg"}]
[null,null,null,null,null,5]
[null,null,null,null,null,"Bitte mit einem x) versehen",null,null,"     Unterschrift des Spiel-"]
[null,null,null,null,null,"wenn Ersatzspieler/in",null,null,"     partners"]
[]
[null,null,null,null,null," Spielbericht BOWLING"]
[null,null,null,null,null,"Betriebssportverband Hamburg e.V.",null,null,null,null,null,null,null,null,null,"Punktspielserie"]
[null,null,null,null,null,"alle Felder sind unbedingt auszufüllen,da sonst der Spielbericht ungültig ist "]
[]
[null,null,null,null,null,"Klasse","  Herren",{"$f":"+H222","v":"B4"},"     Antritt     Nr.",{"$f":"J222","v":7},null,"Datum",{"$f":"+M222","v":"2025-01-30"},"BSG",{"$f":"+O222","v":"PAN 1"}]
[]
[null,null,null,null,null,null,"X)","Pass-Nr.","Vor-und Zuname",null,null,null,"I","II","III","Gesamt"]
[null,null,null,null,null,1,{"$f":"G225","v":0},{"$f":"+H225","v":19222},{"$f":"+I225","v":"Annegret Schmidt"}]
[null,null,null,null,null,2,{"$f":"G226","v":0},{"$f":"+H226","v":24775},{"$f":"+I226","v":"Deniz Hagelstein"}]
[null,null,null,null,null,3,{"$f":"G227","v":0},{"$f":"+H227","v":23302},{"$f":"+I227","v":"Mario Jurk"}]
[null,null,null,null,null,4,{"$f":"G228","v":0},{"$f":"+H228","v":21889},{"$f":"+I228","v":"Kai Roßberg"}]
[null,null,null,null,null,5,{"$f":"G229","v":0},{"$f":"+Spielberichte!H193","v":0},{"$f":"+I229","v":0}]
[null,null,null,null,null,"Bitte mit einem x) versehen",null,null,"     Unterschrift des Spiel-"]
[null,null,null,null,null,"wenn Ersatzspieler/in",null,null,"     partners"]
[]
[]
[]
[]
[]
[]
[]
[null,null,null,null,null," Spielbericht BOWLING"]
[null,null,null,null,null,"Betriebssportverband Hamburg e.V.",null,null,null,null,null,null,null,null,null,"Punktspielserie"]
[null,null,null,null,null,"alle Felder sind unbedingt auszufüllen,da sonst der Spielbericht ungültig ist "]
[]
[null,null,null,null,null,"Klasse","Herren",{"$f":"+H222","v":"B4"},"     Antritt     Nr.",8,null,"Datum",{"$f":"+Hilfstabelle!B12","v":"2025-02-13"},"BSG","PAN 1"]
[]
[null,null,null,null,null,null,"X)","Pass-Nr.","Vor-und Zuname",null,null,null,"I","II","III","Gesamt"]
[null,null,null,null,null,1,null,{"$f":"IF(I261>0,VLOOKUP(I261,Tabelle2[#Data],2,0),\"\")","v":19222},{"$f":"+Spielereinteilung!K24","v":"Annegret Schmidt"}]
[null,null,null,null,null,2,null,{"$f":"IF(I262>0,VLOOKUP(I262,Tabelle2[#Data],2,0),\"\")","v":22115},{"$f":"+Spielereinteilung!K25","v":"Ilona Wetzel"}]
[null,null,null,null,null,3,null,{"$f":"IF(I263>0,VLOOKUP(I263,Tabelle2[#Data],2,0),\"\")","v":24775},{"$f":"+Spielereinteilung!K26","v":"Deniz Hagelstein"}]
[null,null,null,null,null,4,null,{"$f":"IF(I264>0,VLOOKUP(I264,Tabelle2[#Data],2,0),\"\")","v":21889},{"$f":"+Spielereinteilung!K27","v":"Kai Roßberg"}]
[null,null,null,null,null,5]
[null,null,null,null,null,"Bitte mit einem x) versehen",null,null,"     Unterschrift des Spiel-"]
[null,null,null,null,null,"wenn Ersatzspieler/in",null,null,"     partners"]
[]
[null,null,null,null,null," Spielbericht BOWLING"]
[null,null,null,null,null,"Betriebssportverband Hamburg e.V.",null,null,null,null,null,null,null,null,null,"Punktspielserie"]
[null,null,null,null,null,"alle Felder sind unbedingt auszufüllen,da sonst der Spielbericht ungültig ist "]
[]
[null,null,null,null,null,"Klasse","  Herren",{"$f":"+H258","v":"B4"},"     Antritt     Nr.",{"$f":"J258","v":8},null,"Datum",{"$f":"+M258","v":"2025-02-13"},"BSG",{"$f":"+O258","v":"PAN 1"}]
[]
[null,null,null,null,null,null,"X)","Pass-Nr.","Vor-und Zuname",null,null,null,"I","II","III","Gesamt"]
[null,null,null,null,null,1,{"$f":"G261","v":0},{"$f":"+H261","v":19222},"Annegret Schmidt"]
[null,null,null,null,null,2,{"$f":"G262","v":0},22115,"Ilona Wetzel"]
[null,null,null,null,null,3,{"$f":"G263","v":0},24775,"Deniz Hagelstein"]
[null,null,null,null,null,4,{"$f":"G264","v":0},21889,"Kai Roßberg"]
[null,null,null,null,null,5,{"$f":"G265","v":0},0,0]
[null,null,null,null,null,"Bitte mit einem x) versehen",null,null,"     Unterschrift des Spiel-"]
[null,null,null,null,null,"wenn Ersatzspieler/in",null,null,"     partners"]
[]
[]
[]
[]
[]
[]
[]
[null,null,null,null,null," Spielbericht BOWLING"]
[null,null,null,null,null,"Betriebssportverband Hamburg e.V.",null,null,null,null,null,null,null,null,null,"Punktspielserie"]
[null,null,null,null,null,"alle Felder sind unbedingt auszufüllen,da sonst der Spielbericht ungültig ist "]
[]
[null,null,null,null,null,"Klasse","Herren",{"$f":"+H258","v":"B4"},"     Antritt     Nr.",9,null,"Datum",{"$f":"+Hilfstabelle!B13","v":"2025-02-27"},"BSG","PAN 1"]
[]
[null,null,null,null,null,null,"X)","Pass-Nr.","Vor-und Zuname",null,null,null,"I","II","III","Gesamt"]
[null,null,null,null,null,1,null,{"$f":"IF(I297>0,VLOOKUP(I297,Tabelle2[#Data],2,0),\"\")","v":19222},{"$f":"+Spielereinteilung!T24","v":"Annegret Schmidt"}]
[null,null,null,null,null,2,null,{"$f":"IF(I298>0,VLOOKUP(I298,Tabelle2[#Data],2,0),\"\")","v":19221},{"$f":"+Spielereinteilung!T25","v":"Jörg Frahm"}]
[null,null,null,null,null,3,null,{"$f":"IF(I299>0,VLOOKUP(I299,Tabelle2[#Data],2,0),\"\")","v":23302},{"$f":"+Spielereinteilung!T26","v":"Mario Jurk"}]
[null,null,null,null,null,4,null,{"$f":"IF(I300>0,VLOOKUP(I300,Tabelle2[#Data],2,0),\"\")","v":21889},{"$f":"+Spielereinteilung!T27","v":"Kai Roßberg"}]
[null,null,null,null,null,5]
[null,null,null,null,null,"Bitte mit einem x) versehen",null,null,"     Unterschrift des Spiel-"]
[null,null,null,null,null,"wenn Ersatzspieler/in",null,null,"     partners"]
[]
[null,null,null,null,null," Spielbericht BOWLING"]
[null,null,null,null,null,"Betriebssportverband Hamburg e.V.",null,null,null,null,null,null,null,null,null,"Punktspielserie"]
[null,null,null,null,null,"alle Felder sind unbedingt auszufüllen,da sonst der Spielbericht ungültig ist "]
[]
[null,null,null,null,null,"Klasse","  Herren",{"$f":"+H294","v":"B4"},"     Antritt     Nr.",{"$f":"J294","v":9},null,"Datum",{"$f":"+M294","v":"2025-02-27"},"BSG",{"$f":"+O294","v":"PAN 1"}]
[]
[null,null,null,null,null,null,"X)","Pass-Nr.","Vor-und Zuname",null,null,null,"I","II","III","Gesamt"]
[null,null,null,null,null,1,{"$f":"G297","v":0},{"$f":"+H297","v":19222},"Annegret Schmidt"]
[null,null,null,null,null,2,{"$f":"G298","v":0},19221,"Jörg Frahm"]
[null,null,null,null,null,3,{"$f":"G299","v":0},23302,"Mario Jurk"]
[null,null,null,null,null,4,{"$f":"G300","v":0},21889,"Kai Roßberg"]
[null,null,null,null,null,5,{"$f":"G301","v":0},0,0]
[null,null,null,null,null,"Bitte mit einem x) versehen",null,null,"     Unterschrift des Spiel-"]
[null,null,null,null,null,"wenn Ersatzspieler/in",null,null,"     partners"]
[]
[]
[]
[]
[]
[]
[]
[null,null,null,null,null," Spielbericht BOWLING"]
[null,null,null,null,null,"Betriebssportverband Hamburg e.V.",null,null,null,null,null,null,null,null,null,"Punktspielserie"]
[null,null,null,null,null,"alle Felder sind unbedingt auszufüllen,da sonst der Spielbericht ungültig ist "]
[]
[null,null,null,null,null,"Klasse","Herren",{"$f":"+H294","v":"B4"},"     Antritt     Nr.",10,null,"Datum",{"$f":"+Hilfstabelle!B14","v":"2025-03-13"},"BSG","PAN 1"]
[]
[null,null,null,null,null,null,"X)","Pass-Nr.","Vor-und Zuname",null,null,null,"I","II","III","Gesamt"]
[null,null,null,null,null,1,null,{"$f":"IF(I333>0,VLOOKUP(I333,Tabelle2[#Data],2,0),\"\")","v":19222},{"$f":"+Spielereinteilung!AC24","v":"Annegret Schmidt"}]
[null,null,null,null,null,2,null,{"$f":"IF(I334>0,VLOOKUP(I334,Tabelle2[#Data],2,0),\"\")","v":24774},{"$f":"+Spielereinteilung!AC25","v":"Frank Nijholt"}]
[null,null,null,null,null,3,null,{"$f":"IF(I335>0,VLOOKUP(I335,Tabelle2[#Data],2,0),\"\")","v":19221},{"$f":"+Spielereinteilung!AC26","v":"Jörg Frahm"}]
[null,null,null,null,null,4,null,{"$f":"IF(I336>0,VLOOKUP(I336,Tabelle2[#Data],2,0),\"\")","v":21889},{"$f":"+Spielereinteilung!AC27","v":"Kai Roßberg"}]
[null,null,null,null,null,5]
[null,null,null,null,null,"Bitte mit einem x) versehen",null,null,"     Unterschrift des Spiel-"]
[null,null,null,null,null,"wenn Ersatzspieler/in",null,null,"     partners"]
[]
[null,null,null,null,null," Spielbericht BOWLING"]
[null,null,null,null,null,"Betriebssportverband Hamburg e.V.",null,null,null,null,null,null,null,null,null,"Punktspielserie"]
[null,null,null,null,null,"alle Felder sind unbedingt auszufüllen,da sonst der Spielbericht ungültig ist "]
[]
[null,null,null,null,null,"Klasse","  Herren",{"$f":"+H330","v":"B4"},"     Antritt     Nr.",{"$f":"J330","v":10},null,"Datum",{"$f":"+M330","v":"2025-03-13"},"BSG",{"$f":"+O330","v":"PAN 1"}]
[]
[null,null,null,null,null,null,"X)","Pass-Nr.","Vor-und Zuname",null,null,null,"I","II","III","Gesamt"]
[null,null,null,null,null,1,{"$f":"G333","v":0},{"$f":"+H333","v":19222},"Annegret Schmidt"]
[null,null,null,null,null,2,{"$f":"G334","v":0},24774,"Frank Nijholt"]
[null,null,null,null,null,3,{"$f":"G335","v":0},19221,"Jörg Frahm"]
[null,null,null,null,null,4,{"$f":"G336","v":0},21889,"Kai Roßberg"]
[null,null,null,null,null,5,{"$f":"G337","v":0},0,0]
[null,null,null,null,null,"Bitte mit einem x) versehen",null,null,"     Unterschrift des Spiel-"]
[null,null,null,null,null,"wenn Ersatzspieler/in",null,null,"     partners"]
[]
[]
[]
[]
[]
[]
[]
[null,null,null,null,null," Spielbericht BOWLING"]
[null,null,null,null,null,"Betriebssportverband Hamburg e.V.",null,null,null,null,null,null,null,null,null,"Punktspielserie"]
[null,null,null,null,null,"alle Felder sind unbedingt auszufüllen,da sonst der Spielbericht ungültig ist "]
[]
[null,null,null,null,null,"Klasse","Herren",{"$f":"+H330","v":"B4"},"     Antritt     Nr.",11,null,"Datum",{"$f":"+Hilfstabelle!B15","v":"2025-03-27"},"BSG","PAN 1"]
[]
[null,null,null,null,null,null,"X)","Pass-Nr.","Vor-und Zuname",null,null,null,"I","II","III","Gesamt"]
[null,null,null,null,null,1,null,{"$f":"IF(I369>0,VLOOKUP(I369,Tabelle2[#Data],2,0),\"\")","v":20137},{"$f":"+Spielereinteilung!AL24","v":"Matthias Nolte"}]
[null,null,null,null,null,2,null,{"$f":"IF(I370>0,VLOOKUP(I370,Tabelle2[#Data],2,0),\"\")","v":24775},{"$f":"+Spielereinteilung!AL25","v":"Deniz Hagelstein"}]
[null,null,null,null,null,3,null,{"$f":"IF(I371>0,VLOOKUP(I371,Tabelle2[#Data],2,0),\"\")","v":19221},{"$f":"+Spielereinteilung!AL26","v":"Jörg Frahm"}]
[null,null,null,null,null,4,null,{"$f":"IF(I372>0,VLOOKUP(I372,Tabelle2[#Data],2,0),\"\")","v":21889},{"$f":"+Spielereinteilung!AL27","v":"Kai Roßberg"}]
[null,null,null,null,null,5]
[null,null,null,null,null,"Bitte mit einem x) versehen",null,null,"     Unterschrift des Spiel-"]
[null,null,null,null,null,"wenn Ersatzspieler/in",null,null,"     partners"]
[]
[null,null,null,null,null," Spielbericht BOWLING"]
[null,null,null,null,null,"Betriebssportverband Hamburg e.V.",null,null,null,null,null,null,null,null,null,"Punktspielserie"]
[null,null,null,null,null,"alle Felder sind unbedingt auszufüllen,da sonst der Spielbericht ungültig ist "]
[]
[null,null,null,null,null,"Klasse","  Herren",{"$f":"+H366","v":"B4"},"     Antritt     Nr.",{"$f":"J366","v":11},null,"Datum",{"$f":"+M366","v":"2025-03-27"},"BSG",{"$f":"+O366","v":"PAN 1"}]
[]
[null,null,null,null,null,null,"X)","Pass-Nr.","Vor-und Zuname",null,null,null,"I","II","III","Gesamt"]
[null,null,null,null,null,1,{"$f":"G369","v":0},{"$f":"+H369","v":20137},"Matthias Nolte"]
[null,null,null,null,null,2,{"$f":"G370","v":0},24775,"Deniz Hagelstein"]
[null,null,null,null,null,3,{"$f":"G371","v":0},19221,"Jörg Frahm"]
[null,null,null,null,null,4,{"$f":"G372","v":0},21889,"Kai Roßberg"]
[null,null,null,null,null,5,{"$f":"G373","v":0},0,0]
[null,null,null,null,null,"Bitte mit einem x) versehen",null,null,"     Unterschrift des Spiel-"]
[null,null,null,null,null,"wenn Ersatzspieler/in",null,null,"     partners"]
[]
[]
[]
[]
[]
[]
[]
[null,null,null,null,null," Spielbericht BOWLING"]
[null,null,null,null,null,"Betriebssportverband Hamburg e.V.",null,null,null,null,null,null,null,null,null,"Punktspielserie"]
[null,null,null,null,null,"alle Felder sind unbedingt auszufüllen,da sonst der Spielbericht ungültig ist "]
[]
[null,null,null,null,null,"Klasse","Herren",{"$f":"+H366","v":"B4"},"     Antritt     Nr.",12,null,"Datum",{"$f":"+Hilfstabelle!B16","v":"2025-04-10"},"BSG","PAN 1"]
[]
[null,null,null,null,null,null,"X)","Pass-Nr.","Vor-und Zuname",null,null,null,"I","II","III","Gesamt"]
[null,null,null,null,null,1,null,{"$f":"IF(I405>0,VLOOKUP(I405,Tabelle2[#Data],2,0),\"\")","v":24774},{"$f":"+Spielereinteilung!AU24","v":"Frank Nijholt"}]
[null,null,null,null,null,2,null,{"$f":"IF(I406>0,VLOOKUP(I406,Tabelle2[#Data],2,0),\"\")","v":24775},{"$f":"+Spielereinteilung!AU25","v":"Deniz Hagelstein"}]
[null,null,null,null,null,3,null,{"$f":"IF(I407>0,VLOOKUP(I407,Tabelle2[#Data],2,0),\"\")","v":19221},{"$f":"+Spielereinteilung!AU26","v":"Jörg Frahm"}]
[null,null,null,null,null,4,null,{"$f":"IF(I408>0,VLOOKUP(I408,Tabelle2[#Data],2,0),\"\")","v":21889},{"$f":"+Spielereinteilung!AU27","v":"Kai Roßberg"}]
[null,null,null,null,null,5]
[null,null,null,null,null,"Bitte mit einem x) versehen",null,null,"     Unterschrift des Spiel-"]
[null,null,null,null,null,"wenn Ersatzspieler/in",null,null,"     partners"]
[]
[null,null,null,null,null," Spielbericht BOWLING"]
[null,null,null,null,null,"Betriebssportverband Hamburg e.V.",null,null,null,null,null,null,null,null,null,"Punktspielserie"]
[null,null,null,null,null,"alle Felder sind unbedingt auszufüllen,da sonst der Spielbericht ungültig ist "]
[]
[null,null,null,null,null,"Klasse","  Herren",{"$f":"+H402","v":"B4"},"     Antritt     Nr.",{"$f":"J402","v":12},null,"Datum",{"$f":"+M402","v":"2025-04-10"},"BSG",{"$f":"+O402","v":"PAN 1"}]
[]
[null,null,null,null,null,null,"X)","Pass-Nr.","Vor-und Zuname",null,null,null,"I","II","III","Gesamt"]
[null,null,null,null,null,1,{"$f":"G405","v":0},{"$f":"+H405","v":24774},"Frank Nijholt"]
[null,null,null,null,null,2,{"$f":"G406","v":0},24775,"Deniz Hagelstein"]
[null,null,null,null,null,3,{"$f":"G407","v":0},19221,"Jörg Frahm"]
[null,null,null,null,null,4,{"$f":"G408","v":0},21889,"Kai Roßberg"]
[null,null,null,null,null,5,{"$f":"G409","v":0},0,0]
[null,null,null,null,null,"Bitte mit einem x) versehen",null,null,"     Unterschrift des Spiel-"]
[null,null,null,null,null,"wenn Ersatzspieler/in",null,null,"     partners"]
[]
[]
[]
[]
[]
[]
[]
[null,null,null,null,null," Spielbericht BOWLING"]
[null,null,null,null,null,"Betriebssportverband Hamburg e.V.",null,null,null,null,null,null,null,null,null,"Punktspielserie"]
[null,null,null,null,null,"alle Felder sind unbedingt auszufüllen,da sonst der Spielbericht ungültig ist "]
[]
[null,null,null,null,null,"Klasse","Herren",{"$f":"+H402","v":"B4"},"     Antritt     Nr.",13,null,"Datum",{"$f":"+Hilfstabelle!B17","v":"2025-04-24"},"BSG","PAN 1"]
[]
[null,null,null,null,null,null,"X)","Pass-Nr.","Vor-und Zuname",null,null,null,"I","II","III","Gesamt"]
[null,null,null,null,null,1,null,{"$f":"IF(I441>0,VLOOKUP(I441,Tabelle2[#Data],2,0),\"\")","v":20137},{"$f":"+Spielereinteilung!B38","v":"Matthias Nolte"}]
[null,null,null,null,null,2,null,{"$f":"IF(I442>0,VLOOKUP(I442,Tabelle2[#Data],2,0),\"\")","v":19221},{"$f":"+Spielereinteilung!B39","v":"Jörg Frahm"}]
[null,null,null,null,null,3,null,{"$f":"IF(I443>0,VLOOKUP(I443,Tabelle2[#Data],2,0),\"\")","v":22113},{"$f":"+Spielereinteilung!B40","v":"Michael Wetzel"}]
[null,null,null,null,null,4,null,{"$f":"IF(I444>0,VLOOKUP(I444,Tabelle2[#Data],2,0),\"\")","v":21889},{"$f":"+Spielereinteilung!B41","v":"Kai Roßberg"}]
[null,null,null,null,null,5]
[null,null,null,null,null,"Bitte mit einem x) versehen",null,null,"     Unterschrift des Spiel-"]
[null,null,null,null,null,"wenn Ersatzspieler/in",null,null,"     partners"]
[]
[]
[null,null,null,null,null," Spielbericht BOWLING"]
[null,null,null,null,null,"Betriebssportverband Hamburg e.V.",null,null,null,null,null,null,null,null,null,"Punktspielserie"]
[null,null,null,null,null,"alle Felder sind unbedingt auszufüllen,da sonst der Spielbericht ungültig ist "]
[]
[null,null,null,null,null,"Klasse","  Herren",{"$f":"+H438","v":"B4"},"     Antritt     Nr.",{"$f":"J438","v":13},null,"Datum",{"$f":"+M438","v":"2025-04-24"},"BSG",{"$f":"+O438","v":"PAN 1"}]
[]
[null,null,null,null,null,null,"X)","Pass-Nr.","Vor-und Zuname",null,null,null,"I","II","III","Gesamt"]
[null,null,null,null,null,1,{"$f":"G441","v":0},{"$f":"+H441","v":20137},"Matthias Nolte"]
[null,null,null,null,null,2,{"$f":"G442","v":0},19221,"Jörg Frahm"]
[null,null,null,null,null,3,{"$f":"G443","v":0},22113,"Michael Wetzel"]
[null,null,null,null,null,4,{"$f":"G444","v":0},21889,"Kai Roßberg"]
[null,null,null,null,null,5,{"$f":"G445","v":0},0,0]
[null,null,null,null,null,"Bitte mit einem x) versehen",null,null,"     Unterschrift des Spiel-"]
[null,null,null,null,null,"wenn Ersatzspieler/in",null,null,"     partners"]
[]
[]
[]
[]
[]
[]
[]
[null,null,null,null,null," Spielbericht BOWLING"]
[null,null,null,null,null,"Betriebssportverband Hamburg e.V.",null,null,null,null,null,null,null,null,null,"Punktspielserie"]
[null,null,null,null,null,"alle Felder sind unbedingt auszufüllen,da sonst der Spielbericht ungültig ist "]
[]
[null,null,null,null,null,"Klasse","Herren",{"$f":"+H438","v":"B4"},"     Antritt     Nr.",14,null,"Datum",{"$f":"+Hilfstabelle!B18","v":"2025-05-08"},"BSG","PAN 1"]
[]
[null,null,null,null,null,null,"X)","Pass-Nr.","Vor-und Zuname",null,null,null,"I","II","III","Gesamt"]
[null,null,null,null,null,1,null,{"$f":"IF(I478>0,VLOOKUP(I478,Tabelle2[#Data],2,0),\"\")","v":19222},{"$f":"+Spielereinteilung!K38","v":"Annegret Schmidt"}]
[null,null,null,null,null,2,null,{"$f":"IF(I479>0,VLOOKUP(I479,Tabelle2[#Data],2,0),\"\")","v":24775},{"$f":"+Spielereinteilung!K39","v":"Deniz Hagelstein"}]
[null,null,null,null,null,3,null,{"$f":"IF(I480>0,VLOOKUP(I480,Tabelle2[#Data],2,0),\"\")","v":23302},{"$f":"+Spielereinteilung!K40","v":"Mario Jurk"}]
[null,null,null,null,null,4,null,{"$f":"IF(I481>0,VLOOKUP(I481,Tabelle2[#Data],2,0),\"\")","v":21889},{"$f":"+Spielereinteilung!K41","v":"Kai Roßberg"}]
[null,null,null,null,null,5]
[null,null,null,null,null,"Bitte mit einem x) versehen",null,null,"     Unterschrift des Spiel-"]
[null,null,null,null,null,"wenn Ersatzspieler/in",null,null,"     partners"]
[]
[]
[null,null,null,null,null," Spielbericht BOWLING"]
[null,null,null,null,null,"Betriebssportverband Hamburg e.V.",null,null,null,null,null,null,null,null,null,"Punktspielserie"]
[null,null,null,null,null,"alle Felder sind unbedingt auszufüllen,da sonst der Spielbericht ungültig ist "]
[]
[null,null,null,null,null,"Klasse","  Herren",{"$f":"+H475","v":"B4"},"     Antritt     Nr.",{"$f":"J475","v":14},null,"Datum",{"$f":"+M475","v":"2025-05-08"},"BSG",{"$f":"+O475","v":"PAN 1"}]
[]
[null,null,null,null,null,null,"X)","Pass-Nr.","Vor-und Zuname",null,null,null,"I","II","III","Gesamt"]
[null,null,null,null,null,1,{"$f":"G478","v":0},{"$f":"+H478","v":19222},"Annegret Schmidt"]
[null,null,null,null,null,2,{"$f":"G479","v":0},24775,"Deniz Hagelstein"]
[null,null,null,null,null,3,{"$f":"G480","v":0},23302,"Mario Jurk"]
[null,null,null,null,null,4,{"$f":"G481","v":0},21889,"Kai Roßberg"]
[null,null,null,null,null,5,{"$f":"G482","v":0},0,0]
[null,null,null,null,null,"Bitte mit einem x) versehen",null,null,"     Unterschrift des Spiel-"]
[null,null,null,null,null,"wenn Ersatzspieler/in",null,null,"     partners"]

{"sheet":"Spielereinteilung","index":21,"n_rows":63,"n_cols":201,"rows_kept":63,"cut":false,"hidden":false,"merged":[[50,28,50,30],[50,31,50,33],[50,34,50,36],[50,37,50,39],[50,40,50,42],[50,1,50,3],[50,4,50,6],[50,7,50,9],[50,10,50,12],[50,13,50,15],[50,16,50,18],[50,19,50,21],[50,22,50,24],[50,25,50,27],[0,186,0,192],[5,37,5,44],[5,194,5,196],[27,37,27,44],[0,1,0,11],[1,1,1,11],[42,178,42,180],[42,182,42,184],[43,178,43,180],[43,182,43,184],[4,194,4,195],[11,194,11,196],[12,194,12,196],[25,194,25,196],[26,194,26,196],[37,182,37,184],[37,187,37,189],[38,178,38,180],[38,182,38,184],[38,187,38,189],[32,178,32,180],[32,182,32,184],[32,186,32,188],[32,190,32,192],[40,193,40,194],[41,193,41,194],[42,193,42,194],[43,193,43,194],[44,193,44,194],[45,193,45,194],[45,187,45,189],[35,178,35,180],[35,182,35,184],[35,187,35,192],[37,178,37,180],[27,194,27,196],[28,194,28,196],[28,198,28,200],[29,194,29,196],[29,198,29,200],[30,194,30,196],[37,193,37,194],[38,193,38,194],[39,193,39,194],[4,198,4,199],[5,198,5,200],[7,194,7,196],[7,198,7,200],[8,194,8,196],[8,198,8,200],[9,194,9,196],[9,198,9,200],[10,194,10,196],[10,198,10,200],[12,198,12,200],[13,194,13,196],[13,198,13,200],[32,198,32,200],[24,198,24,200],[25,198,25,200],[26,198,26,200],[21,198,21,200],[23,198,23,200],[30,198,30,200],[31,194,31,196],[31,198,31,200],[14,194,14,196],[14,198,14,200],[15,194,15,196],[15,198,15,200],[16,194,16,196],[16,198,16,200],[20,194,20,195],[20,198,20,199],[32,194,32,196],[21,194,21,196],[23,194,23,196],[24,194,24,196],[46,178,46,180],[46,182,46,184],[42,187,42,189],[43,187,43,189],[44,187,44,189],[39,178,39,180],[39,182,39,184],[39,187,39,189],[40,178,40,180],[40,182,40,184],[40,187,40,189],[41,187,41,189],[44,178,44,180],[44,182,44,184],[45,178,45,180],[45,182,45,184],[34,178,34,179],[34,182,34,183],[34,187,34,192],[29,178,29,180],[29,182,29,184],[29,186,29,188],[29,190,29,192],[30,178,30,180],[30,182,30,184],[30,186,30,188],[30,190,30,192],[31,178,31,180],[31,182,31,184],[31,186,31,188],[31,190,31,192],[25,178,25,180],[25,182,25,184],[25,186,25,188],[25,190,25,192],[26,178,26,180],[26,182,26,184],[26,186,26,188],[26,190,26,192],[28,178,28,180],[28,182,28,184],[28,186,28,188],[28,190,28,192],[21,178,21,180],[21,182,21,184],[21,186,21,188],[21,190,21,192],[23,178,23,180],[23,182,23,184],[23,186,23,188],[23,190,23,192],[24,178,24,180],[24,182,24,184],[24,186,24,188],[24,190,24,192],[18,186,19,192],[20,178,20,179],[20,182,20,183],[20,186,20,187],[20,190,20,191],[14,178,14,180],[14,182,14,184],[14,186,14,188],[14,190,14,192],[15,178,15,180],[15,182,15,184],[15,186,15,188],[15,190,15,192],[16,178,16,180],[16,182,16,184],[16,186,16,188],[16,190,16,192],[10,178,10,180],[10,182,10,184],[10,186,10,188],[10,190,10,192],[12,178,12,180],[12,182,12,184],[12,186,12,188],[12,190,12,192],[13,178,13,180],[13,182,13,184],[13,186,13,188],[13,190,13,192],[7,178,7,180],[7,182,7,184],[7,186,7,188],[7,190,7,192],[8,178,8,180],[8,182,8,184],[8,186,8,188],[8,190,8,192],[9,178,9,180],[9,182,9,184],[9,186,9,188],[9,190,9,192],[2,186,3,192],[4,178,4,179],[4,182,4,183],[4,186,4,187],[4,190,4,191],[5,178,5,180],[5,182,5,184],[5,186,5,188],[5,190,5,192],[10,37,10,44],[23,37,23,44],[7,37,7,44],[8,37,8,44],[9,37,9,44],[4,46,4,47],[12,46,12,53],[5,46,5,53],[22,41,22,44],[22,50,22,53],[6,50,6,53],[6,41,6,44],[21,37,21,44],[46,1,46,8],[46,10,46,17],[35,20,35,35],[36,28,36,29],[37,28,37,29],[38,28,38,29],[39,28,39,29],[39,1,39,8],[39,10,39,17],[37,1,37,8],[37,10,37,17],[38,1,38,8],[38,10,38,17],[35,1,35,8],[35,10,35,17],[38,20,38,25],[39,20,39,25],[40,20,40,25],[41,20,41,25],[40,1,40,8],[36,14,36,17],[36,5,36,8],[42,26,42,27],[43,26,43,27],[13,28,13,35],[14,37,14,44],[15,37,15,44],[16,37,16,44],[36,45,36,47],[24,37,24,44],[25,37,25,44],[26,37,26,44],[32,28,32,35],[34,20,34,35],[32,46,32,53],[29,37,29,44],[30,37,30,44],[31,37,31,44],[32,37,32,44],[29,28,29,35],[29,46,29,53],[31,46,31,53],[24,46,24,53],[25,46,25,53],[26,46,26,53],[30,46,30,53],[28,46,28,53],[25,28,25,35],[24,1,24,8],[25,1,25,8],[30,1,30,8],[28,37,28,44],[14,28,14,35],[14,46,14,53],[13,1,13,8],[14,10,14,17],[20,1,20,2],[20,10,20,11],[20,19,20,20],[20,28,20,29],[20,46,20,47],[15,46,15,53],[16,1,16,8],[16,10,16,17],[16,19,16,26],[16,28,16,35],[13,46,13,53],[16,46,16,53],[15,28,15,35],[18,19,19,35],[23,28,23,35],[25,19,25,26],[21,10,21,17],[25,10,25,17],[23,10,23,17],[24,10,24,17],[23,19,23,26],[22,32,22,35],[22,14,22,17],[22,23,22,26],[24,19,24,26],[24,28,24,35],[4,1,4,2],[4,10,4,11],[4,19,4,20],[21,1,21,8],[21,19,21,26],[21,28,21,35],[21,46,21,53],[23,46,23,53],[23,1,23,8],[7,46,7,53],[8,46,8,53],[9,46,9,53],[10,46,10,53],[10,19,10,26],[7,28,7,35],[8,28,8,35],[9,28,9,35],[10,28,10,35],[15,10,15,17],[4,37,4,38],[20,37,20,38],[12,37,12,44],[13,37,13,44],[22,5,22,8],[2,19,3,35],[5,1,5,8],[5,10,5,17],[5,19,5,26],[5,28,5,35],[12,1,12,8],[12,10,12,17],[12,19,12,26],[12,28,12,35],[8,10,8,17],[9,10,9,17],[10,10,10,17],[7,10,7,17],[4,28,4,29],[7,19,7,26],[8,19,8,26],[9,19,9,26],[9,1,9,8],[10,1,10,8],[7,1,7,8],[8,1,8,8],[6,32,6,35],[6,5,6,8],[6,14,6,17],[6,23,6,26],[37,20,37,25],[29,1,29,8],[29,10,29,17],[29,19,29,26],[32,19,32,26],[32,1,32,8],[32,10,32,17],[28,1,28,8],[28,10,28,17],[28,19,28,26],[13,19,13,26],[31,1,31,8],[31,10,31,17],[31,19,31,26],[26,10,26,17],[14,1,14,8],[13,10,13,17],[14,19,14,26],[26,1,26,8],[30,10,30,17],[30,19,30,26],[15,1,15,8],[15,19,15,26],[44,26,44,27],[45,26,45,27],[40,10,40,17],[26,19,26,26],[26,28,26,35],[34,1,34,2],[34,10,34,11],[40,28,40,29],[28,28,28,35],[31,28,31,35],[41,1,41,8],[42,10,42,17],[43,1,43,8],[43,10,43,17],[44,1,44,8],[44,10,44,17],[45,1,45,8],[45,10,45,17],[40,26,40,27],[41,26,41,27],[30,28,30,35],[45,28,45,29],[37,26,37,27],[38,26,38,27],[53,40,53,42],[42,20,42,25],[43,20,43,25],[44,20,44,25],[45,20,45,25],[36,26,36,27],[52,1,52,3],[51,1,51,3],[51,4,51,6],[51,7,51,9],[51,10,51,12],[51,13,51,15],[51,16,51,18],[51,19,51,21],[51,22,51,24],[45,30,45,31],[36,30,36,31],[37,30,37,31],[38,30,38,31],[39,30,39,31],[40,30,40,31],[41,30,41,31],[42,30,42,31],[43,30,43,31],[51,40,51,42],[53,1,53,3],[53,4,53,6],[53,7,53,9],[53,10,53,12],[53,13,53,15],[53,16,53,18],[53,19,53,21],[53,22,53,24],[53,25,53,27],[52,4,52,6],[52,7,52,9],[52,10,52,12],[52,13,52,15],[52,16,52,18],[52,19,52,21],[52,22,52,24],[52,25,52,27],[52,28,52,30],[52,31,52,33],[52,34,52,36],[52,37,52,39],[52,40,52,42],[53,28,53,30],[51,25,51,27],[51,28,51,30],[51,31,51,33],[51,34,51,36],[51,37,51,39],[53,31,53,33],[53,34,53,36],[53,37,53,39],[54,28,54,30],[54,31,54,33],[54,34,54,36],[54,37,54,39],[54,40,54,42],[55,1,55,3],[55,4,55,6],[55,7,55,9],[55,10,55,12],[55,13,55,15],[55,16,55,18],[55,19,55,21],[55,22,55,24],[55,25,55,27],[55,28,55,30],[55,31,55,33],[55,34,55,36],[55,37,55,39],[55,40,55,42],[54,1,54,3],[54,4,54,6],[54,7,54,9],[54,10,54,12],[54,13,54,15],[54,16,54,18],[54,19,54,21],[54,22,54,24],[54,25,54,27],[56,28,56,30],[56,31,56,33],[56,34,56,36],[56,37,56,39],[56,40,56,42],[56,1,56,3],[56,4,56,6],[56,7,56,9],[56,10,56,12],[56,13,56,15],[56,16,56,18],[56,19,56,21],[56,22,56,24],[56,25,56,27],[57,19,57,21],[57,22,57,24],[57,25,57,27],[57,28,57,30],[59,1,59,3],[59,4,59,6],[59,7,59,9],[59,10,59,12],[59,13,59,15],[59,16,59,18],[59,19,59,21],[59,22,59,24],[57,31,57,33],[57,34,57,36],[57,37,57,39],[57,40,57,42],[58,1,58,3],[58,4,58,6],[58,7,58,9],[58,10,58,12],[58,13,58,15],[58,16,58,18],[58,19,58,21],[58,22,58,24],[58,25,58,27],[58,28,58,30],[58,31,58,33],[58,34,58,36],[58,37,58,39],[58,40,58,42],[57,1,57,3],[57,4,57,6],[57,7,57,9],[57,10,57,12],[57,13,57,15],[57,16,57,18],[61,13,61,15],[59,40,59,42],[60,1,60,3],[60,4,60,6],[60,7,60,9],[60,10,60,12],[60,13,60,15],[60,16,60,18],[60,19,60,21],[60,22,60,24],[60,25,60,27],[60,28,60,30],[60,31,60,33],[60,34,60,36],[60,37,60,39],[60,40,60,42],[59,25,59,27],[59,28,59,30],[59,31,59,33],[59,34,59,36],[59,37,59,39],[44,28,44,29],[61,28,61,30],[61,31,61,33],[61,34,61,36],[61,37,61,39],[61,40,61,42],[62,1,62,3],[62,4,62,6],[62,7,62,9],[62,10,62,12],[62,13,62,15],[62,16,62,18],[62,19,62,21],[62,22,62,24],[62,25,62,27],[62,28,62,30],[62,31,62,33],[62,34,62,36],[62,37,62,39],[62,40,62,42],[61,1,61,3],[61,4,61,6],[61,7,61,9],[61,10,61,12],[39,26,39,27],[61,16,61,18],[61,19,61,21],[61,22,61,24],[61,25,61,27],[64,25,64,27],[49,10,49,12],[0,13,1,16],[0,19,0,35],[48,13,49,30],[36,32,36,35],[37,32,37,35],[38,32,38,35],[39,32,39,35],[40,32,40,35],[41,32,41,35],[42,32,42,35],[43,32,43,35],[44,32,44,35],[45,32,45,35],[44,30,44,31],[41,28,41,29],[42,28,42,29],[43,28,43,29]]}
["Start","Ausdruck im DIN A4 format",null,null,null,null,null,null,null,null,null,null,null,"Übersicht",null,null,null,null,null,{"$f":"+\"Spielplan  1. Mannschaft, Saison \"&+Hilfstabelle!D5","v":"Spielplan  1. Mannschaft, Saison 2024/2025"},null,null,null,null,null,null,null,null,null,null,null,null,null,null,null,null,null,null,null,null,null,null,null,null,null,null,null,null,null,null,null,null,null,null,null,null,null,null,null,null,null,null,null,null,null,null,null,null,null,null,null,null,null,null,null,null,null,null,null,null,null,null,null,null,null,null,null,null,null,null,null,null,null,null,null,null,null,null,null,null,null,null,null,null,null,null,null,null,null,null,null,null,null,null,null,null,null,null,null,null,null,null,null,null,null,null,null,null,null,null,null,null,null,null,null,null,null,null,null,null,null,null,null,null,null,null,null,null,null,null,null,null,null,null,null,null,null,null,null,null,null,null,null,null,null,null,null,null,null,null,null,null,null,null,null,null,null,null,null,null,{"$f":"+I1","v":0},{"$f":"+J1","v":0},{"$f":"+K1","v":0},{"$f":"+L1","v":0},{"$f":"+R1","v":0},{"$f":"+S1","v":0},{"$f":"+T1","v":"Spielplan  1. Mannschaft, Saison 2024/2025"},null,null,null,null,null,null,{"$f":"+AK1","v":0},0,0,{"$f":"+AS1","v":0},0,0,0,{"$f":"+BB1","v":0}]
["Rangliste"," ist im Druckbereich voreingestellt.",null,null,null,null,null,null,null,null,null,null,null,null,null,null,null,null,null,null,null,null,null,null,null,null,null,null,null,null,null,null,null,null,null,null,null,null,null,null,null,null,null,null,null,null,null,null,null,null,null,null,null,null,null,null,null,null,null,null,null,null,null,null,null,null,null,null,null,null,null,null,null,null,null,null,null,null,null,null,null,null,null,null,null,null,null,null,null,null,null,null,null,null,null,null,null,null,null,null,null,null,null,null,null,null,null,null,null,null,null,null,null,null,null,null,null,null,null,null,null,null,null,null,null,null,null,null,null,null,null,null,null,null,null,null,null,null,null,null,null,null,null,null,null,null,null,null,null,null,null,null,null,null,null,null,null,null,null,null,null,null,null,null,null,null,null,null,null,null,null,null,null,null,null,null,null,null,null,{"$f":"+C2","v":0},0,0,0,0,0,0,0,{"$f":"+U2","v":0},{"$f":"+AA2","v":0},{"$f":"+AB2","v":0},{"$f":"+AC2","v":0},{"$f":"+AD2","v":0},{"$f":"+AJ2","v":0},0,0,0,0,0,0,0,0]
[null,null,null,null,null,null,null,null,null,null,null,null,null,null,null,null,null,null,null,2024,null,null,null,null,null,null,null,null,null,null,null,null,null,null,null,null,null,null,null,null,null,null,null,null,null,null,null,null,null,null,null,null,null,null,null,null,null,null,null,null,null,null,null,null,null,null,null,null,null,null,null,null,null,null,null,null,null,null,null,null,null,null,null,null,null,null,null,null,null,null,null,null,null,null,null,null,null,null,null,null,null,null,null,null,null,null,null,null,null,null,null,null,null,null,null,null,null,null,null,null,null,null,null,null,null,null,null,null,null,null,null,null,null,null,null,null,null,null,null,null,null,null,null,null,null,null,null,null,null,null,null,null,null,null,null,null,null,null,null,null,null,null,null,null,null,null,null,null,null,null,null,null,null,null,null,null,null,null,{"$f":"+B3","v":0},0,0,0,0,0,0,0,2024,0,0,0,0,0,0,0,0,0,0,0,0,0,0]
[null,null,null,null,null,null,null,null,null,null,null,null,null,null,null,null,null,null,null,null,null,null,null,null,null,null,null,null,null,null,null,null,null,null,null,null,null,null,null,null,null,null,null,null,null,null,null,null,null,null,null,null,null,null,null,null,null,null,null,null,null,null,null,null,null,null,null,null,null,null,null,null,null,null,null,null,null,null,null,null,null,null,null,null,null,null,null,null,null,null,null,null,null,null,null,null,null,null,null,null,null,null,null,null,null,null,null,null,null,null,null,null,null,null,null,null,null,null,null,null,null,null,null,null,null,null,null,null,null,null,null,null,null,null,null,null,null,null,null,null,null,null,null,null,null,null,null,null,null,null,null,null,null,null,null,null,null,null,null,null,null,null,null,null,null,null,null,null,null,null,null,null,null,null,null,null,null,{"$f":"+A4","v":0},0,0,0,0,0,0,0,0,0,0,0,0,0,0,0,0,0,0,0,0,0,0,0]
[null,"Kürzel:",null,null,null,null,null,null,{"$f":"VLOOKUP(F7,Hilfstabelle!$R$5:$S$18,2,0)","v":"OT"},null,"Kürzel:",null,null,null,null,null,null,{"$f":"VLOOKUP(O7,Hilfstabelle!$R$5:$S$18,2,0)","v":"OT"},null,"Kürzel:",null,null,null,null,null,null,{"$f":"VLOOKUP(X7,Hilfstabelle!$R$5:$S$18,2,0)","v":"WB"},null,"Kürzel:",null,null,null,null,null,null,{"$f":"VLOOKUP(AG7,Hilfstabelle!$R$5:$S$18,2,0)","v":"OT"},null,"Kürzel:",null,null,null,null,null,null,{"$f":"VLOOKUP(AP7,Hilfstabelle!$R$5:$S$18,2,0)","v":"WB"},null,"Kürzel:",null,null,null,null,null,null,{"$f":"VLOOKUP(AY7,Hilfstabelle!$R$5:$S$18,2,0)","v":"WB"},null,null,null,null,null,null,null,null,null,null,null,null,null,null,null,null,null,null,null,null,null,null,null,null,null,null,null,null,null,null,null,null,null,null,null,null,null,null,null,null,null,null,null,null,null,null,null,null,null,null,null,null,null,null,null,null,null,null,null,null,null,null,null,null,null,null,null,null,null,null,null,null,null,null,null,null,null,null,null,null,null,null,null,null,null,null,null,null,null,null,null,null,null,null,null,null,null,null,null,null,null,null,null,null,null,null,null,null,null,null,null,null,null,null,null,null,null,null,null,null,null,null,null,0,"Kürzel:",0,"OT",0,"Kürzel:",0,"OT",0,"Kürzel:",0,"WB",0,"Kürzel:",0,"OT",0,"Kürzel:",0,"WB",0,"Kürzel:",0,"WB"]
[null,{"$f":"+\"Bahn:    \"&VLOOKUP(F7,Hilfstabelle!$B$5:$C$18,2,0)","v":"Bahn:    Othmarschen"},null,null,null,null,null,null,null,null,{"$f":"+\"Bahn:    \"&VLOOKUP(O7,Hilfstabelle!$B$5:$C$18,2,0)","v":"Bahn:    Othmarschen"},null,null,null,null,null,null,null,null,{"$f":"+\"Bahn:    \"&VLOOKUP(X7,Hilfstabelle!$B$5:$C$18,2,0)","v":"Bahn:    Wandsbek"},null,null,null,null,null,null,null,null,{"$f":"+\"Bahn:    \"&VLOOKUP(AG7,Hilfstabelle!$B$5:$C$18,2,0)","v":"Bahn:    Othmarschen"},null,null,null,null,null,null,null,null,{"$f":"+\"Bahn:    \"&VLOOKUP(AP7,Hilfstabelle!$B$5:$C$18,2,0)","v":"Bahn:    Wandsbek"},null,null,null,null,null,null,null,null,{"$f":"+\"Bahn:    \"&VLOOKUP(AY7,Hilfstabelle!$B$5:$C$18,2,0)","v":"Bahn:    Wandsbek"},null,null,null,null,null,null,null,null,null,null,null,null,null,null,null,null,null,null,null,null,null,null,null,null,null,null,null,null,null,null,null,null,null,null,null,null,null,null,null,null,null,null,null,null,null,null,null,null,null,null,null,null,null,null,null,null,null,null,null,null,null,null,null,null,null,null,null,null,null,null,null,null,null,null,null,null,null,null,null,null,null,null,null,null,null,null,null,null,null,null,null,null,null,null,null,null,null,null,null,null,null,null,null,null,null,null,null,null,null,null,null,null,null,null,null,null,null,null,null,null,null,null,null,null,null,null,null,null,null,null,0,"Bahn:    Othmarschen",0,0,0,"Bahn:    Othmarschen",0,0,0,"Bahn:    Wandsbek",0,0,0,"Bahn:    Othmarschen",0,0,{"$f":"+AK6","v":0},"Bahn:    Wandsbek",null,null,{"$f":"+AT6","v":0},"Bahn:    Wandsbek",0,{"$f":"+BB6","v":0}]
[null,"1.","Antritt",null,null,{"$f":"VLOOKUP(B7,Hilfstabelle!$A$5:$B$18,2,0)","v":"2024-09-12"},null,null,null,null,"2.","Antritt",null,null,{"$f":"VLOOKUP(K7,Hilfstabelle!$A$5:$B$18,2,0)","v":"2024-09-26"},null,null,null,null,"3.","Antritt",null,null,{"$f":"VLOOKUP(T7,Hilfstabelle!$A$5:$B$18,2,0)","v":"2024-10-10"},null,null,null,null,"4.","Antritt",null,null,{"$f":"VLOOKUP(AC7,Hilfstabelle!$A$5:$B$18,2,0)","v":"2024-10-24"},null,null,null,null,"5.","Antritt",null,null,{"$f":"VLOOKUP(AL7,Hilfstabelle!$A$5:$B$18,2,0)","v":"2024-11-07"},null,null,null,null,"6.","Antritt",null,null,{"$f":"VLOOKUP(AU7,Hilfstabelle!$A$5:$B$18,2,0)","v":"2025-01-16"},null,null,null,null,null,null,null,null,null,null,null,null,null,null,null,null,null,null,null,null,null,null,null,null,null,null,null,null,null,null,null,null,null,null,null,null,null,null,null,null,null,null,null,null,null,null,null,null,null,null,null,null,null,null,null,null,null,null,null,null,null,null,null,null,null,null,null,null,null,null,null,null,null,null,null,null,null,null,null,null,null,null,null,null,null,null,null,null,null,null,null,null,null,null,null,null,null,null,null,null,null,null,null,null,null,null,null,null,null,null,null,null,null,null,null,null,null,null,null,null,null,null,null,null,null,null,0,"1.","Antritt",{"$f":"+F7","v":"2024-09-12"},0,"2.","Antritt",{"$f":"+O7","v":"2024-09-26"},0,"3.","Antritt",{"$f":"+X7","v":"2024-10-10"},0,"4.","Antritt",{"$f":"+AG7","v":"2024-10-24"},0,"5.",{"$f":"+AM7","v":"Antritt"},{"$f":"+AP7","v":"2024-11-07"},0,"6.","Antritt",{"$f":"+AY7","v":"2025-01-16"}]
[null,"Annegret Schmidt",null,null,null,null,null,null,null,null,"Matthias Nolte",null,null,null,null,null,null,null,null,"Ilona Wetzel",null,null,null,null,null,null,null,null,"Matthias Nolte",null,null,null,null,null,null,null,null,"Frank Nijholt",null,null,null,null,null,null,null,null,"Annegret Schmidt",null,null,null,null,null,null,null,null,null,null,null,null,null,null,null,null,null,null,null,null,null,null,null,null,null,null,null,null,null,null,null,null,null,null,null,null,null,null,null,null,null,null,null,null,null,null,null,null,null,null,null,null,null,null,null,null,null,null,null,null,null,null,null,null,null,null,null,null,null,null,null,null,null,null,null,null,null,null,null,null,null,null,null,null,null,null,null,null,null,null,null,null,null,null,null,null,null,null,null,null,null,null,null,null,null,null,null,null,null,null,null,null,null,null,null,null,null,null,null,null,null,null,null,null,null,null,null,null,null,null,0,"Annegret Schmidt",0,0,0,"Matthias Nolte",0,0,0,"Ilona Wetzel",0,0,0,"Matthias Nolte",0,0,0,"Frank Nijholt",{"$f":"+AM8","v":0},{"$f":"+AS8","v":0},0,"Annegret Schmidt",0,0]
[null,"Ilona Wetzel",null,null,null,null,null,null,null,null,"Deniz Hagelstein",null,null,null,null,null,null,null,null,"Annegret Schmidt",null,null,null,null,null,null,null,null,"Deniz Hagelstein",null,null,null,null,null,null,null,null,"Ilona Wetzel",null,null,null,null,null,null,null,null,"Frank Nijholt",null,null,null,null,null,null,null,null,null,null,null,null,null,null,null,null,null,null,null,null,null,null,null,null,null,null,null,null,null,null,null,null,null,null,null,null,null,null,null,null,null,null,null,null,null,null,null,null,null,null,null,null,null,null,null,null,null,null,null,null,null,null,null,null,null,null,null,null,null,null,null,null,null,null,null,null,null,null,null,null,null,null,null,null,null,null,null,null,null,null,null,null,null,null,null,null,null,null,null,null,null,null,null,null,null,null,null,null,null,null,null,null,null,null,null,null,null,null,null,null,null,null,null,null,null,null,null,null,null,null,0,"Ilona Wetzel",0,0,0,"Deniz Hagelstein",0,0,0,"Annegret Schmidt",0,0,0,"Deniz Hagelstein",0,0,0,"Ilona Wetzel",{"$f":"+AM9","v":0},{"$f":"+AS9","v":0},0,"Frank Nijholt",0,0]
[null,"Michael Wetzel",null,null,null,null,null,null,null,null,"Mario Jurk",null,null,null,null,null,null,null,null,"Michael Wetzel",null,null,null,null,null,null,null,null,"Frank Nijholt",null,null,null,null,null,null,null,null,"Mario Jurk",null,null,null,null,null,null,null,null,"Mario Jurk",null,null,null,null,null,null,null,null,null,null,null,null,null,null,null,null,null,null,null,null,null,null,null,null,null,null,null,null,null,null,null,null,null,null,null,null,null,null,null,null,null,null,null,null,null,null,null,null,null,null,null,null,null,null,null,null,null,null,null,null,null,null,null,null,null,null,null,null,null,null,null,null,null,null,null,null,null,null,null,null,null,null,null,null,null,null,null,null,null,null,null,null,null,null,null,null,null,null,null,null,null,null,null,null,null,null,null,null,null,null,null,null,null,null,null,null,null,null,null,null,null,null,null,null,null,null,null,null,null,null,0,"Michael Wetzel",0,0,0,"Mario Jurk",0,0,0,"Michael Wetzel",0,0,0,"Frank Nijholt",0,0,0,"Mario Jurk",{"$f":"+AM10","v":0},{"$f":"+AS10","v":0},0,"Mario Jurk",0,0]
[null,"Kai Roßberg",null,null,null,null,null,null,null,null,"Kai Roßberg",null,null,null,null,null,null,null,null,"Kai Roßberg",null,null,null,null,null,null,null,null,"Michael Wetzel",null,null,null,null,null,null,null,null,"Kai Roßberg",null,null,null,null,null,null,null,null,"Kai Roßberg",null,null,null,null,null,null,null,null,null,null,null,null,null,null,null,null,null,null,null,null,null,null,null,null,null,null,null,null,null,null,null,null,null,null,null,null,null,null,null,null,null,null,null,null,null,null,null,null,null,null,null,null,null,null,null,null,null,null,null,null,null,null,null,null,null,null,null,null,null,null,null,null,null,null,null,null,null,null,null,null,null,null,null,null,null,null,null,null,null,null,null,null,null,null,null,null,null,null,null,null,null,null,null,null,null,null,null,null,null,null,null,null,null,null,null,null,null,null,null,null,null,null,null,null,null,null,null,null,null,null,0,"Kai Roßberg",0,0,0,"Kai Roßberg",0,0,0,"Kai Roßberg",0,0,0,"Michael Wetzel",0,0,0,"Kai Roßberg",{"$f":"+AM11","v":0},{"$f":"+AS11","v":0},0,"Kai Roßberg",0,0]
[null,null,null,null,null,null,null,null,null,null,null,null,null,null,null,null,null,null,null,null,null,null,null,null,null,null,null,null,null,null,null,null,null,null,null,null,null,null,null,null,null,null,null,null,null,null,null,null,null,null,null,null,null,null,null,null,null,null,null,null,null,null,null,null,null,null,null,null,null,null,null,null,null,null,null,null,null,null,null,null,null,null,null,null,null,null,null,null,null,null,null,null,null,null,null,null,null,null,null,null,null,null,null,null,null,null,null,null,null,null,null,null,null,null,null,null,null,null,null,null,null,null,null,null,null,null,null,null,null,null,null,null,null,null,null,null,null,null,null,null,null,null,null,null,null,null,null,null,null,null,null,null,null,null,null,null,null,null,null,null,null,null,null,null,null,null,null,null,null,null,null,null,null,null,null,null,null,0]
["1. Resere","Michael Wetzel",null,null,null,null,null,null,null,null,"Michael Wetzel",null,null,null,null,null,null,null,null,"Matthias Nolte",null,null,null,null,null,null,null,null,"Ilona Wetzel",null,null,null,null,null,null,null,null,"Annegret Schmidt",null,null,null,null,null,null,null,null,"Ilona Wetzel",null,null,null,null,null,null,null,null,null,null,null,null,null,null,null,null,null,null,null,null,null,null,null,null,null,null,null,null,null,null,null,null,null,null,null,null,null,null,null,null,null,null,null,null,null,null,null,null,null,null,null,null,null,null,null,null,null,null,null,null,null,null,null,null,null,null,null,null,null,null,null,null,null,null,null,null,null,null,null,null,null,null,null,null,null,null,null,null,null,null,null,null,null,null,null,null,null,null,null,null,null,null,null,null,null,null,null,null,null,null,null,null,null,null,null,null,null,null,null,null,null,null,null,null,null,null,null,null,null,null,"1. Resere",{"$f":"+B13","v":"Michael Wetzel"},{"$f":"+C13","v":0},{"$f":"+I13","v":0},{"$f":"+J13","v":0},{"$f":"+K13","v":"Michael Wetzel"},{"$f":"+L13","v":0},{"$f":"+R13","v":0},{"$f":"+S13","v":0},{"$f":"+T13","v":"Matthias Nolte"},{"$f":"+U13","v":0},{"$f":"+AA13","v":0},{"$f":"+AB13","v":0},{"$f":"+AC13","v":"Ilona Wetzel"},{"$f":"+AD13","v":0},{"$f":"+AJ13","v":0},{"$f":"+AK13","v":0},{"$f":"+AL13","v":"Annegret Schmidt"},{"$f":"+AM13","v":0},{"$f":"+AS13","v":0},{"$f":"+AT13","v":0},{"$f":"+AU13","v":"Ilona Wetzel"},{"$f":"+AV13","v":0},{"$f":"+BB13","v":0}]
["2. Resere","Mario Jurk",null,null,null,null,null,null,null,null,"Frank Nijholt",null,null,null,null,null,null,null,null,"Mario Jurk",null,null,null,null,null,null,null,null,"Annegret Schmidt",null,null,null,null,null,null,null,null,"Deniz Hagelstein",null,null,null,null,null,null,null,null,"Deniz Hagelstein",null,null,null,null,null,null,null,null,null,null,null,null,null,null,null,null,null,null,null,null,null,null,null,null,null,null,null,null,null,null,null,null,null,null,null,null,null,null,null,null,null,null,null,null,null,null,null,null,null,null,null,null,null,null,null,null,null,null,null,null,null,null,null,null,null,null,null,null,null,null,null,null,null,null,null,null,null,null,null,null,null,null,null,null,null,null,null,null,null,null,null,null,null,null,null,null,null,null,null,null,null,null,null,null,null,null,null,null,null,null,null,null,null,null,null,null,null,null,null,null,null,null,null,null,null,null,null,null,null,null,"2. Resere","Mario Jurk",0,0,0,{"$f":"+K14","v":"Frank Nijholt"},{"$f":"+L14","v":0},{"$f":"+R14","v":0},0,"Mario Jurk",0,0,0,"Annegret Schmidt",0,0,0,"Deniz Hagelstein",0,0,0,"Deniz Hagelstein",0,0]
["3. Resere","Matthias Nolte",null,null,null,null,null,null,null,null,"Annegret Schmidt",null,null,null,null,null,null,null,null,"Deniz Hagelstein",null,null,null,null,null,null,null,null,"Kai Roßberg",null,null,null,null,null,null,null,null,"Matthias Nolte",null,null,null,null,null,null,null,null,"Jörg Frahm (Abw)",null,null,null,null,null,null,null,null,null,null,null,null,null,null,null,null,null,null,null,null,null,null,null,null,null,null,null,null,null,null,null,null,null,null,null,null,null,null,null,null,null,null,null,null,null,null,null,null,null,null,null,null,null,null,null,null,null,null,null,null,null,null,null,null,null,null,null,null,null,null,null,null,null,null,null,null,null,null,null,null,null,null,null,null,null,null,null,null,null,null,null,null,null,null,null,null,null,null,null,null,null,null,null,null,null,null,null,null,null,null,null,null,null,null,null,null,null,null,null,null,null,null,null,null,null,null,null,null,null,null,"3. Resere","Matthias Nolte",0,0,0,"Annegret Schmidt",0,0,0,"Deniz Hagelstein",0,0,0,"Kai Roßberg",0,0,0,"Matthias Nolte",0,0,0,"Jörg Frahm (Abw)",0,0]
["4. Resere","Frank Nijholt",null,null,null,null,null,null,null,null,"Ilona Wetzel",null,null,null,null,null,null,null,null,"Frank Nijholt",null,null,null,null,null,null,null,null,"Jörg Frahm (Abw)",null,null,null,null,null,null,null,null,"Jörg Frahm (Abw)",null,null,null,null,null,null,null,null,"Matthias Nolte",null,null,null,null,null,null,null,null,null,null,null,null,null,null,null,null,null,null,null,null,null,null,null,null,null,null,null,null,null,null,null,null,null,null,null,null,null,null,null,null,null,null,null,null,null,null,null,null,null,null,null,null,null,null,null,null,null,null,null,null,null,null,null,null,null,null,null,null,null,null,null,null,null,null,null,null,null,null,null,null,null,null,null,null,null,null,null,null,null,null,null,null,null,null,null,null,null,null,null,null,null,null,null,null,null,null,null,null,null,null,null,null,null,null,null,null,null,null,null,null,null,null,null,null,null,null,null,null,null,null,"4. Resere","Frank Nijholt",0,0,0,"Ilona Wetzel",0,0,0,"Frank Nijholt",0,0,0,"Jörg Frahm (Abw)",0,0,0,"Jörg Frahm (Abw)",0,0,0,"Matthias Nolte",0,0]
["5. Resere","Jörg Frahm (Abw)",null,null,null,null,null,null,null,null,"Jörg Frahm (Abw)",null,null,null,null,null,null,null,null,"Jörg Frahm (Abw)",null,null,null,null,null,null,null,null,"Michael Wetzel (Abw)",null,null,null,null,null,null,null,null,"Michael Wetzel (Abw)",null,null,null,null,null,null,null,null,"Michael Wetzel (Abw)",null,null,null,null,null,null,null,null,null,null,null,null,null,null,null,null,null,null,null,null,null,null,null,null,null,null,null,null,null,null,null,null,null,null,null,null,null,null,null,null,null,null,null,null,null,null,null,null,null,null,null,null,null,null,null,null,null,null,null,null,null,null,null,null,null,null,null,null,null,null,null,null,null,null,null,null,null,null,null,null,null,null,null,null,null,null,null,null,null,null,null,null,null,null,null,null,null,null,null,null,null,null,null,null,null,null,null,null,null,null,null,null,null,null,null,null,null,null,null,null,null,null,null,null,null,null,null,null,null,null,"5. Resere","Jörg Frahm (Abw)",0,0,0,"Jörg Frahm (Abw)",0,0,0,"Jörg Frahm (Abw)",0,0,0,"Michael Wetzel (Abw)",0,0,0,"Michael Wetzel (Abw)",0,0,0,"Michael Wetzel (Abw)",0,0]
[null,null,null,null,null,null,null,null,null,null,null,null,null,null,null,null,null,null,null,null,null,null,null,null,null,null,null,null,null,null,null,null,null,null,null,null,null,null,null,null,null,null,null,null,null,null,null,null,null,null,null,null,null,null,null,null,null,null,null,null,null,null,null,null,null,null,null,null,null,null,null,null,null,null,null,null,null,null,null,null,null,null,null,null,null,null,null,null,null,null,null,null,null,null,null,null,null,null,null,null,null,null,null,null,null,null,null,null,null,null,null,null,null,null,null,null,null,null,null,null,null,null,null,null,null,null,null,null,null,null,null,null,null,null,null,null,null,null,null,null,null,null,null,null,null,null,null,null,null,null,null,null,null,null,null,null,null,null,null,null,null,null,null,null,null,null,null,null,null,null,null,null,null,null,null,null,null,0,0,0,0,0,0,0,0,0,0,0,0,0,0,0,0,0,0,0,0,0,0,0,0]
[null,null,null,null,null,null,null,null,null,null,null,null,null,null,null,null,null,null,null,2025,null,null,null,null,null,null,null,null,null,null,null,null,null,null,null,null,null,null,null,null,null,null,null,null,null,null,null,null,null,null,null,null,null,null,null,null,null,null,null,null,null,null,null,null,null,null,null,null,null,null,null,null,null,null,null,null,null,null,null,null,null,null,null,null,null,null,null,null,null,null,null,null,null,null,null,null,null,null,null,null,null,null,null,null,null,null,null,null,null,null,null,null,null,null,null,null,null,null,null,null,null,null,null,null,null,null,null,null,null,null,null,null,null,null,null,null,null,null,null,null,null,null,null,null,null,null,null,null,null,null,null,null,null,null,null,null,null,null,null,null,null,null,null,null,null,null,null,null,null,null,null,null,null,null,null,null,null,0,0,0,0,0,0,0,0,0,2025,0,0,0,0,0,0,0,0,0,0,0,0,0,0]
[null,null,null,null,null,null,null,null,null,null,null,null,null,null,null,null,null,null,null,null,null,null,null,null,null,null,null,null,null,null,null,null,null,null,null,null,null,null,null,null,null,null,null,null,null,null,null,null,null,null,null,null,null,null,null,null,null,null,null,null,null,null,null,null,null,null,null,null,null,null,null,null,null,null,null,null,null,null,null,null,null,null,null,null,null,null,null,null,null,null,null,null,null,null,null,null,null,null,null,null,null,null,null,null,null,null,null,null,null,null,null,null,null,null,null,null,null,null,null,null,null,null,null,null,null,null,null,null,null,null,null,null,null,null,null,null,null,null,null,null,null,null,null,null,null,null,null,null,null,null,null,null,null,null,null,null,null,null,null,null,null,null,null,null,null,null,null,null,null,null,null,null,null,null,null,null,null,0,0,0,0,0,0,0,0,0,0,0,0,0,0,0,0,0,0,0,0,0,0,0,0]
[null,"Kürzel:",null,null,null,null,null,null,{"$f":"VLOOKUP(F23,Hilfstabelle!$R$5:$S$18,2,0)","v":"OT"},null,"Kürzel:",null,null,null,null,null,null,{"$f":"VLOOKUP(O23,Hilfstabelle!$R$5:$S$18,2,0)","v":"WB"},null,"Kürzel:",null,null,null,null,null,null,{"$f":"VLOOKUP(X23,Hilfstabelle!$R$5:$S$18,2,0)","v":"OT"},null,"Kürzel:",null,null,null,null,null,null,{"$f":"VLOOKUP(AG23,Hilfstabelle!$R$5:$S$18,2,0)","v":"WB"},null,"Kürzel:",null,null,null,null,null,null,{"$f":"VLOOKUP(AP23,Hilfstabelle!$R$5:$S$18,2,0)","v":"OT"},null,"Kürzel:",null,null,null,null,null,null,{"$f":"VLOOKUP(AY23,Hilfstabelle!$R$5:$S$18,2,0)","v":"WB"},null,null,null,null,null,null,null,null,null,null,null,null,null,null,null,null,null,null,null,null,null,null,null,null,null,null,null,null,null,null,null,null,null,null,null,null,null,null,null,null,null,null,null,null,null,null,null,null,null,null,null,null,null,null,null,null,null,null,null,null,null,null,null,null,null,null,null,null,null,null,null,null,null,null,null,null,null,null,null,null,null,null,null,null,null,null,null,null,null,null,null,null,null,null,null,null,null,null,null,null,null,null,null,null,null,null,null,null,null,null,null,null,null,null,null,null,null,null,null,null,null,null,null,0,"Kürzel:",0,"OT",0,"Kürzel:",0,"WB",0,"Kürzel:",0,"OT",0,"Kürzel:",0,"WB",0,"Kürzel:",0,"OT",0,"Kürzel:",0,"WB"]
[null,{"$f":"+\"Bahn:    \"&VLOOKUP(F23,Hilfstabelle!$B$5:$C$18,2,0)","v":"Bahn:    Othmarschen"},null,null,null,null,null,null,null,null,{"$f":"+\"Bahn:    \"&VLOOKUP(O23,Hilfstabelle!$B$5:$C$18,2,0)","v":"Bahn:    Wandsbek"},null,null,null,null,null,null,null,null,{"$f":"+\"Bahn:    \"&VLOOKUP(X23,Hilfstabelle!$B$5:$C$18,2,0)","v":"Bahn:    Othmarschen"},null,null,null,null,null,null,null,null,{"$f":"+\"Bahn:    \"&VLOOKUP(AG23,Hilfstabelle!$B$5:$C$18,2,0)","v":"Bahn:    Wandsbek"},null,null,null,null,null,null,null,null,{"$f":"+\"Bahn:    \"&VLOOKUP(AP23,Hilfstabelle!$B$5:$C$18,2,0)","v":"Bahn:    Othmarschen"},null,null,null,null,null,null,null,null,{"$f":"+\"Bahn:    \"&VLOOKUP(AY23,Hilfstabelle!$B$5:$C$18,2,0)","v":"Bahn:    Wandsbek"},null,null,null,null,null,null,null,null,null,null,null,null,null,null,null,null,null,null,null,null,null,null,null,null,null,null,null,null,null,null,null,null,null,null,null,null,null,null,null,null,null,null,null,null,null,null,null,null,null,null,null,null,null,null,null,null,null,null,null,null,null,null,null,null,null,null,null,null,null,null,null,null,null,null,null,null,null,null,null,null,null,null,null,null,null,null,null,null,null,null,null,null,null,null,null,null,null,null,null,null,null,null,null,null,null,null,null,null,null,null,null,null,null,null,null,null,null,null,null,null,null,null,null,null,null,null,null,null,null,null,0,"Bahn:    Othmarschen",0,0,0,"Bahn:    Wandsbek",0,0,0,"Bahn:    Othmarschen",0,0,0,"Bahn:    Wandsbek",0,0,0,"Bahn:    Othmarschen",0,0,0,"Bahn:    Wandsbek",0,0]
[null,"7.","Antritt",null,null,{"$f":"VLOOKUP(B23,Hilfstabelle!$A$5:$B$18,2,0)","v":"2025-01-30"},null,null,null,null,"8.","Antritt",null,null,{"$f":"VLOOKUP(K23,Hilfstabelle!$A$5:$B$18,2,0)","v":"2025-02-13"},null,null,null,null,"9.","Antritt",null,null,{"$f":"VLOOKUP(T23,Hilfstabelle!$A$5:$B$18,2,0)","v":"2025-02-27"},null,null,null,null,"10.","Antritt",null,null,{"$f":"VLOOKUP(AC23,Hilfstabelle!$A$5:$B$18,2,0)","v":"2025-03-13"},null,null,null,null,"11.","Antritt",null,null,{"$f":"VLOOKUP(AL23,Hilfstabelle!$A$5:$B$18,2,0)","v":"2025-03-27"},null,null,null,null,"12.","Antritt",null,null,{"$f":"VLOOKUP(AU23,Hilfstabelle!$A$5:$B$18,2,0)","v":"2025-04-10"},null,null,null,null,null,null,null,null,null,null,null,null,null,null,null,null,null,null,null,null,null,null,null,null,null,null,null,null,null,null,null,null,null,null,null,null,null,null,null,null,null,null,null,null,null,null,null,null,null,null,null,null,null,null,null,null,null,null,null,null,null,null,null,null,null,null,null,null,null,null,null,null,null,null,null,null,null,null,null,null,null,null,null,null,null,null,null,null,null,null,null,null,null,null,null,null,null,null,null,null,null,null,null,null,null,null,null,null,null,null,null,null,null,null,null,null,null,null,null,null,null,null,null,null,null,null,0,"7.","Antritt",{"$f":"+F23","v":"2025-01-30"},0,"8.","Antritt",{"$f":"+O23","v":"2025-02-13"},0,"9.","Antritt",{"$f":"+X23","v":"2025-02-27"},0,"10.","Antritt",{"$f":"+AG23","v":"2025-03-13"},0,"11.","Antritt",{"$f":"+AP23","v":"2025-03-27"},0,"12.","Antritt",{"$f":"+AY23","v":"2025-04-10"}]
[null,"Annegret Schmidt",null,null,null,null,null,null,null,null,"Annegret Schmidt",null,null,null,null,null,null,null,null,"Annegret Schmidt",null,null,null,null,null,null,null,null,"Annegret Schmidt",null,null,null,null,null,null,null,null,"Matthias Nolte",null,null,null,null,null,null,null,null,"Frank Nijholt",null,null,null,null,null,null,null,null,null,null,null,null,null,null,null,null,null,null,null,null,null,null,null,null,null,null,null,null,null,null,null,null,null,null,null,null,null,null,null,null,null,null,null,null,null,null,null,null,null,null,null,null,null,null,null,null,null,null,null,null,null,null,null,null,null,null,null,null,null,null,null,null,null,null,null,null,null,null,null,null,null,null,null,null,null,null,null,null,null,null,null,null,null,null,null,null,null,null,null,null,null,null,null,null,null,null,null,null,null,null,null,null,null,null,null,null,null,null,null,null,null,null,null,null,null,null,null,null,null,null,0,"Annegret Schmidt",0,0,0,"Annegret Schmidt",0,0,0,"Annegret Schmidt",0,0,0,"Annegret Schmidt",0,0,0,"Matthias Nolte",0,0,0,"Frank Nijholt",0,0]
[null,"Deniz Hagelstein",null,null,null,null,null,null,null,null,"Ilona Wetzel",null,null,null,null,null,null,null,null,"Jörg Frahm",null,null,null,null,null,null,null,null,"Frank Nijholt",null,null,null,null,null,null,null,null,"Deniz Hagelstein",null,null,null,null,null,null,null,null,"Deniz Hagelstein",null,null,null,null,null,null,null,null,null,null,null,null,null,null,null,null,null,null,null,null,null,null,null,null,null,null,null,null,null,null,null,null,null,null,null,null,null,null,null,null,null,null,null,null,null,null,null,null,null,null,null,null,null,null,null,null,null,null,null,null,null,null,null,null,null,null,null,null,null,null,null,null,null,null,null,null,null,null,null,null,null,null,null,null,null,null,null,null,null,null,null,null,null,null,null,null,null,null,null,null,null,null,null,null,null,null,null,null,null,null,null,null,null,null,null,null,null,null,null,null,null,null,null,null,null,null,null,null,null,null,0,"Deniz Hagelstein",0,0,0,"Ilona Wetzel",0,0,0,"Jörg Frahm",0,0,0,"Frank Nijholt",0,0,0,"Deniz Hagelstein",0,0,0,"Deniz Hagelstein",0,0]
[null,"Mario Jurk",null,null,null,null,null,null,null,null,"Deniz Hagelstein",null,null,null,null,null,null,null,null,"Mario Jurk",null,null,null,null,null,null,null,null,"Jörg Frahm",null,null,null,null,null,null,null,null,"Jörg Frahm",null,null,null,null,null,null,null,null,"Jörg Frahm",null,null,null,null,null,null,null,null,null,null,null,null,null,null,null,null,null,null,null,null,null,null,null,null,null,null,null,null,null,null,null,null,null,null,null,null,null,null,null,null,null,null,null,null,null,null,null,null,null,null,null,null,null,null,null,null,null,null,null,null,null,null,null,null,null,null,null,null,null,null,null,null,null,null,null,null,null,null,null,null,null,null,null,null,null,null,null,null,null,null,null,null,null,null,null,null,null,null,null,null,null,null,null,null,null,null,null,null,null,null,null,null,null,null,null,null,null,null,null,null,null,null,null,null,null,null,null,null,null,null,0,"Mario Jurk",0,0,0,"Deniz Hagelstein",0,0,0,"Mario Jurk",0,0,0,"Jörg Frahm",0,0,0,"Jörg Frahm",0,0,0,"Jörg Frahm",0,0]
[null,"Kai Roßberg",null,null,null,null,null,null,null,null,"Kai Roßberg",null,null,null,null,null,null,null,null,"Kai Roßberg",null,null,null,null,null,null,null,null,"Kai Roßberg",null,null,null,null,null,null,null,null,"Kai Roßberg",null,null,null,null,null,null,null,null,"Kai Roßberg",null,null,null,null,null,null,null,null,null,null,null,null,null,null,null,null,null,null,null,null,null,null,null,null,null,null,null,null,null,null,null,null,null,null,null,null,null,null,null,null,null,null,null,null,null,null,null,null,null,null,null,null,null,null,null,null,null,null,null,null,null,null,null,null,null,null,null,null,null,null,null,null,null,null,null,null,null,null,null,null,null,null,null,null,null,null,null,null,null,null,null,null,null,null,null,null,null,null,null,null,null,null,null,null,null,null,null,null,null,null,null,null,null,null,null,null,null,null,null,null,null,null,null,null,null,null,null,null,null,null,0,"Kai Roßberg",0,0,0,"Kai Roßberg",0,0,0,"Kai Roßberg",0,0,0,"Kai Roßberg",0,0,0,"Kai Roßberg",0,0,0,"Kai Roßberg",0,0]
[null,null,null,null,null,null,null,null,null,null,null,null,null,null,null,null,null,null,null,null,null,null,null,null,null,null,null,null,null,null,null,null,null,null,null,null,null,null,null,null,null,null,null,null,null,null,null,null,null,null,null,null,null,null,null,null,null,null,null,null,null,null,null,null,null,null,null,null,null,null,null,null,null,null,null,null,null,null,null,null,null,null,null,null,null,null,null,null,null,null,null,null,null,null,null,null,null,null,null,null,null,null,null,null,null,null,null,null,null,null,null,null,null,null,null,null,null,null,null,null,null,null,null,null,null,null,null,null,null,null,null,null,null,null,null,null,null,null,null,null,null,null,null,null,null,null,null,null,null,null,null,null,null,null,null,null,null,null,null,null,null,null,null,null,null,null,null,null,null,null,null,null,null,null,null,null,null,0]
["1. Resere","Ilona Wetzel",null,null,null,null,null,null,null,null,"Frank Nijholt",null,null,null,null,null,null,null,null,"Deniz Hagelstein",null,null,null,null,null,null,null,null,"Ilona Wetzel",null,null,null,null,null,null,null,null,"Annegret Schmidt",null,null,null,null,null,null,null,null,"Ilona Wetzel",null,null,null,null,null,null,null,null,null,null,null,null,null,null,null,null,null,null,null,null,null,null,null,null,null,null,null,null,null,null,null,null,null,null,null,null,null,null,null,null,null,null,null,null,null,null,null,null,null,null,null,null,null,null,null,null,null,null,null,null,null,null,null,null,null,null,null,null,null,null,null,null,null,null,null,null,null,null,null,null,null,null,null,null,null,null,null,null,null,null,null,null,null,null,null,null,null,null,null,null,null,null,null,null,null,null,null,null,null,null,null,null,null,null,null,null,null,null,null,null,null,null,null,null,null,null,null,null,null,null,"1. Resere",{"$f":"+B29","v":"Ilona Wetzel"},{"$f":"+C29","v":0},{"$f":"+I29","v":0},{"$f":"+J29","v":0},{"$f":"+K29","v":"Frank Nijholt"},{"$f":"+L29","v":0},{"$f":"+R29","v":0},{"$f":"+S29","v":0},{"$f":"+T29","v":"Deniz Hagelstein"},{"$f":"+U29","v":0},{"$f":"+AA29","v":0},{"$f":"+AB29","v":0},{"$f":"+AC29","v":"Ilona Wetzel"},{"$f":"+AD29","v":0},{"$f":"+AJ29","v":0},{"$f":"+AK29","v":0},{"$f":"+AL29","v":"Annegret Schmidt"},{"$f":"+AM29","v":0},{"$f":"+AS29","v":0},{"$f":"+AT29","v":0},{"$f":"+AU29","v":"Ilona Wetzel"},{"$f":"+AV29","v":0},{"$f":"+BB29","v":0}]
["2. Resere","Annegret Schmidt",null,null,null,null,null,null,null,null,"Mario Jurk",null,null,null,null,null,null,null,null,"Mario Jurk",null,null,null,null,null,null,null,null,"Mario Jurk",null,null,null,null,null,null,null,null,"Ilona Wetzel",null,null,null,null,null,null,null,null,"Mario Jurk",null,null,null,null,null,null,null,null,null,null,null,null,null,null,null,null,null,null,null,null,null,null,null,null,null,null,null,null,null,null,null,null,null,null,null,null,null,null,null,null,null,null,null,null,null,null,null,null,null,null,null,null,null,null,null,null,null,null,null,null,null,null,null,null,null,null,null,null,null,null,null,null,null,null,null,null,null,null,null,null,null,null,null,null,null,null,null,null,null,null,null,null,null,null,null,null,null,null,null,null,null,null,null,null,null,null,null,null,null,null,null,null,null,null,null,null,null,null,null,null,null,null,null,null,null,null,null,null,null,null,"2. Resere","Annegret Schmidt",0,0,0,"Mario Jurk",0,0,0,"Mario Jurk",0,0,0,"Mario Jurk",0,0,0,"Ilona Wetzel",0,0,0,"Mario Jurk",0,0]
["3. Resere","Frank Nijholt",null,null,null,null,null,null,null,null,"Matthias Nolte",null,null,null,null,null,null,null,null,"Frank Nijholt",null,null,null,null,null,null,null,null,"Deniz Hagelstein",null,null,null,null,null,null,null,null,"Mario Jurk",null,null,null,null,null,null,null,null,"Annegret Schmidt",null,null,null,null,null,null,null,null,null,null,null,null,null,null,null,null,null,null,null,null,null,null,null,null,null,null,null,null,null,null,null,null,null,null,null,null,null,null,null,null,null,null,null,null,null,null,null,null,null,null,null,null,null,null,null,null,null,null,null,null,null,null,null,null,null,null,null,null,null,null,null,null,null,null,null,null,null,null,null,null,null,null,null,null,null,null,null,null,null,null,null,null,null,null,null,null,null,null,null,null,null,null,null,null,null,null,null,null,null,null,null,null,null,null,null,null,null,null,null,null,null,null,null,null,null,null,null,null,null,null,"3. Resere","Frank Nijholt",0,0,0,"Matthias Nolte",0,0,0,"Frank Nijholt",0,0,0,"Deniz Hagelstein",0,0,0,"Mario Jurk",0,0,0,"Annegret Schmidt",0,0]
["4. Resere","Jörg Frahm (Abw)",null,null,null,null,null,null,null,null,"Jörg Frahm",null,null,null,null,null,null,null,null,"Matthias Nolte",null,null,null,null,null,null,null,null,"Matthias Nolte",null,null,null,null,null,null,null,null,"Frank Nijholt",null,null,null,null,null,null,null,null,"Matthias Nolte",null,null,null,null,null,null,null,null,null,null,null,null,null,null,null,null,null,null,null,null,null,null,null,null,null,null,null,null,null,null,null,null,null,null,null,null,null,null,null,null,null,null,null,null,null,null,null,null,null,null,null,null,null,null,null,null,null,null,null,null,null,null,null,null,null,null,null,null,null,null,null,null,null,null,null,null,null,null,null,null,null,null,null,null,null,null,null,null,null,null,null,null,null,null,null,null,null,null,null,null,null,null,null,null,null,null,null,null,null,null,null,null,null,null,null,null,null,null,null,null,null,null,null,null,null,null,null,null,null,null,"4. Resere","Jörg Frahm (Abw)",0,0,0,"Jörg Frahm",0,0,0,"Matthias Nolte",0,0,0,"Matthias Nolte",0,0,0,"Frank Nijholt",0,0,0,"Matthias Nolte",0,0]
["5. Resere","Michael Wetzel (Abw)",null,null,null,null,null,null,null,null,"Michael Wetzel (Abw)",null,null,null,null,null,null,null,null,"Michael Wetzel (Abw)",null,null,null,null,null,null,null,null,"Michael Wetzel (Abw)",null,null,null,null,null,null,null,null,"Michael Wetzel (Abw)",null,null,null,null,null,null,null,null,"Michael Wetzel (Abw)",null,null,null,null,null,null,null,null,null,null,null,null,null,null,null,null,null,null,null,null,null,null,null,null,null,null,null,null,null,null,null,null,null,null,null,null,null,null,null,null,null,null,null,null,null,null,null,null,null,null,null,null,null,null,null,null,null,null,null,null,null,null,null,null,null,null,null,null,null,null,null,null,null,null,null,null,null,null,null,null,null,null,null,null,null,null,null,null,null,null,null,null,null,null,null,null,null,null,null,null,null,null,null,null,null,null,null,null,null,null,null,null,null,null,null,null,null,null,null,null,null,null,null,null,null,null,null,null,null,null,"5. Resere","Michael Wetzel (Abw)",0,0,0,"Michael Wetzel (Abw)",0,0,0,"Michael Wetzel (Abw)",0,0,0,"Michael Wetzel (Abw)",0,0,0,"Michael Wetzel (Abw)",0,0,0,"Michael Wetzel (Abw)",0,0]
[null,null,null,null,null,null,null,null,null,null,null,null,null,null,null,null,null,null,null,null,null,null,null,null,null,null,null,null,null,null,null,null,null,null,null,null,null,null,null,null,null,null,null,null,null,null,null,null,null,null,null,null,null,null,null,null,null,null,null,null,null,null,null,null,null,null,null,null,null,null,null,null,null,null,null,null,null,null,null,null,null,null,null,null,null,null,null,null,null,null,null,null,null,null,null,null,null,null,null,null,null,null,null,null,null,null,null,null,null,null,null,null,null,null,null,null,null,null,null,null,null,null,null,null,null,null,null,null,null,null,null,null,null,null,null,null,null,null,null,null,null,null,null,null,null,null,null,null,null,null,null,null,null,null,null,null,null,null,null,null,null,null,null,null,null,null,null,null,null,null,null,null,null,null,null,null,null,0,0,0,0,0,0,0,0,0,0,0,0,0,0,0,0,0,0,0,0,0,0,0,0]
[null,"Kürzel:",null,null,null,null,null,null,{"$f":"VLOOKUP(F37,Hilfstabelle!$R$5:$S$18,2,0)","v":"OT"},null,"Kürzel:",null,null,null,null,null,null,{"$f":"VLOOKUP(O37,Hilfstabelle!$R$5:$S$18,2,0)","v":"WB"},null,null,"(Abw) = Abwesend",null,null,null,null,null,null,null,null,null,null,null,null,null,null,null,null,null,null,null,null,null,null,null,null,null,null,null,null,null,null,null,null,null,null,null,null,null,null,null,null,null,null,null,null,null,null,null,null,null,null,null,null,null,null,null,null,null,null,null,null,null,null,null,null,null,null,null,null,null,null,null,null,null,null,null,null,null,null,null,null,null,null,null,null,null,null,null,null,null,null,null,null,null,null,null,null,null,null,null,null,null,null,null,null,null,null,null,null,null,null,null,null,null,null,null,null,null,null,null,null,null,null,null,null,null,null,null,null,null,null,null,null,null,null,null,null,null,null,null,null,null,null,null,null,null,null,null,null,null,null,null,null,null,null,null,null,0,"Kürzel:",0,"OT",0,"Kürzel:",0,"WB",0,0,"(Abw) = Abwesend",0,0,0,0,0,0,0,0,0,0,0,0,0]
[null,{"$f":"+\"Bahn:    \"&VLOOKUP(F37,Hilfstabelle!$B$5:$C$18,2,0)","v":"Bahn:    Othmarschen"},null,null,null,null,null,null,null,null,{"$f":"+\"Bahn:    \"&VLOOKUP(O37,Hilfstabelle!$B$5:$C$18,2,0)","v":"Bahn:    Wandsbek"},null,null,null,null,null,null,null,null,null,"Anzahl Spiele pro Spieler/in",null,null,null,null,null,null,null,null,null,null,null,null,null,null,null,null,null,null,null,null,null,null,null,null,null,null,null,null,null,null,null,null,null,null,null,null,null,null,null,null,null,null,null,null,null,null,null,null,null,null,null,null,null,null,null,null,null,null,null,null,null,null,null,null,null,null,null,null,null,null,null,null,null,null,null,null,null,null,null,null,null,null,null,null,null,null,null,null,null,null,null,null,null,null,null,null,null,null,null,null,null,null,null,null,null,null,null,null,null,null,null,null,null,null,null,null,null,null,null,null,null,null,null,null,null,null,null,null,null,null,null,null,null,null,null,null,null,null,null,null,null,null,null,null,null,null,null,null,null,null,null,null,null,null,null,null,0,"Bahn:    Othmarschen",0,0,0,"Bahn:    Wandsbek",0,0,0,0,"Anzahl Spiele pro Spieler/in",0,0,0,0,0,0,0,0,0,0,0,0,0]
[null,"13.","Antritt",null,null,{"$f":"VLOOKUP(B37,Hilfstabelle!$A$5:$B$18,2,0)","v":"2025-04-24"},null,null,null,null,"14.","Antritt",null,null,{"$f":"VLOOKUP(K37,Hilfstabelle!$A$5:$B$18,2,0)","v":"2025-05-08"},null,null,null,null,null,null,null,null,null,null,null,"Gesamt",null,"WB",null,"OT",null,"P.-Nr:",null,null,null,null,null,null,null,null,null,null,null,null,null,null,null,null,null,null,null,null,null,null,null,null,null,null,null,null,null,null,null,null,null,null,null,null,null,null,null,null,null,null,null,null,null,null,null,null,null,null,null,null,null,null,null,null,null,null,null,null,null,null,null,null,null,null,null,null,null,null,null,null,null,null,null,null,null,null,null,null,null,null,null,null,null,null,null,null,null,null,null,null,null,null,null,null,null,null,null,null,null,null,null,null,null,null,null,null,null,null,null,null,null,null,null,null,null,null,null,null,null,null,null,null,null,null,null,null,null,null,null,null,null,null,null,null,null,null,null,null,null,null,null,null,0,"13.","Antritt",{"$f":"+F37","v":"2025-04-24"},0,"14.","Antritt",{"$f":"+O37","v":"2025-05-08"},0,0,0,"Gesamt",0,{"$f":"+#REF!","v":{"$error":"#REF!"}},{"$f":"+AC37","v":"WB"},{"$f":"+AE37","v":"OT"},{"$f":"+#REF!","v":{"$error":"#REF!"}},{"$f":"+AG37","v":"P.-Nr:"},null,{"$f":"+AS37","v":0},{"$f":"+AT37","v":0},{"$f":"+AU37","v":0},{"$f":"+AV37","v":0},0]
[null,"Matthias Nolte",null,null,null,null,null,null,null,null,"Annegret Schmidt",null,null,null,null,null,null,null,null,null,"Anne",null,null,null,null,null,{"$f":"COUNTIF($B$38:$R$41,\"Annegret Schmidt\")+COUNTIF($B$24:$BB$27,\"Annegret Schmidt\")+COUNTIF($B$8:$BB$11,\"Annegret Schmidt\")","v":8},null,{"$f":"COUNTIF($AL$5:$AS$11,\"Annegret Schmidt\")+COUNTIF($AU$5:$BB$11,\"Annegret Schmidt\")+COUNTIF($K$21:$R$27,\"Annegret Schmidt\")+COUNTIF($AC$21:$AJ$27,\"Annegret Schmidt\")+COUNTIF($AU$21:$BB$27,\"Annegret Schmidt\")+COUNTIF($K$35:$R$41,\"Annegret Schmidt\")+COUNTIF($T$5:$AA$11,\"Annegret Schmidt\")","v":5},null,{"$f":"COUNTIF($K$5:$R$11,\"Annegret Schmidt\")+COUNTIF($AC$5:$AJ$11,\"Annegret Schmidt\")+COUNTIF($B$21:$I$27,\"Annegret Schmidt\")+COUNTIF($T$21:$AA$27,\"Annegret Schmidt\")+COUNTIF($AL$21:$AS$27,\"Annegret Schmidt\")+COUNTIF($B$35:$I$41,\"Annegret Schmidt\")+COUNTIF($B$5:$I$11,\"Annegret Schmidt\")","v":3},null,19222,null,null,null,null,null,null,null,null,null,null,null,null,null,null,null,null,null,null,null,null,null,null,null,null,null,null,null,null,null,null,null,null,null,null,null,null,null,null,null,null,null,null,null,null,null,null,null,null,null,null,null,null,null,null,null,null,null,null,null,null,null,null,null,null,null,null,null,null,null,null,null,null,null,null,null,null,null,null,null,null,null,null,null,null,null,null,null,null,null,null,null,null,null,null,null,null,null,null,null,null,null,null,null,null,null,null,null,null,null,null,null,null,null,null,null,null,null,null,null,null,null,null,null,null,null,null,null,null,null,null,null,null,null,null,null,null,null,null,null,null,null,null,null,null,0,"Matthias Nolte",0,0,0,"Annegret Schmidt",0,0,0,0,"Anne",{"$f":"+#REF!","v":{"$error":"#REF!"}},{"$f":"+#REF!","v":{"$error":"#REF!"}},{"$f":"+AA38","v":8},5,3,{"$f":"+AG38","v":19222},{"$f":"+AH38","v":0},null,0,0,0,null,0]
[null,"Jörg Frahm",null,null,null,null,null,null,null,null,"Deniz Hagelstein",null,null,null,null,null,null,null,null,null,"Deniz",null,null,null,null,null,{"$f":"COUNTIF($B$38:$R$41,\"Deniz Hagelstein\")+COUNTIF($B$24:$BB$27,\"Deniz Hagelstein\")+COUNTIF($B$8:$BB$11,\"Deniz Hagelstein\")","v":7},null,{"$f":"COUNTIF($AL$8:$AS$11,\"Deniz Hagelstein\")+COUNTIF($AU$8:$BB$11,\"Deniz Hagelstein\")+COUNTIF($K$24:$R$27,\"Deniz Hagelstein\")+COUNTIF($AC$24:$AJ$27,\"Deniz Hagelstein\")+COUNTIF($AU$24:$BB$27,\"Deniz Hagelstein\")+COUNTIF($K$38:$R$41,\"Deniz Hagelstein\")+COUNTIF($T$8:$AA$11,\"Deniz Hagelstein\")","v":3},null,{"$f":"COUNTIF($K$5:$R$11,\"Deniz Hagelstein\")+COUNTIF($AC$5:$AJ$11,\"Deniz Hagelstein\")+COUNTIF($B$21:$I$27,\"Deniz Hagelstein\")+COUNTIF($T$21:$AA$27,\"Deniz Hagelstein\")+COUNTIF($AL$21:$AS$27,\"Deniz Hagelstein\")+COUNTIF($B$35:$I$41,\"Deniz Hagelstein\")+COUNTIF($B$5:$I$11,\"Deniz Hagelstein\")","v":4},null,24775,null,null,null,null,null,null,null,null,null,null,null,null,null,null,null,null,null,null,null,null,null,null,null,null,null,null,null,null,null,null,null,null,null,null,null,null,null,null,null,null,null,null,null,null,null,null,null,null,null,null,null,null,null,null,null,null,null,null,null,null,null,null,null,null,null,null,null,null,null,null,null,null,null,null,null,null,null,null,null,null,null,null,null,null,null,null,null,null,null,null,null,null,null,null,null,null,null,null,null,null,null,null,null,null,null,null,null,null,null,null,null,null,null,null,null,null,null,null,null,null,null,null,null,null,null,null,null,null,null,null,null,null,null,null,null,null,null,null,null,null,null,null,null,null,0,"Jörg Frahm",0,0,0,"Deniz Hagelstein",0,0,0,0,"Deniz",{"$f":"+#REF!","v":{"$error":"#REF!"}},{"$f":"+#REF!","v":{"$error":"#REF!"}},7,3,4,24775,0,null,0,0,0,null,0]
[null,"Michael Wetzel",null,null,null,null,null,null,null,null,"Mario Jurk",null,null,null,null,null,null,null,null,null,"Frank",null,null,null,null,null,{"$f":"COUNTIF($B$38:$R$41,\"Frank Nijholt\")+COUNTIF($B$24:$BB$27,\"Frank Nijholt\")+COUNTIF($B$8:$BB$11,\"Frank Nijholt\")","v":5},null,{"$f":"COUNTIF($AL$5:$AS$11,\"Frank Nijholt\")+COUNTIF($AU$5:$BB$11,\"Frank Nijholt\")+COUNTIF($K$21:$R$27,\"Frank Nijholt\")+COUNTIF($AC$21:$AJ$27,\"Frank Nijholt\")+COUNTIF($AU$21:$BB$27,\"Frank Nijholt\")+COUNTIF($K$35:$R$41,\"Frank Nijholt\")+COUNTIF($T$5:$AA$11,\"Frank Nijholt\")","v":4},null,{"$f":"COUNTIF($K$5:$R$11,\"Frank Nijholt\")+COUNTIF($AC$5:$AJ$11,\"Frank Nijholt\")+COUNTIF($B$21:$I$27,\"Frank Nijholt\")+COUNTIF($T$21:$AA$27,\"Frank Nijholt\")+COUNTIF($AL$21:$AS$27,\"Frank Nijholt\")+COUNTIF($B$35:$I$41,\"Frank Nijholt\")+COUNTIF($B$5:$I$11,\"Frank Nijholt\")","v":1},null,24774,null,null,null,null,null,null,null,null,null,null,null,null,null,null,null,null,null,null,null,null,null,null,null,null,null,null,null,null,null,null,null,null,null,null,null,null,null,null,null,null,null,null,null,null,null,null,null,null,null,null,null,null,null,null,null,null,null,null,null,null,null,null,null,null,null,null,null,null,null,null,null,null,null,null,null,null,null,null,null,null,null,null,null,null,null,null,null,null,null,null,null,null,null,null,null,null,null,null,null,null,null,null,null,null,null,null,null,null,null,null,null,null,null,null,null,null,null,null,null,null,null,null,null,null,null,null,null,null,null,null,null,null,null,null,null,null,null,null,null,null,null,null,null,null,0,{"$f":"+B40","v":"Michael Wetzel"},{"$f":"+C40","v":0},{"$f":"+I40","v":0},{"$f":"+J40","v":0},{"$f":"+K40","v":"Mario Jurk"},{"$f":"+L40","v":0},{"$f":"+R40","v":0},{"$f":"+S40","v":0},0,"Frank",{"$f":"+#REF!","v":{"$error":"#REF!"}},{"$f":"+#REF!","v":{"$error":"#REF!"}},5,4,1,24774,0,null,0,0,0,null,{"$f":"+BB40","v":0}]
[null,"Kai Roßberg",null,null,null,null,null,null,null,null,"Kai Roßberg",null,null,null,null,null,null,null,null,null,"Ilona",null,null,null,null,null,{"$f":"COUNTIF($B$38:$R$41,\"Ilona Wetzel\")+COUNTIF($B$24:$BB$27,\"Ilona Wetzel\")+COUNTIF($B$8:$BB$11,\"Ilona Wetzel\")","v":4},null,{"$f":"COUNTIF($AL$5:$AS$11,\"Ilona Wetzel\")+COUNTIF($AU$5:$BB$11,\"Ilona Wetzel\")+COUNTIF($K$21:$R$27,\"Ilona Wetzel\")+COUNTIF($AC$21:$AJ$27,\"Ilona Wetzel\")+COUNTIF($AU$21:$BB$27,\"Ilona Wetzel\")+COUNTIF($K$35:$R$41,\"Ilona Wetzel\")+COUNTIF($T$5:$AA$11,\"Ilona Wetzel\")","v":3},null,{"$f":"COUNTIF($K$5:$R$11,\"Ilona Wetzel\")+COUNTIF($AC$5:$AJ$11,\"Ilona Wetzel\")+COUNTIF($B$21:$I$27,\"Ilona Wetzel\")+COUNTIF($T$21:$AA$27,\"Ilona Wetzel\")+COUNTIF($AL$21:$AS$27,\"Ilona Wetzel\")+COUNTIF($B$35:$I$41,\"Ilona Wetzel\")+COUNTIF($B$5:$I$11,\"Ilona Wetzel\")","v":1},null,22115,null,null,null,null,null,null,null,null,null,null,null,null,null,null,null,null,null,null,null,null,null,null,null,null,null,null,null,null,null,null,null,null,null,null,null,null,null,null,null,null,null,null,null,null,null,null,null,null,null,null,null,null,null,null,null,null,null,null,null,null,null,null,null,null,null,null,null,null,null,null,null,null,null,null,null,null,null,null,null,null,null,null,null,null,null,null,null,null,null,null,null,null,null,null,null,null,null,null,null,null,null,null,null,null,null,null,null,null,null,null,null,null,null,null,null,null,null,null,null,null,null,null,null,null,null,null,null,null,null,null,null,null,null,null,null,null,null,null,null,null,null,null,null,null,0,{"$f":"+B41","v":"Kai Roßberg"},{"$f":"+C41","v":0},{"$f":"+I41","v":0},{"$f":"+J41","v":0},"Kai Roßberg",0,0,0,0,"Ilona",{"$f":"+#REF!","v":{"$error":"#REF!"}},{"$f":"+#REF!","v":{"$error":"#REF!"}},4,3,1,22115,0,null,0,0,0,null,0]
[null,"Deniz Hagelstein",null,null,null,null,null,null,null,null,null,null,null,null,null,null,null,null,null,null,"Jörg",null,null,null,null,null,{"$f":"COUNTIF($B$38:$R$41,\"Jörg Frahm\")+COUNTIF($B$24:$BB$27,\"Jörg Frahm\")+COUNTIF($B$8:$BB$11,\"Jörg Frahm\")","v":5},null,{"$f":"COUNTIF($AL$5:$AS$11,\"Jörg Frahm\")+COUNTIF($AU$5:$BB$11,\"Jörg Frahm\")+COUNTIF($K$21:$R$27,\"Jörg Frahm\")+COUNTIF($AC$21:$AJ$27,\"Jörg Frahm\")+COUNTIF($AU$21:$BB$27,\"Jörg Frahm\")+COUNTIF($K$35:$R$41,\"Jörg Frahm\")+COUNTIF($T$5:$AA$11,\"Jörg Frahm\")","v":2},null,{"$f":"COUNTIF($K$5:$R$11,\"Jörg Frahm\")+COUNTIF($AC$5:$AJ$11,\"Jörg Frahm\")+COUNTIF($B$21:$I$27,\"Jörg Frahm\")+COUNTIF($T$21:$AA$27,\"Jörg Frahm\")+COUNTIF($AL$21:$AS$27,\"Jörg Frahm\")+COUNTIF($B$35:$I$41,\"Jörg Frahm\")+COUNTIF($B$5:$I$11,\"Jörg Frahm\")","v":3},null,19221,null,null,null,null,null,null,null,null,null,null,null,null,null,null,null,null,null,null,null,null,null,null,null,null,null,null,null,null,null,null,null,null,null,null,null,null,null,null,null,null,null,null,null,null,null,null,null,null,null,null,null,null,null,null,null,null,null,null,null,null,null,null,null,null,null,null,null,null,null,null,null,null,null,null,null,null,null,null,null,null,null,null,null,null,null,null,null,null,null,null,null,null,null,null,null,null,null,null,null,null,null,null,null,null,null,null,null,null,null,null,null,null,null,null,null,null,null,null,null,null,null,null,null,null,null,null,null,null,null,null,null,null,null,null,null,null,null,null,null,null,null,null,null,null,{"$f":"+A42","v":0},{"$f":"+#REF!","v":{"$error":"#REF!"}},{"$f":"+#REF!","v":{"$error":"#REF!"}},{"$f":"+#REF!","v":{"$error":"#REF!"}},{"$f":"+J43","v":0},{"$f":"+K42","v":0},{"$f":"+L42","v":0},{"$f":"+R42","v":0},0,0,"Jörg",{"$f":"+#REF!","v":{"$error":"#REF!"}},{"$f":"+#REF!","v":{"$error":"#REF!"}},5,2,3,19221,0,null,0,0,0,null,0]
["1. Resere",null,null,null,null,null,null,null,null,null,"Ilona Wetzel",null,null,null,null,null,null,null,null,null,"Kai",null,null,null,null,null,{"$f":"COUNTIF($B$38:$R$41,\"Kai Roßberg\")+COUNTIF($B$24:$BB$27,\"Kai Roßberg\")+COUNTIF($B$8:$BB$11,\"Kai Roßberg\")","v":13},null,{"$f":"COUNTIF($AL$5:$AS$11,\"Kai Roßberg\")+COUNTIF($AU$5:$BB$11,\"Kai Roßberg\")+COUNTIF($K$21:$R$27,\"Kai Roßberg\")+COUNTIF($AC$21:$AJ$27,\"Kai Roßberg\")+COUNTIF($AU$21:$BB$27,\"Kai Roßberg\")+COUNTIF($K$35:$R$41,\"Kai Roßberg\")+COUNTIF($T$5:$AA$11,\"Kai Roßberg\")","v":7},null,{"$f":"COUNTIF($K$5:$R$11,\"Kai Roßberg\")+COUNTIF($AC$5:$AJ$11,\"Kai Roßberg\")+COUNTIF($B$21:$I$27,\"Kai Roßberg\")+COUNTIF($T$21:$AA$27,\"Kai Roßberg\")+COUNTIF($AL$21:$AS$27,\"Kai Roßberg\")+COUNTIF($B$35:$I$41,\"Kai Roßberg\")+COUNTIF($B$5:$I$11,\"Kai Roßberg\")","v":6},null,21889,null,null,null,null,null,null,null,null,null,null,null,null,null,null,null,null,null,null,null,null,null,null,null,null,null,null,null,null,null,null,null,null,null,null,null,null,null,null,null,null,null,null,null,null,null,null,null,null,null,null,null,null,null,null,null,null,null,null,null,null,null,null,null,null,null,null,null,null,null,null,null,null,null,null,null,null,null,null,null,null,null,null,null,null,null,null,null,null,null,null,null,null,null,null,null,null,null,null,null,null,null,null,null,null,null,null,null,null,null,null,null,null,null,null,null,null,null,null,null,null,null,null,null,null,null,null,null,null,null,null,null,null,null,null,null,null,null,null,null,null,null,null,null,null,"1. Resere",{"$f":"+B42","v":"Deniz Hagelstein"},{"$f":"+C42","v":0},{"$f":"+I42","v":0},{"$f":"+J44","v":0},"Ilona Wetzel",0,0,0,0,"Kai",{"$f":"+#REF!","v":{"$error":"#REF!"}},{"$f":"+#REF!","v":{"$error":"#REF!"}},13,7,6,21889,0,null,0,0,0,null,0]
["2. Resere","Annegret Schmidt",null,null,null,null,null,null,null,null,"Jörg Frahm",null,null,null,null,null,null,null,null,null,"Mario",null,null,null,null,null,{"$f":"COUNTIF($B$38:$R$41,\"Mario Jurk\")+COUNTIF($B$24:$BB$27,\"Mario Jurk\")+COUNTIF($B$8:$BB$11,\"Mario Jurk\")","v":6},null,{"$f":"COUNTIF($AL$5:$AS$11,\"Mario Jurk\")+COUNTIF($AU$5:$BB$11,\"Mario Jurk\")+COUNTIF($K$21:$R$27,\"Mario Jurk\")+COUNTIF($AC$21:$AJ$27,\"Mario Jurk\")+COUNTIF($AU$21:$BB$27,\"Mario Jurk\")+COUNTIF($K$35:$R$41,\"Mario Jurk\")+COUNTIF($T$5:$AA$11,\"Mario Jurk\")","v":3},null,{"$f":"COUNTIF($K$5:$R$11,\"Mario Jurk\")+COUNTIF($AC$5:$AJ$11,\"Mario Jurk\")+COUNTIF($B$21:$I$27,\"Mario Jurk\")+COUNTIF($T$21:$AA$27,\"Mario Jurk\")+COUNTIF($AL$21:$AS$27,\"Mario Jurk\")+COUNTIF($B$35:$I$41,\"Mario Jurk\")+COUNTIF($B$5:$I$11,\"Mario Jurk\")","v":3},null,23302,null,null,null,null,null,null,null,null,null,null,null,null,null,null,null,null,null,null,null,null,null,null,null,null,null,null,null,null,null,null,null,null,null,null,null,null,null,null,null,null,null,null,null,null,null,null,null,null,null,null,null,null,null,null,null,null,null,null,null,null,null,null,null,null,null,null,null,null,null,null,null,null,null,null,null,null,null,null,null,null,null,null,null,null,null,null,null,null,null,null,null,null,null,null,null,null,null,null,null,null,null,null,null,null,null,null,null,null,null,null,null,null,null,null,null,null,null,null,null,null,null,null,null,null,null,null,null,null,null,null,null,null,null,null,null,null,null,null,null,null,null,null,null,null,"2. Resere",{"$f":"+B44","v":"Annegret Schmidt"},{"$f":"+C44","v":0},{"$f":"+I44","v":0},{"$f":"+J45","v":0},"Jörg Frahm",0,0,0,0,"Mario",{"$f":"+#REF!","v":{"$error":"#REF!"}},{"$f":"+#REF!","v":{"$error":"#REF!"}},6,3,3,23302,0,null,0,0,0,null,0]
["3. Resere","Mario Jurk",null,null,null,null,null,null,null,null,"Frank Nijholt",null,null,null,null,null,null,null,null,null,"Matthias ",null,null,null,null,null,{"$f":"COUNTIF($B$38:$R$41,\"Matthias Nolte\")+COUNTIF($B$24:$BB$27,\"Matthias Nolte\")+COUNTIF($B$8:$BB$11,\"Matthias Nolte\")","v":4},null,{"$f":"COUNTIF($AL$5:$AS$11,\"Matthias Nolte\")+COUNTIF($AU$5:$BB$11,\"Matthias Nolte\")+COUNTIF($K$21:$R$27,\"Matthias Nolte\")+COUNTIF($AC$21:$AJ$27,\"Matthias Nolte\")+COUNTIF($AU$21:$BB$27,\"Matthias Nolte\")+COUNTIF($K$35:$R$41,\"Matthias Nolte\")+COUNTIF($T$5:$AA$11,\"Matthias Nolte\")","v":0},null,{"$f":"COUNTIF($K$5:$R$11,\"Matthias Nolte\")+COUNTIF($AC$5:$AJ$11,\"Matthias Nolte\")+COUNTIF($B$21:$I$27,\"Matthias Nolte\")+COUNTIF($T$21:$AA$27,\"Matthias Nolte\")+COUNTIF($AL$21:$AS$27,\"Matthias Nolte\")+COUNTIF($B$35:$I$41,\"Matthias Nolte\")+COUNTIF($B$5:$I$11,\"Matthias Nolte\")","v":4},null,20137,null,null,null,null,null,null,null,null,null,null,null,null,null,null,null,null,null,null,null,null,null,null,null,null,null,null,null,null,null,null,null,null,null,null,null,null,null,null,null,null,null,null,null,null,null,null,null,null,null,null,null,null,null,null,null,null,null,null,null,null,null,null,null,null,null,null,null,null,null,null,null,null,null,null,null,null,null,null,null,null,null,null,null,null,null,null,null,null,null,null,null,null,null,null,null,null,null,null,null,null,null,null,null,null,null,null,null,null,null,null,null,null,null,null,null,null,null,null,null,null,null,null,null,null,null,null,null,null,null,null,null,null,null,null,null,null,null,null,null,null,null,null,null,null,"3. Resere","Mario Jurk",0,0,{"$f":"+J46","v":0},"Frank Nijholt",0,0,0,0,"Matthias ",{"$f":"+#REF!","v":{"$error":"#REF!"}},{"$f":"+#REF!","v":{"$error":"#REF!"}},4,0,4,20137,0,null,0,0,0,null,0]
["4. Resere","Frank Nijholt",null,null,null,null,null,null,null,null,"Matthias Nolte",null,null,null,null,null,null,null,null,null,"Michael ",null,null,null,null,null,{"$f":"COUNTIF($B$38:$R$41,\"Michael Wetzel\")+COUNTIF($B$24:$BB$27,\"Michael Wetzel\")+COUNTIF($B$8:$BB$11,\"Michael Wetzel\")","v":4},null,{"$f":"COUNTIF($AL$5:$AS$11,\"Michael Wetzel\")+COUNTIF($AU$5:$BB$11,\"Michael Wetzel\")+COUNTIF($K$21:$R$27,\"Michael Wetzel\")+COUNTIF($AC$21:$AJ$27,\"Michael Wetzel\")+COUNTIF($AU$21:$BB$27,\"Michael Wetzel\")+COUNTIF($K$35:$R$41,\"Michael Wetzel\")+COUNTIF($T$5:$AA$11,\"Michael Wetzel\")","v":1},null,{"$f":"COUNTIF($K$5:$R$11,\"Michael Wetzel\")+COUNTIF($AC$5:$AJ$11,\"Michael Wetzel\")+COUNTIF($B$21:$I$27,\"Michael Wetzel\")+COUNTIF($T$21:$AA$27,\"Michael Wetzel\")+COUNTIF($AL$21:$AS$27,\"Michael Wetzel\")+COUNTIF($B$35:$I$41,\"Michael Wetzel\")+COUNTIF($B$5:$I$11,\"Michael Wetzel\")","v":3},null,22113,null,null,null,null,null,null,null,null,null,null,null,null,null,null,null,null,null,null,null,null,null,null,null,null,null,null,null,null,null,null,null,null,null,null,null,null,null,null,null,null,null,null,null,null,null,null,null,null,null,null,null,null,null,null,null,null,null,null,null,null,null,null,null,null,null,null,null,null,null,null,null,null,null,null,null,null,null,null,null,null,null,null,null,null,null,null,null,null,null,null,null,null,null,null,null,null,null,null,null,null,null,null,null,null,null,null,null,null,null,null,null,null,null,null,null,null,null,null,null,null,null,null,null,null,null,null,null,null,null,null,null,null,null,null,null,null,null,null,null,null,null,null,null,null,"4. Resere","Frank Nijholt",0,0,{"$f":"+J47","v":0},"Matthias Nolte",0,0,0,0,"Michael ",{"$f":"+#REF!","v":{"$error":"#REF!"}},{"$f":"+#REF!","v":{"$error":"#REF!"}},4,1,3,22113,0,null,0,0,0,null,0]
["5. Resere","Ilona Wetzel",null,null,null,null,null,null,null,null,"Michael Wetzel (Abw)",null,null,null,null,null,null,null,null,null,null,null,null,null,null,null,null,null,null,null,null,null,null,null,null,null,null,null,null,null,null,null,null,null,null,null,null,null,null,null,null,null,null,null,null,null,null,null,null,null,null,null,null,null,null,null,null,null,null,null,null,null,null,null,null,null,null,null,null,null,null,null,null,null,null,null,null,null,null,null,null,null,null,null,null,null,null,null,null,null,null,null,null,null,null,null,null,null,null,null,null,null,null,null,null,null,null,null,null,null,null,null,null,null,null,null,null,null,null,null,null,null,null,null,null,null,null,null,null,null,null,null,null,null,null,null,null,null,null,null,null,null,null,null,null,null,null,null,null,null,null,null,null,null,null,null,null,null,null,null,null,null,null,null,null,null,null,"5. Resere","Ilona Wetzel",0,0,null,"Michael Wetzel (Abw)",0,0,null,null,null,null,null,null,null,null,null,null,null,null,null,0]
[]
[null,null,null,null,null,null,null,null,null,null,null,null,null,"Übersicht"]
[]
[null,{"$f":"+'Spielbogen 7er'!N4","v":"OT"},null,null,{"$f":"+'Spielbogen 7er'!N5","v":"OT"},null,null,{"$f":"+'Spielbogen 7er'!N6","v":"WB"},null,null,{"$f":"+'Spielbogen 7er'!N7","v":"OT"},null,null,{"$f":"+'Spielbogen 7er'!N8","v":"WB"},null,null,{"$f":"+'Spielbogen 7er'!N9","v":"WB"},null,null,{"$f":"+'Spielbogen 7er'!N10","v":"OT"},null,null,{"$f":"+'Spielbogen 7er'!N11","v":"WB"},null,null,{"$f":"+'Spielbogen 7er'!N12","v":"OT"},null,null,{"$f":"+'Spielbogen 7er'!N13","v":"WB"},null,null,{"$f":"+'Spielbogen 7er'!N14","v":"OT"},null,null,{"$f":"+'Spielbogen 7er'!N15","v":"WB"},null,null,{"$f":"+'Spielbogen 7er'!N16","v":"OT"},null,null,{"$f":"+'Spielbogen 7er'!N17","v":"WB"}]
[null,"1. Antritt",null,null,"2. Antritt",null,null,"3. Antritt",null,null,"4. Antritt",null,null,"5. Antritt",null,null,"6. Antritt",null,null,"7. Antritt",null,null,"8. Antritt",null,null,"9. Antritt",null,null,"10. Antritt",null,null,"11. Antritt",null,null,"12. Antritt",null,null,"13. Antritt",null,null,"14. Antritt"]
[null,{"$f":"+F7","v":"2024-09-12"},null,null,{"$f":"+O7","v":"2024-09-26"},null,null,{"$f":"+X7","v":"2024-10-10"},null,null,{"$f":"+AG7","v":"2024-10-24"},null,null,{"$f":"+AP7","v":"2024-11-07"},null,null,{"$f":"+AY7","v":"2025-01-16"},null,null,{"$f":"+F23","v":"2025-01-30"},null,null,{"$f":"+O23","v":"2025-02-13"},null,null,{"$f":"+X23","v":"2025-02-27"},null,null,{"$f":"+AG23","v":"2025-03-13"},null,null,{"$f":"+AP23","v":"2025-03-27"},null,null,{"$f":"+AY23","v":"2025-04-10"},null,null,{"$f":"+F37","v":"2025-04-24"},null,null,{"$f":"+O37","v":"2025-05-08"}]
[null,{"$f":"_xlfn.IFS($B$8=\"Annegret Schmidt\",\"Anne\",$B$8=\"Ilona Wetzel\",\"Ilona\",$B$8=\"Michael Wetzel\",\"Michael\",$B$8=\"Mario Jurk\",\"Mario\",$B$8=\"Kai Roßberg\",\"Kai\",$B$8=\"Deniz Hagelstein\",\"Deniz\",$B$8=\"Frank Nijholt\",\"Frank\",$B$8=\"Matthias Nolte\",\"Matthias\",$B$8=\"Jörg Frahm\",\"Jörg\")","v":"Anne"},null,null,{"$f":"_xlfn.IFS(K8=\"Annegret Schmidt\",\"Anne\",K8=\"Ilona Wetzel\",\"Ilona\",K8=\"Michael Wetzel\",\"Michael\",K8=\"Mario Jurk\",\"Mario\",K8=\"Kai Roßberg\",\"Kai\",K8=\"Deniz Hagelstein\",\"Deniz\",K8=\"Frank Nijholt\",\"Frank\",K8=\"Matthias Nolte\",\"Matthias\",K8=\"Jörg Frahm\",\"Jörg\")","v":"Matthias"},null,null,{"$f":"_xlfn.IFS(T8=\"Annegret Schmidt\",\"Anne\",T8=\"Ilona Wetzel\",\"Ilona\",T8=\"Michael Wetzel\",\"Michael\",T8=\"Mario Jurk\",\"Mario\",T8=\"Kai Roßberg\",\"Kai\",T8=\"Deniz Hagelstein\",\"Deniz\",T8=\"Frank Nijholt\",\"Frank\",T8=\"Matthias Nolte\",\"Matthias\",T8=\"Jörg Frahm\",\"Jörg\")","v":"Ilona"},null,null,{"$f":"_xlfn.IFS(AC8=\"Annegret Schmidt\",\"Anne\",AC8=\"Ilona Wetzel\",\"Ilona\",AC8=\"Michael Wetzel\",\"Michael\",AC8=\"Mario Jurk\",\"Mario\",AC8=\"Kai Roßberg\",\"Kai\",AC8=\"Deniz Hagelstein\",\"Deniz\",AC8=\"Frank Nijholt\",\"Frank\",AC8=\"Matthias Nolte\",\"Matthias\",AC8=\"Jörg Frahm\",\"Jörg\")","v":"Matthias"},null,null,{"$f":"_xlfn.IFS(AL8=\"Annegret Schmidt\",\"Anne\",AL8=\"Ilona Wetzel\",\"Ilona\",AL8=\"Michael Wetzel\",\"Michael\",AL8=\"Mario Jurk\",\"Mario\",AL8=\"Kai Roßberg\",\"Kai\",AL8=\"Deniz Hagelstein\",\"Deniz\",AL8=\"Frank Nijholt\",\"Frank\",AL8=\"Matthias Nolte\",\"Matthias\",AL8=\"Jörg Frahm\",\"Jörg\")","v":"Frank"},null,null,{"$f":"_xlfn.IFS(AU8=\"Annegret Schmidt\",\"Anne\",AU8=\"Ilona Wetzel\",\"Ilona\",AU8=\"Michael Wetzel\",\"Michael\",AU8=\"Mario Jurk\",\"Mario\",AU8=\"Kai Roßberg\",\"Kai\",AU8=\"Deniz Hagelstein\",\"Deniz\",AU8=\"Frank Nijholt\",\"Frank\",AU8=\"Matthias Nolte\",\"Matthias\",AU8=\"Jörg Frahm\",\"Jörg\")","v":"Anne"},null,null,{"$f":"_xlfn.IFS(B24=\"Annegret Schmidt\",\"Anne\",B24=\"Ilona Wetzel\",\"Ilona\",B24=\"Michael Wetzel\",\"Michael\",B24=\"Mario Jurk\",\"Mario\",B24=\"Kai Roßberg\",\"Kai\",B24=\"Deniz Hagelstein\",\"Deniz\",B24=\"Frank Nijholt\",\"Frank\",B24=\"Matthias Nolte\",\"Matthias\",B24=\"Jörg Frahm\",\"Jörg\")","v":"Anne"},null,null,{"$f":"_xlfn.IFS(K24=\"Annegret Schmidt\",\"Anne\",K24=\"Ilona Wetzel\",\"Ilona\",K24=\"Michael Wetzel\",\"Michael\",K24=\"Mario Jurk\",\"Mario\",K24=\"Kai Roßberg\",\"Kai\",K24=\"Deniz Hagelstein\",\"Deniz\",K24=\"Frank Nijholt\",\"Frank\",K24=\"Matthias Nolte\",\"Matthias\",K24=\"Jörg Frahm\",\"Jörg\")","v":"Anne"},null,null,{"$f":"_xlfn.IFS(T24=\"Annegret Schmidt\",\"Anne\",T24=\"Ilona Wetzel\",\"Ilona\",T24=\"Michael Wetzel\",\"Michael\",T24=\"Mario Jurk\",\"Mario\",T24=\"Kai Roßberg\",\"Kai\",T24=\"Deniz Hagelstein\",\"Deniz\",T24=\"Frank Nijholt\",\"Frank\",T24=\"Matthias Nolte\",\"Matthias\",T24=\"Jörg Frahm\",\"Jörg\")","v":"Anne"},null,null,{"$f":"_xlfn.IFS(AC24=\"Annegret Schmidt\",\"Anne\",AC24=\"Ilona Wetzel\",\"Ilona\",AC24=\"Michael Wetzel\",\"Michael\",AC24=\"Mario Jurk\",\"Mario\",AC24=\"Kai Roßberg\",\"Kai\",AC24=\"Deniz Hagelstein\",\"Deniz\",AC24=\"Frank Nijholt\",\"Frank\",AC24=\"Matthias Nolte\",\"Matthias\",AC24=\"Jörg Frahm\",\"Jörg\")","v":"Anne"},null,null,{"$f":"_xlfn.IFS(AL24=\"Annegret Schmidt\",\"Anne\",AL24=\"Ilona Wetzel\",\"Ilona\",AL24=\"Michael Wetzel\",\"Michael\",AL24=\"Mario Jurk\",\"Mario\",AL24=\"Kai Roßberg\",\"Kai\",AL24=\"Deniz Hagelstein\",\"Deniz\",AL24=\"Frank Nijholt\",\"Frank\",AL24=\"Matthias Nolte\",\"Matthias\",AL24=\"Jörg Frahm\",\"Jörg\")","v":"Matthias"},null,null,{"$f":"_xlfn.IFS(AU24=\"Annegret Schmidt\",\"Anne\",AU24=\"Ilona Wetzel\",\"Ilona\",AU24=\"Michael Wetzel\",\"Michael\",AU24=\"Mario Jurk\",\"Mario\",AU24=\"Kai Roßberg\",\"Kai\",AU24=\"Deniz Hagelstein\",\"Deniz\",AU24=\"Frank Nijholt\",\"Frank\",AU24=\"Matthias Nolte\",\"Matthias\",AU24=\"Jörg Frahm\",\"Jörg\")","v":"Frank"},null,null,{"$f":"_xlfn.IFS(B38=\"Annegret Schmidt\",\"Anne\",B38=\"Ilona Wetzel\",\"Ilona\",B38=\"Michael Wetzel\",\"Michael\",B38=\"Mario Jurk\",\"Mario\",B38=\"Kai Roßberg\",\"Kai\",B38=\"Deniz Hagelstein\",\"Deniz\",B38=\"Frank Nijholt\",\"Frank\",B38=\"Matthias Nolte\",\"Matthias\",B38=\"Jörg Frahm\",\"Jörg\")","v":"Matthias"},null,null,{"$f":"_xlfn.IFS(K38=\"Annegret Schmidt\",\"Anne\",K38=\"Ilona Wetzel\",\"Ilona\",K38=\"Michael Wetzel\",\"Michael\",K38=\"Mario Jurk\",\"Mario\",K38=\"Kai Roßberg\",\"Kai\",K38=\"Deniz Hagelstein\",\"Deniz\",K38=\"Frank Nijholt\",\"Frank\",K38=\"Matthias Nolte\",\"Matthias\",K38=\"Jörg Frahm\",\"Jörg\")","v":"Anne"}]
[null,{"$f":"_xlfn.IFS($B$9=\"Annegret Schmidt\",\"Anne\",$B$9=\"Ilona Wetzel\",\"Ilona\",$B$9=\"Michael Wetzel\",\"Michael\",$B$9=\"Mario Jurk\",\"Mario\",$B$9=\"Kai Roßberg\",\"Kai\",$B$9=\"Deniz Hagelstein\",\"Deniz\",$B$9=\"Frank Nijholt\",\"Frank\",$B$9=\"Matthias Nolte\",\"Matthias\",$B$9=\"Jörg Frahm\",\"Jörg\")","v":"Ilona"},null,null,{"$f":"_xlfn.IFS(K9=\"Annegret Schmidt\",\"Anne\",K9=\"Ilona Wetzel\",\"Ilona\",K9=\"Michael Wetzel\",\"Michael\",K9=\"Mario Jurk\",\"Mario\",K9=\"Kai Roßberg\",\"Kai\",K9=\"Deniz Hagelstein\",\"Deniz\",K9=\"Frank Nijholt\",\"Frank\",K9=\"Matthias Nolte\",\"Matthias\",K9=\"Jörg Frahm\",\"Jörg\")","v":"Deniz"},null,null,{"$f":"_xlfn.IFS(T9=\"Annegret Schmidt\",\"Anne\",T9=\"Ilona Wetzel\",\"Ilona\",T9=\"Michael Wetzel\",\"Michael\",T9=\"Mario Jurk\",\"Mario\",T9=\"Kai Roßberg\",\"Kai\",T9=\"Deniz Hagelstein\",\"Deniz\",T9=\"Frank Nijholt\",\"Frank\",T9=\"Matthias Nolte\",\"Matthias\",T9=\"Jörg Frahm\",\"Jörg\")","v":"Anne"},null,null,{"$f":"_xlfn.IFS(AC9=\"Annegret Schmidt\",\"Anne\",AC9=\"Ilona Wetzel\",\"Ilona\",AC9=\"Michael Wetzel\",\"Michael\",AC9=\"Mario Jurk\",\"Mario\",AC9=\"Kai Roßberg\",\"Kai\",AC9=\"Deniz Hagelstein\",\"Deniz\",AC9=\"Frank Nijholt\",\"Frank\",AC9=\"Matthias Nolte\",\"Matthias\",AC9=\"Jörg Frahm\",\"Jörg\")","v":"Deniz"},null,null,{"$f":"_xlfn.IFS(AL9=\"Annegret Schmidt\",\"Anne\",AL9=\"Ilona Wetzel\",\"Ilona\",AL9=\"Michael Wetzel\",\"Michael\",AL9=\"Mario Jurk\",\"Mario\",AL9=\"Kai Roßberg\",\"Kai\",AL9=\"Deniz Hagelstein\",\"Deniz\",AL9=\"Frank Nijholt\",\"Frank\",AL9=\"Matthias Nolte\",\"Matthias\",AL9=\"Jörg Frahm\",\"Jörg\")","v":"Ilona"},null,null,{"$f":"_xlfn.IFS(AU9=\"Annegret Schmidt\",\"Anne\",AU9=\"Ilona Wetzel\",\"Ilona\",AU9=\"Michael Wetzel\",\"Michael\",AU9=\"Mario Jurk\",\"Mario\",AU9=\"Kai Roßberg\",\"Kai\",AU9=\"Deniz Hagelstein\",\"Deniz\",AU9=\"Frank Nijholt\",\"Frank\",AU9=\"Matthias Nolte\",\"Matthias\",AU9=\"Jörg Frahm\",\"Jörg\")","v":"Frank"},null,null,{"$f":"_xlfn.IFS(B25=\"Annegret Schmidt\",\"Anne\",B25=\"Ilona Wetzel\",\"Ilona\",B25=\"Michael Wetzel\",\"Michael\",B25=\"Mario Jurk\",\"Mario\",B25=\"Kai Roßberg\",\"Kai\",B25=\"Deniz Hagelstein\",\"Deniz\",B25=\"Frank Nijholt\",\"Frank\",B25=\"Matthias Nolte\",\"Matthias\",B25=\"Jörg Frahm\",\"Jörg\")","v":"Deniz"},null,null,{"$f":"_xlfn.IFS(K25=\"Annegret Schmidt\",\"Anne\",K25=\"Ilona Wetzel\",\"Ilona\",K25=\"Michael Wetzel\",\"Michael\",K25=\"Mario Jurk\",\"Mario\",K25=\"Kai Roßberg\",\"Kai\",K25=\"Deniz Hagelstein\",\"Deniz\",K25=\"Frank Nijholt\",\"Frank\",K25=\"Matthias Nolte\",\"Matthias\",K25=\"Jörg Frahm\",\"Jörg\")","v":"Ilona"},null,null,{"$f":"_xlfn.IFS(T25=\"Annegret Schmidt\",\"Anne\",T25=\"Ilona Wetzel\",\"Ilona\",T25=\"Michael Wetzel\",\"Michael\",T25=\"Mario Jurk\",\"Mario\",T25=\"Kai Roßberg\",\"Kai\",T25=\"Deniz Hagelstein\",\"Deniz\",T25=\"Frank Nijholt\",\"Frank\",T25=\"Matthias Nolte\",\"Matthias\",T25=\"Jörg Frahm\",\"Jörg\")","v":"Jörg"},null,null,{"$f":"_xlfn.IFS(AC25=\"Annegret Schmidt\",\"Anne\",AC25=\"Ilona Wetzel\",\"Ilona\",AC25=\"Michael Wetzel\",\"Michael\",AC25=\"Mario Jurk\",\"Mario\",AC25=\"Kai Roßberg\",\"Kai\",AC25=\"Deniz Hagelstein\",\"Deniz\",AC25=\"Frank Nijholt\",\"Frank\",AC25=\"Matthias Nolte\",\"Matthias\",AC25=\"Jörg Frahm\",\"Jörg\")","v":"Frank"},null,null,{"$f":"_xlfn.IFS(AL25=\"Annegret Schmidt\",\"Anne\",AL25=\"Ilona Wetzel\",\"Ilona\",AL25=\"Michael Wetzel\",\"Michael\",AL25=\"Mario Jurk\",\"Mario\",AL25=\"Kai Roßberg\",\"Kai\",AL25=\"Deniz Hagelstein\",\"Deniz\",AL25=\"Frank Nijholt\",\"Frank\",AL25=\"Matthias Nolte\",\"Matthias\",AL25=\"Jörg Frahm\",\"Jörg\")","v":"Deniz"},null,null,{"$f":"_xlfn.IFS(AU25=\"Annegret Schmidt\",\"Anne\",AU25=\"Ilona Wetzel\",\"Ilona\",AU25=\"Michael Wetzel\",\"Michael\",AU25=\"Mario Jurk\",\"Mario\",AU25=\"Kai Roßberg\",\"Kai\",AU25=\"Deniz Hagelstein\",\"Deniz\",AU25=\"Frank Nijholt\",\"Frank\",AU25=\"Matthias Nolte\",\"Matthias\",AU25=\"Jörg Frahm\",\"Jörg\")","v":"Deniz"},null,null,{"$f":"_xlfn.IFS(B39=\"Annegret Schmidt\",\"Anne\",B39=\"Ilona Wetzel\",\"Ilona\",B39=\"Michael Wetzel\",\"Michael\",B39=\"Mario Jurk\",\"Mario\",B39=\"Kai Roßberg\",\"Kai\",B39=\"Deniz Hagelstein\",\"Deniz\",B39=\"Frank Nijholt\",\"Frank\",B39=\"Matthias Nolte\",\"Matthias\",B39=\"Jörg Frahm\",\"Jörg\")","v":"Jörg"},null,null,{"$f":"_xlfn.IFS(K39=\"Annegret Schmidt\",\"Anne\",K39=\"Ilona Wetzel\",\"Ilona\",K39=\"Michael Wetzel\",\"Michael\",K39=\"Mario Jurk\",\"Mario\",K39=\"Kai Roßberg\",\"Kai\",K39=\"Deniz Hagelstein\",\"Deniz\",K39=\"Frank Nijholt\",\"Frank\",K39=\"Matthias Nolte\",\"Matthias\",K39=\"Jörg Frahm\",\"Jörg\")","v":"Deniz"}]
[null,{"$f":"_xlfn.IFS($B$10=\"Annegret Schmidt\",\"Anne\",$B$10=\"Ilona Wetzel\",\"Ilona\",$B$10=\"Michael Wetzel\",\"Michael\",$B$10=\"Mario Jurk\",\"Mario\",$B$10=\"Kai Roßberg\",\"Kai\",$B$10=\"Deniz Hagelstein\",\"Deniz\",$B$10=\"Frank Nijholt\",\"Frank\",$B$10=\"Matthias Nolte\",\"Matthias\",$B$10=\"Jörg Frahm\",\"Jörg\")","v":"Michael"},null,null,{"$f":"_xlfn.IFS(K10=\"Annegret Schmidt\",\"Anne\",K10=\"Ilona Wetzel\",\"Ilona\",K10=\"Michael Wetzel\",\"Michael\",K10=\"Mario Jurk\",\"Mario\",K10=\"Kai Roßberg\",\"Kai\",K10=\"Deniz Hagelstein\",\"Deniz\",K10=\"Frank Nijholt\",\"Frank\",K10=\"Matthias Nolte\",\"Matthias\",K10=\"Jörg Frahm\",\"Jörg\")","v":"Mario"},null,null,{"$f":"_xlfn.IFS(T10=\"Annegret Schmidt\",\"Anne\",T10=\"Ilona Wetzel\",\"Ilona\",T10=\"Michael Wetzel\",\"Michael\",T10=\"Mario Jurk\",\"Mario\",T10=\"Kai Roßberg\",\"Kai\",T10=\"Deniz Hagelstein\",\"Deniz\",T10=\"Frank Nijholt\",\"Frank\",T10=\"Matthias Nolte\",\"Matthias\",T10=\"Jörg Frahm\",\"Jörg\")","v":"Michael"},null,null,{"$f":"_xlfn.IFS(AC10=\"Annegret Schmidt\",\"Anne\",AC10=\"Ilona Wetzel\",\"Ilona\",AC10=\"Michael Wetzel\",\"Michael\",AC10=\"Mario Jurk\",\"Mario\",AC10=\"Kai Roßberg\",\"Kai\",AC10=\"Deniz Hagelstein\",\"Deniz\",AC10=\"Frank Nijholt\",\"Frank\",AC10=\"Matthias Nolte\",\"Matthias\",AC10=\"Jörg Frahm\",\"Jörg\")","v":"Frank"},null,null,{"$f":"_xlfn.IFS(AL10=\"Annegret Schmidt\",\"Anne\",AL10=\"Ilona Wetzel\",\"Ilona\",AL10=\"Michael Wetzel\",\"Michael\",AL10=\"Mario Jurk\",\"Mario\",AL10=\"Kai Roßberg\",\"Kai\",AL10=\"Deniz Hagelstein\",\"Deniz\",AL10=\"Frank Nijholt\",\"Frank\",AL10=\"Matthias Nolte\",\"Matthias\",AL10=\"Jörg Frahm\",\"Jörg\")","v":"Mario"},null,null,{"$f":"_xlfn.IFS(AU10=\"Annegret Schmidt\",\"Anne\",AU10=\"Ilona Wetzel\",\"Ilona\",AU10=\"Michael Wetzel\",\"Michael\",AU10=\"Mario Jurk\",\"Mario\",AU10=\"Kai Roßberg\",\"Kai\",AU10=\"Deniz Hagelstein\",\"Deniz\",AU10=\"Frank Nijholt\",\"Frank\",AU10=\"Matthias Nolte\",\"Matthias\",AU10=\"Jörg Frahm\",\"Jörg\")","v":"Mario"},null,null,{"$f":"_xlfn.IFS(B26=\"Annegret Schmidt\",\"Anne\",B26=\"Ilona Wetzel\",\"Ilona\",B26=\"Michael Wetzel\",\"Michael\",B26=\"Mario Jurk\",\"Mario\",B26=\"Kai Roßberg\",\"Kai\",B26=\"Deniz Hagelstein\",\"Deniz\",B26=\"Frank Nijholt\",\"Frank\",B26=\"Matthias Nolte\",\"Matthias\",B26=\"Jörg Frahm\",\"Jörg\")","v":"Mario"},null,null,{"$f":"_xlfn.IFS(K26=\"Annegret Schmidt\",\"Anne\",K26=\"Ilona Wetzel\",\"Ilona\",K26=\"Michael Wetzel\",\"Michael\",K26=\"Mario Jurk\",\"Mario\",K26=\"Kai Roßberg\",\"Kai\",K26=\"Deniz Hagelstein\",\"Deniz\",K26=\"Frank Nijholt\",\"Frank\",K26=\"Matthias Nolte\",\"Matthias\",K26=\"Jörg Frahm\",\"Jörg\")","v":"Deniz"},null,null,{"$f":"_xlfn.IFS(T26=\"Annegret Schmidt\",\"Anne\",T26=\"Ilona Wetzel\",\"Ilona\",T26=\"Michael Wetzel\",\"Michael\",T26=\"Mario Jurk\",\"Mario\",T26=\"Kai Roßberg\",\"Kai\",T26=\"Deniz Hagelstein\",\"Deniz\",T26=\"Frank Nijholt\",\"Frank\",T26=\"Matthias Nolte\",\"Matthias\",T26=\"Jörg Frahm\",\"Jörg\")","v":"Mario"},null,null,{"$f":"_xlfn.IFS(AC26=\"Annegret Schmidt\",\"Anne\",AC26=\"Ilona Wetzel\",\"Ilona\",AC26=\"Michael Wetzel\",\"Michael\",AC26=\"Mario Jurk\",\"Mario\",AC26=\"Kai Roßberg\",\"Kai\",AC26=\"Deniz Hagelstein\",\"Deniz\",AC26=\"Frank Nijholt\",\"Frank\",AC26=\"Matthias Nolte\",\"Matthias\",AC26=\"Jörg Frahm\",\"Jörg\")","v":"Jörg"},null,null,{"$f":"_xlfn.IFS(AL26=\"Annegret Schmidt\",\"Anne\",AL26=\"Ilona Wetzel\",\"Ilona\",AL26=\"Michael Wetzel\",\"Michael\",AL26=\"Mario Jurk\",\"Mario\",AL26=\"Kai Roßberg\",\"Kai\",AL26=\"Deniz Hagelstein\",\"Deniz\",AL26=\"Frank Nijholt\",\"Frank\",AL26=\"Matthias Nolte\",\"Matthias\",AL26=\"Jörg Frahm\",\"Jörg\")","v":"Jörg"},null,null,{"$f":"_xlfn.IFS(AU26=\"Annegret Schmidt\",\"Anne\",AU26=\"Ilona Wetzel\",\"Ilona\",AU26=\"Michael Wetzel\",\"Michael\",AU26=\"Mario Jurk\",\"Mario\",AU26=\"Kai Roßberg\",\"Kai\",AU26=\"Deniz Hagelstein\",\"Deniz\",AU26=\"Frank Nijholt\",\"Frank\",AU26=\"Matthias Nolte\",\"Matthias\",AU26=\"Jörg Frahm\",\"Jörg\")","v":"Jörg"},null,null,{"$f":"_xlfn.IFS(B40=\"Annegret Schmidt\",\"Anne\",B40=\"Ilona Wetzel\",\"Ilona\",B40=\"Michael Wetzel\",\"Michael\",B40=\"Mario Jurk\",\"Mario\",B40=\"Kai Roßberg\",\"Kai\",B40=\"Deniz Hagelstein\",\"Deniz\",B40=\"Frank Nijholt\",\"Frank\",B40=\"Matthias Nolte\",\"Matthias\",B40=\"Jörg Frahm\",\"Jörg\")","v":"Michael"},null,null,{"$f":"_xlfn.IFS(K40=\"Annegret Schmidt\",\"Anne\",K40=\"Ilona Wetzel\",\"Ilona\",K40=\"Michael Wetzel\",\"Michael\",K40=\"Mario Jurk\",\"Mario\",K40=\"Kai Roßberg\",\"Kai\",K40=\"Deniz Hagelstein\",\"Deniz\",K40=\"Frank Nijholt\",\"Frank\",K40=\"Matthias Nolte\",\"Matthias\",K40=\"Jörg Frahm\",\"Jörg\")","v":"Mario"}]
[null,{"$f":"_xlfn.IFS(B11=\"Annegret Schmidt\",\"Anne\",B11=\"Ilona Wetzel\",\"Ilona\",B11=\"Michael Wetzel\",\"Michael\",B11=\"Mario Jurk\",\"Mario\",B11=\"Kai Roßberg\",\"Kai\",B11=\"Deniz Hagelstein\",\"Deniz\",B11=\"Frank Nijholt\",\"Frank\",B11=\"Matthias Nolte\",\"Matthias\",B11=\"Jörg Frahm\",\"Jörg\")","v":"Kai"},null,null,{"$f":"_xlfn.IFS(K11=\"Annegret Schmidt\",\"Anne\",K11=\"Ilona Wetzel\",\"Ilona\",K11=\"Michael Wetzel\",\"Michael\",K11=\"Mario Jurk\",\"Mario\",K11=\"Kai Roßberg\",\"Kai\",K11=\"Deniz Hagelstein\",\"Deniz\",K11=\"Frank Nijholt\",\"Frank\",K11=\"Matthias Nolte\",\"Matthias\",K11=\"Jörg Frahm\",\"Jörg\")","v":"Kai"},null,null,{"$f":"_xlfn.IFS(T11=\"Annegret Schmidt\",\"Anne\",T11=\"Ilona Wetzel\",\"Ilona\",T11=\"Michael Wetzel\",\"Michael\",T11=\"Mario Jurk\",\"Mario\",T11=\"Kai Roßberg\",\"Kai\",T11=\"Deniz Hagelstein\",\"Deniz\",T11=\"Frank Nijholt\",\"Frank\",T11=\"Matthias Nolte\",\"Matthias\",T11=\"Jörg Frahm\",\"Jörg\")","v":"Kai"},null,null,{"$f":"_xlfn.IFS(AC11=\"Annegret Schmidt\",\"Anne\",AC11=\"Ilona Wetzel\",\"Ilona\",AC11=\"Michael Wetzel\",\"Michael\",AC11=\"Mario Jurk\",\"Mario\",AC11=\"Kai Roßberg\",\"Kai\",AC11=\"Deniz Hagelstein\",\"Deniz\",AC11=\"Frank Nijholt\",\"Frank\",AC11=\"Matthias Nolte\",\"Matthias\",AC11=\"Jörg Frahm\",\"Jörg\")","v":"Michael"},null,null,{"$f":"_xlfn.IFS(AL11=\"Annegret Schmidt\",\"Anne\",AL11=\"Ilona Wetzel\",\"Ilona\",AL11=\"Michael Wetzel\",\"Michael\",AL11=\"Mario Jurk\",\"Mario\",AL11=\"Kai Roßberg\",\"Kai\",AL11=\"Deniz Hagelstein\",\"Deniz\",AL11=\"Frank Nijholt\",\"Frank\",AL11=\"Matthias Nolte\",\"Matthias\",AL11=\"Jörg Frahm\",\"Jörg\")","v":"Kai"},null,null,{"$f":"_xlfn.IFS(AU11=\"Annegret Schmidt\",\"Anne\",AU11=\"Ilona Wetzel\",\"Ilona\",AU11=\"Michael Wetzel\",\"Michael\",AU11=\"Mario Jurk\",\"Mario\",AU11=\"Kai Roßberg\",\"Kai\",AU11=\"Deniz Hagelstein\",\"Deniz\",AU11=\"Frank Nijholt\",\"Frank\",AU11=\"Matthias Nolte\",\"Matthias\",AU11=\"Jörg Frahm\",\"Jörg\")","v":"Kai"},null,null,{"$f":"_xlfn.IFS(B27=\"Annegret Schmidt\",\"Anne\",B27=\"Ilona Wetzel\",\"Ilona\",B27=\"Michael Wetzel\",\"Michael\",B27=\"Mario Jurk\",\"Mario\",B27=\"Kai Roßberg\",\"Kai\",B27=\"Deniz Hagelstein\",\"Deniz\",B27=\"Frank Nijholt\",\"Frank\",B27=\"Matthias Nolte\",\"Matthias\",B27=\"Jörg Frahm\",\"Jörg\")","v":"Kai"},null,null,{"$f":"_xlfn.IFS(K27=\"Annegret Schmidt\",\"Anne\",K27=\"Ilona Wetzel\",\"Ilona\",K27=\"Michael Wetzel\",\"Michael\",K27=\"Mario Jurk\",\"Mario\",K27=\"Kai Roßberg\",\"Kai\",K27=\"Deniz Hagelstein\",\"Deniz\",K27=\"Frank Nijholt\",\"Frank\",K27=\"Matthias Nolte\",\"Matthias\",K27=\"Jörg Frahm\",\"Jörg\")","v":"Kai"},null,null,{"$f":"_xlfn.IFS(T27=\"Annegret Schmidt\",\"Anne\",T27=\"Ilona Wetzel\",\"Ilona\",T27=\"Michael Wetzel\",\"Michael\",T27=\"Mario Jurk\",\"Mario\",T27=\"Kai Roßberg\",\"Kai\",T27=\"Deniz Hagelstein\",\"Deniz\",T27=\"Frank Nijholt\",\"Frank\",T27=\"Matthias Nolte\",\"Matthias\",T27=\"Jörg Frahm\",\"Jörg\")","v":"Kai"},null,null,{"$f":"_xlfn.IFS(AC27=\"Annegret Schmidt\",\"Anne\",AC27=\"Ilona Wetzel\",\"Ilona\",AC27=\"Michael Wetzel\",\"Michael\",AC27=\"Mario Jurk\",\"Mario\",AC27=\"Kai Roßberg\",\"Kai\",AC27=\"Deniz Hagelstein\",\"Deniz\",AC27=\"Frank Nijholt\",\"Frank\",AC27=\"Matthias Nolte\",\"Matthias\",AC27=\"Jörg Frahm\",\"Jörg\")","v":"Kai"},null,null,{"$f":"_xlfn.IFS(AL27=\"Annegret Schmidt\",\"Anne\",AL27=\"Ilona Wetzel\",\"Ilona\",AL27=\"Michael Wetzel\",\"Michael\",AL27=\"Mario Jurk\",\"Mario\",AL27=\"Kai Roßberg\",\"Kai\",AL27=\"Deniz Hagelstein\",\"Deniz\",AL27=\"Frank Nijholt\",\"Frank\",AL27=\"Matthias Nolte\",\"Matthias\",AL27=\"Jörg Frahm\",\"Jörg\")","v":"Kai"},null,null,{"$f":"_xlfn.IFS(AU27=\"Annegret Schmidt\",\"Anne\",AU27=\"Ilona Wetzel\",\"Ilona\",AU27=\"Michael Wetzel\",\"Michael\",AU27=\"Mario Jurk\",\"Mario\",AU27=\"Kai Roßberg\",\"Kai\",AU27=\"Deniz Hagelstein\",\"Deniz\",AU27=\"Frank Nijholt\",\"Frank\",AU27=\"Matthias Nolte\",\"Matthias\",AU27=\"Jörg Frahm\",\"Jörg\")","v":"Kai"},null,null,{"$f":"_xlfn.IFS(B41=\"Annegret Schmidt\",\"Anne\",B41=\"Ilona Wetzel\",\"Ilona\",B41=\"Michael Wetzel\",\"Michael\",B41=\"Mario Jurk\",\"Mario\",B41=\"Kai Roßberg\",\"Kai\",B41=\"Deniz Hagelstein\",\"Deniz\",B41=\"Frank Nijholt\",\"Frank\",B41=\"Matthias Nolte\",\"Matthias\",B41=\"Jörg Frahm\",\"Jörg\")","v":"Kai"},null,null,{"$f":"_xlfn.IFS(K41=\"Annegret Schmidt\",\"Anne\",K41=\"Ilona Wetzel\",\"Ilona\",K41=\"Michael Wetzel\",\"Michael\",K41=\"Mario Jurk\",\"Mario\",K41=\"Kai Roßberg\",\"Kai\",K41=\"Deniz Hagelstein\",\"Deniz\",K41=\"Frank Nijholt\",\"Frank\",K41=\"Matthias Nolte\",\"Matthias\",K41=\"Jörg Frahm\",\"Jörg\")","v":"Kai"}]
[]
[null,{"$f":"_xlfn.IFS(B13=\"Annegret Schmidt\",\"Anne\",B13=\"Ilona Wetzel\",\"Ilona\",B13=\"Michael Wetzel\",\"Michael\",B13=\"Mario Jurk\",\"Mario\",B13=\"Kai Roßberg\",\"Kai\",B13=\"Deniz Hagelstein\",\"Deniz\",B13=\"Frank Nijholt\",\"Frank\",B13=\"Matthias Nolte\",\"Matthias\",B13=\"Jörg Frahm\",\"Jörg\")","v":"Michael"},null,null,{"$f":"_xlfn.IFS(K13=\"Annegret Schmidt\",\"Anne\",K13=\"Ilona Wetzel\",\"Ilona\",K13=\"Michael Wetzel\",\"Michael\",K13=\"Mario Jurk\",\"Mario\",K13=\"Kai Roßberg\",\"Kai\",K13=\"Deniz Hagelstein\",\"Deniz\",K13=\"Frank Nijholt\",\"Frank\",K13=\"Matthias Nolte\",\"Matthias\",K13=\"Jörg Frahm\",\"Jörg\")","v":"Michael"},null,null,{"$f":"_xlfn.IFS(T13=\"Annegret Schmidt\",\"Anne\",T13=\"Ilona Wetzel\",\"Ilona\",T13=\"Michael Wetzel\",\"Michael\",T13=\"Mario Jurk\",\"Mario\",T13=\"Kai Roßberg\",\"Kai\",T13=\"Deniz Hagelstein\",\"Deniz\",T13=\"Frank Nijholt\",\"Frank\",T13=\"Matthias Nolte\",\"Matthias\",T13=\"Jörg Frahm\",\"Jörg\")","v":"Matthias"},null,null,{"$f":"_xlfn.IFS(AC13=\"Annegret Schmidt\",\"Anne\",AC13=\"Ilona Wetzel\",\"Ilona\",AC13=\"Michael Wetzel\",\"Michael\",AC13=\"Mario Jurk\",\"Mario\",AC13=\"Kai Roßberg\",\"Kai\",AC13=\"Deniz Hagelstein\",\"Deniz\",AC13=\"Frank Nijholt\",\"Frank\",AC13=\"Matthias Nolte\",\"Matthias\",AC13=\"Jörg Frahm\",\"Jörg\")","v":"Ilona"},null,null,{"$f":"_xlfn.IFS(AL13=\"Annegret Schmidt\",\"Anne\",AL13=\"Ilona Wetzel\",\"Ilona\",AL13=\"Michael Wetzel\",\"Michael\",AL13=\"Mario Jurk\",\"Mario\",AL13=\"Kai Roßberg\",\"Kai\",AL13=\"Deniz Hagelstein\",\"Deniz\",AL13=\"Frank Nijholt\",\"Frank\",AL13=\"Matthias Nolte\",\"Matthias\",AL13=\"Jörg Frahm\",\"Jörg\")","v":"Anne"},null,null,{"$f":"_xlfn.IFS(AU13=\"Annegret Schmidt\",\"Anne\",AU13=\"Ilona Wetzel\",\"Ilona\",AU13=\"Michael Wetzel\",\"Michael\",AU13=\"Mario Jurk\",\"Mario\",AU13=\"Kai Roßberg\",\"Kai\",AU13=\"Deniz Hagelstein\",\"Deniz\",AU13=\"Frank Nijholt\",\"Frank\",AU13=\"Matthias Nolte\",\"Matthias\",AU13=\"Jörg Frahm\",\"Jörg\")","v":"Ilona"},null,null,{"$f":"_xlfn.IFS(B29=\"Annegret Schmidt\",\"Anne\",B29=\"Ilona Wetzel\",\"Ilona\",B29=\"Michael Wetzel\",\"Michael\",B29=\"Mario Jurk\",\"Mario\",B29=\"Kai Roßberg\",\"Kai\",B29=\"Deniz Hagelstein\",\"Deniz\",B29=\"Frank Nijholt\",\"Frank\",B29=\"Matthias Nolte\",\"Matthias\",B29=\"Jörg Frahm\",\"Jörg\")","v":"Ilona"},null,null,{"$f":"_xlfn.IFS(K29=\"Annegret Schmidt\",\"Anne\",K29=\"Ilona Wetzel\",\"Ilona\",K29=\"Michael Wetzel\",\"Michael\",K29=\"Mario Jurk\",\"Mario\",K29=\"Kai Roßberg\",\"Kai\",K29=\"Deniz Hagelstein\",\"Deniz\",K29=\"Frank Nijholt\",\"Frank\",K29=\"Matthias Nolte\",\"Matthias\",K29=\"Jörg Frahm\",\"Jörg\")","v":"Frank"},null,null,{"$f":"_xlfn.IFS(T29=\"Annegret Schmidt\",\"Anne\",T29=\"Ilona Wetzel\",\"Ilona\",T29=\"Michael Wetzel\",\"Michael\",T29=\"Mario Jurk\",\"Mario\",T29=\"Kai Roßberg\",\"Kai\",T29=\"Deniz Hagelstein\",\"Deniz\",T29=\"Frank Nijholt\",\"Frank\",T29=\"Matthias Nolte\",\"Matthias\",T29=\"Jörg Frahm\",\"Jörg\")","v":"Deniz"},null,null,{"$f":"_xlfn.IFS(AC29=\"Annegret Schmidt\",\"Anne\",AC29=\"Ilona Wetzel\",\"Ilona\",AC29=\"Michael Wetzel\",\"Michael\",AC29=\"Mario Jurk\",\"Mario\",AC29=\"Kai Roßberg\",\"Kai\",AC29=\"Deniz Hagelstein\",\"Deniz\",AC29=\"Frank Nijholt\",\"Frank\",AC29=\"Matthias Nolte\",\"Matthias\",AC29=\"Jörg Frahm\",\"Jörg\")","v":"Ilona"},null,null,{"$f":"_xlfn.IFS(AL29=\"Annegret Schmidt\",\"Anne\",AL29=\"Ilona Wetzel\",\"Ilona\",AL29=\"Michael Wetzel\",\"Michael\",AL29=\"Mario Jurk\",\"Mario\",AL29=\"Kai Roßberg\",\"Kai\",AL29=\"Deniz Hagelstein\",\"Deniz\",AL29=\"Frank Nijholt\",\"Frank\",AL29=\"Matthias Nolte\",\"Matthias\",AL29=\"Jörg Frahm\",\"Jörg\")","v":"Anne"},null,null,{"$f":"_xlfn.IFS(AU29=\"Annegret Schmidt\",\"Anne\",AU29=\"Ilona Wetzel\",\"Ilona\",AU29=\"Michael Wetzel\",\"Michael\",AU29=\"Mario Jurk\",\"Mario\",AU29=\"Kai Roßberg\",\"Kai\",AU29=\"Deniz Hagelstein\",\"Deniz\",AU29=\"Frank Nijholt\",\"Frank\",AU29=\"Matthias Nolte\",\"Matthias\",AU29=\"Jörg Frahm\",\"Jörg\")","v":"Ilona"},null,null,{"$f":"_xlfn.IFS(B42=\"Annegret Schmidt\",\"Anne\",B42=\"Ilona Wetzel\",\"Ilona\",B42=\"Michael Wetzel\",\"Michael\",B42=\"Mario Jurk\",\"Mario\",B42=\"Kai Roßberg\",\"Kai\",B42=\"Deniz Hagelstein\",\"Deniz\",B42=\"Frank Nijholt\",\"Frank\",B42=\"Matthias Nolte\",\"Matthias\",B42=\"Jörg Frahm\",\"Jörg\")","v":"Deniz"},null,null,{"$f":"_xlfn.IFS(K43=\"Annegret Schmidt\",\"Anne\",K43=\"Ilona Wetzel\",\"Ilona\",K43=\"Michael Wetzel\",\"Michael\",K43=\"Mario Jurk\",\"Mario\",K43=\"Kai Roßberg\",\"Kai\",K43=\"Deniz Hagelstein\",\"Deniz\",K43=\"Frank Nijholt\",\"Frank\",K43=\"Matthias Nolte\",\"Matthias\",K43=\"Jörg Frahm\",\"Jörg\")","v":"Ilona"}]
[null,{"$f":"_xlfn.IFS(B14=\"Annegret Schmidt\",\"Anne\",B14=\"Ilona Wetzel\",\"Ilona\",B14=\"Michael Wetzel\",\"Michael\",B14=\"Mario Jurk\",\"Mario\",B14=\"Kai Roßberg\",\"Kai\",B14=\"Deniz Hagelstein\",\"Deniz\",B14=\"Frank Nijholt\",\"Frank\",B14=\"Matthias Nolte\",\"Matthias\",B14=\"Jörg Frahm\",\"Jörg\")","v":"Mario"},null,null,{"$f":"_xlfn.IFS(K14=\"Annegret Schmidt\",\"Anne\",K14=\"Ilona Wetzel\",\"Ilona\",K14=\"Michael Wetzel\",\"Michael\",K14=\"Mario Jurk\",\"Mario\",K14=\"Kai Roßberg\",\"Kai\",K14=\"Deniz Hagelstein\",\"Deniz\",K14=\"Frank Nijholt\",\"Frank\",K14=\"Matthias Nolte\",\"Matthias\",K14=\"Jörg Frahm\",\"Jörg\")","v":"Frank"},null,null,{"$f":"_xlfn.IFS(T14=\"Annegret Schmidt\",\"Anne\",T14=\"Ilona Wetzel\",\"Ilona\",T14=\"Michael Wetzel\",\"Michael\",T14=\"Mario Jurk\",\"Mario\",T14=\"Kai Roßberg\",\"Kai\",T14=\"Deniz Hagelstein\",\"Deniz\",T14=\"Frank Nijholt\",\"Frank\",T14=\"Matthias Nolte\",\"Matthias\",T14=\"Jörg Frahm\",\"Jörg\")","v":"Mario"},null,null,{"$f":"_xlfn.IFS(AC14=\"Annegret Schmidt\",\"Anne\",AC14=\"Ilona Wetzel\",\"Ilona\",AC14=\"Michael Wetzel\",\"Michael\",AC14=\"Mario Jurk\",\"Mario\",AC14=\"Kai Roßberg\",\"Kai\",AC14=\"Deniz Hagelstein\",\"Deniz\",AC14=\"Frank Nijholt\",\"Frank\",AC14=\"Matthias Nolte\",\"Matthias\",AC14=\"Jörg Frahm\",\"Jörg\")","v":"Anne"},null,null,{"$f":"_xlfn.IFS(AL14=\"Annegret Schmidt\",\"Anne\",AL14=\"Ilona Wetzel\",\"Ilona\",AL14=\"Michael Wetzel\",\"Michael\",AL14=\"Mario Jurk\",\"Mario\",AL14=\"Kai Roßberg\",\"Kai\",AL14=\"Deniz Hagelstein\",\"Deniz\",AL14=\"Frank Nijholt\",\"Frank\",AL14=\"Matthias Nolte\",\"Matthias\",AL14=\"Jörg Frahm\",\"Jörg\")","v":"Deniz"},null,null,{"$f":"_xlfn.IFS(AU14=\"Annegret Schmidt\",\"Anne\",AU14=\"Ilona Wetzel\",\"Ilona\",AU14=\"Michael Wetzel\",\"Michael\",AU14=\"Mario Jurk\",\"Mario\",AU14=\"Kai Roßberg\",\"Kai\",AU14=\"Deniz Hagelstein\",\"Deniz\",AU14=\"Frank Nijholt\",\"Frank\",AU14=\"Matthias Nolte\",\"Matthias\",AU14=\"Jörg Frahm\",\"Jörg\")","v":"Deniz"},null,null,{"$f":"_xlfn.IFS(B30=\"Annegret Schmidt\",\"Anne\",B30=\"Ilona Wetzel\",\"Ilona\",B30=\"Michael Wetzel\",\"Michael\",B30=\"Mario Jurk\",\"Mario\",B30=\"Kai Roßberg\",\"Kai\",B30=\"Deniz Hagelstein\",\"Deniz\",B30=\"Frank Nijholt\",\"Frank\",B30=\"Matthias Nolte\",\"Matthias\",B30=\"Jörg Frahm\",\"Jörg\")","v":"Anne"},null,null,{"$f":"_xlfn.IFS(K30=\"Annegret Schmidt\",\"Anne\",K30=\"Ilona Wetzel\",\"Ilona\",K30=\"Michael Wetzel\",\"Michael\",K30=\"Mario Jurk\",\"Mario\",K30=\"Kai Roßberg\",\"Kai\",K30=\"Deniz Hagelstein\",\"Deniz\",K30=\"Frank Nijholt\",\"Frank\",K30=\"Matthias Nolte\",\"Matthias\",K30=\"Jörg Frahm\",\"Jörg\")","v":"Mario"},null,null,{"$f":"_xlfn.IFS(T30=\"Annegret Schmidt\",\"Anne\",T30=\"Ilona Wetzel\",\"Ilona\",T30=\"Michael Wetzel\",\"Michael\",T30=\"Mario Jurk\",\"Mario\",T30=\"Kai Roßberg\",\"Kai\",T30=\"Deniz Hagelstein\",\"Deniz\",T30=\"Frank Nijholt\",\"Frank\",T30=\"Matthias Nolte\",\"Matthias\",T30=\"Jörg Frahm\",\"Jörg\")","v":"Mario"},null,null,{"$f":"_xlfn.IFS(AC30=\"Annegret Schmidt\",\"Anne\",AC30=\"Ilona Wetzel\",\"Ilona\",AC30=\"Michael Wetzel\",\"Michael\",AC30=\"Mario Jurk\",\"Mario\",AC30=\"Kai Roßberg\",\"Kai\",AC30=\"Deniz Hagelstein\",\"Deniz\",AC30=\"Frank Nijholt\",\"Frank\",AC30=\"Matthias Nolte\",\"Matthias\",AC30=\"Jörg Frahm\",\"Jörg\")","v":"Mario"},null,null,{"$f":"_xlfn.IFS(AL30=\"Annegret Schmidt\",\"Anne\",AL30=\"Ilona Wetzel\",\"Ilona\",AL30=\"Michael Wetzel\",\"Michael\",AL30=\"Mario Jurk\",\"Mario\",AL30=\"Kai Roßberg\",\"Kai\",AL30=\"Deniz Hagelstein\",\"Deniz\",AL30=\"Frank Nijholt\",\"Frank\",AL30=\"Matthias Nolte\",\"Matthias\",AL30=\"Jörg Frahm\",\"Jörg\")","v":"Ilona"},null,null,{"$f":"_xlfn.IFS(AU30=\"Annegret Schmidt\",\"Anne\",AU30=\"Ilona Wetzel\",\"Ilona\",AU30=\"Michael Wetzel\",\"Michael\",AU30=\"Mario Jurk\",\"Mario\",AU30=\"Kai Roßberg\",\"Kai\",AU30=\"Deniz Hagelstein\",\"Deniz\",AU30=\"Frank Nijholt\",\"Frank\",AU30=\"Matthias Nolte\",\"Matthias\",AU30=\"Jörg Frahm\",\"Jörg\")","v":"Mario"},null,null,{"$f":"_xlfn.IFS(B44=\"Annegret Schmidt\",\"Anne\",B44=\"Ilona Wetzel\",\"Ilona\",B44=\"Michael Wetzel\",\"Michael\",B44=\"Mario Jurk\",\"Mario\",B44=\"Kai Roßberg\",\"Kai\",B44=\"Deniz Hagelstein\",\"Deniz\",B44=\"Frank Nijholt\",\"Frank\",B44=\"Matthias Nolte\",\"Matthias\",B44=\"Jörg Frahm\",\"Jörg\")","v":"Anne"},null,null,{"$f":"_xlfn.IFS(K44=\"Annegret Schmidt\",\"Anne\",K44=\"Ilona Wetzel\",\"Ilona\",K44=\"Michael Wetzel\",\"Michael\",K44=\"Mario Jurk\",\"Mario\",K44=\"Kai Roßberg\",\"Kai\",K44=\"Deniz Hagelstein\",\"Deniz\",K44=\"Frank Nijholt\",\"Frank\",K44=\"Matthias Nolte\",\"Matthias\",K44=\"Jörg Frahm\",\"Jörg\")","v":"Jörg"}]
[null,{"$f":"_xlfn.IFS(B15=\"Annegret Schmidt\",\"Anne\",B15=\"Ilona Wetzel\",\"Ilona\",B15=\"Michael Wetzel\",\"Michael\",B15=\"Mario Jurk\",\"Mario\",B15=\"Kai Roßberg\",\"Kai\",B15=\"Deniz Hagelstein\",\"Deniz\",B15=\"Frank Nijholt\",\"Frank\",B15=\"Matthias Nolte\",\"Matthias\",B15=\"Jörg Frahm\",\"Jörg\")","v":"Matthias"},null,null,{"$f":"_xlfn.IFS(K15=\"Annegret Schmidt\",\"Anne\",K15=\"Ilona Wetzel\",\"Ilona\",K15=\"Michael Wetzel\",\"Michael\",K15=\"Mario Jurk\",\"Mario\",K15=\"Kai Roßberg\",\"Kai\",K15=\"Deniz Hagelstein\",\"Deniz\",K15=\"Frank Nijholt\",\"Frank\",K15=\"Matthias Nolte\",\"Matthias\",K15=\"Jörg Frahm\",\"Jörg\")","v":"Anne"},null,null,{"$f":"_xlfn.IFS(T15=\"Annegret Schmidt\",\"Anne\",T15=\"Ilona Wetzel\",\"Ilona\",T15=\"Michael Wetzel\",\"Michael\",T15=\"Mario Jurk\",\"Mario\",T15=\"Kai Roßberg\",\"Kai\",T15=\"Deniz Hagelstein\",\"Deniz\",T15=\"Frank Nijholt\",\"Frank\",T15=\"Matthias Nolte\",\"Matthias\",T15=\"Jörg Frahm\",\"Jörg\")","v":"Deniz"},null,null,{"$f":"_xlfn.IFS(AC15=\"Annegret Schmidt\",\"Anne\",AC15=\"Ilona Wetzel\",\"Ilona\",AC15=\"Michael Wetzel\",\"Michael\",AC15=\"Mario Jurk\",\"Mario\",AC15=\"Kai Roßberg\",\"Kai\",AC15=\"Deniz Hagelstein\",\"Deniz\",AC15=\"Frank Nijholt\",\"Frank\",AC15=\"Matthias Nolte\",\"Matthias\",AC15=\"Jörg Frahm\",\"Jörg\")","v":"Kai"},null,null,{"$f":"_xlfn.IFS(AL15=\"Annegret Schmidt\",\"Anne\",AL15=\"Ilona Wetzel\",\"Ilona\",AL15=\"Michael Wetzel\",\"Michael\",AL15=\"Mario Jurk\",\"Mario\",AL15=\"Kai Roßberg\",\"Kai\",AL15=\"Deniz Hagelstein\",\"Deniz\",AL15=\"Frank Nijholt\",\"Frank\",AL15=\"Matthias Nolte\",\"Matthias\",AL15=\"Jörg Frahm\",\"Jörg\")","v":"Matthias"},null,null,{"$f":"_xlfn.IFS(AU15=\"Annegret Schmidt\",\"Anne\",AU15=\"Ilona Wetzel\",\"Ilona\",AU15=\"Michael Wetzel\",\"Michael\",AU15=\"Mario Jurk\",\"Mario\",AU15=\"Kai Roßberg\",\"Kai\",AU15=\"Deniz Hagelstein\",\"Deniz\",AU15=\"Frank Nijholt\",\"Frank\",AU15=\"Matthias Nolte\",\"Matthias\",AU15=\"Jörg Frahm\",\"Jörg\",AU15=\"Jörg Frahm (Abw)\",\"Jörg (Abw)\",AU15=\"Michael Wetzel (Abw)\",\"Michael (Abw)\")","v":"Jörg (Abw)"},null,null,{"$f":"_xlfn.IFS(B31=\"Annegret Schmidt\",\"Anne\",B31=\"Ilona Wetzel\",\"Ilona\",B31=\"Michael Wetzel\",\"Michael\",B31=\"Mario Jurk\",\"Mario\",B31=\"Kai Roßberg\",\"Kai\",B31=\"Deniz Hagelstein\",\"Deniz\",B31=\"Frank Nijholt\",\"Frank\",B31=\"Matthias Nolte\",\"Matthias\",B31=\"Jörg Frahm\",\"Jörg\")","v":"Frank"},null,null,{"$f":"_xlfn.IFS(K31=\"Annegret Schmidt\",\"Anne\",K31=\"Ilona Wetzel\",\"Ilona\",K31=\"Michael Wetzel\",\"Michael\",K31=\"Mario Jurk\",\"Mario\",K31=\"Kai Roßberg\",\"Kai\",K31=\"Deniz Hagelstein\",\"Deniz\",K31=\"Frank Nijholt\",\"Frank\",K31=\"Matthias Nolte\",\"Matthias\",K31=\"Jörg Frahm\",\"Jörg\")","v":"Matthias"},null,null,{"$f":"_xlfn.IFS(T31=\"Annegret Schmidt\",\"Anne\",T31=\"Ilona Wetzel\",\"Ilona\",T31=\"Michael Wetzel\",\"Michael\",T31=\"Mario Jurk\",\"Mario\",T31=\"Kai Roßberg\",\"Kai\",T31=\"Deniz Hagelstein\",\"Deniz\",T31=\"Frank Nijholt\",\"Frank\",T31=\"Matthias Nolte\",\"Matthias\",T31=\"Jörg Frahm\",\"Jörg\")","v":"Frank"},null,null,{"$f":"_xlfn.IFS(AC31=\"Annegret Schmidt\",\"Anne\",AC31=\"Ilona Wetzel\",\"Ilona\",AC31=\"Michael Wetzel\",\"Michael\",AC31=\"Mario Jurk\",\"Mario\",AC31=\"Kai Roßberg\",\"Kai\",AC31=\"Deniz Hagelstein\",\"Deniz\",AC31=\"Frank Nijholt\",\"Frank\",AC31=\"Matthias Nolte\",\"Matthias\",AC31=\"Jörg Frahm\",\"Jörg\")","v":"Deniz"},null,null,{"$f":"_xlfn.IFS(AL31=\"Annegret Schmidt\",\"Anne\",AL31=\"Ilona Wetzel\",\"Ilona\",AL31=\"Michael Wetzel\",\"Michael\",AL31=\"Mario Jurk\",\"Mario\",AL31=\"Kai Roßberg\",\"Kai\",AL31=\"Deniz Hagelstein\",\"Deniz\",AL31=\"Frank Nijholt\",\"Frank\",AL31=\"Matthias Nolte\",\"Matthias\",AL31=\"Jörg Frahm\",\"Jörg\")","v":"Mario"},null,null,{"$f":"_xlfn.IFS(AU31=\"Annegret Schmidt\",\"Anne\",AU31=\"Ilona Wetzel\",\"Ilona\",AU31=\"Michael Wetzel\",\"Michael\",AU31=\"Mario Jurk\",\"Mario\",AU31=\"Kai Roßberg\",\"Kai\",AU31=\"Deniz Hagelstein\",\"Deniz\",AU31=\"Frank Nijholt\",\"Frank\",AU31=\"Matthias Nolte\",\"Matthias\",AU31=\"Jörg Frahm\",\"Jörg\")","v":"Anne"},null,null,{"$f":"_xlfn.IFS(B45=\"Annegret Schmidt\",\"Anne\",B45=\"Ilona Wetzel\",\"Ilona\",B45=\"Michael Wetzel\",\"Michael\",B45=\"Mario Jurk\",\"Mario\",B45=\"Kai Roßberg\",\"Kai\",B45=\"Deniz Hagelstein\",\"Deniz\",B45=\"Frank Nijholt\",\"Frank\",B45=\"Matthias Nolte\",\"Matthias\",B45=\"Jörg Frahm\",\"Jörg\")","v":"Mario"},null,null,{"$f":"_xlfn.IFS(K45=\"Annegret Schmidt\",\"Anne\",K45=\"Ilona Wetzel\",\"Ilona\",K45=\"Michael Wetzel\",\"Michael\",K45=\"Mario Jurk\",\"Mario\",K45=\"Kai Roßberg\",\"Kai\",K45=\"Deniz Hagelstein\",\"Deniz\",K45=\"Frank Nijholt\",\"Frank\",K45=\"Matthias Nolte\",\"Matthias\",K45=\"Jörg Frahm\",\"Jörg\")","v":"Frank"}]
[null,{"$f":"_xlfn.IFS(B16=\"Annegret Schmidt\",\"Anne\",B16=\"Ilona Wetzel\",\"Ilona\",B16=\"Michael Wetzel\",\"Michael\",B16=\"Mario Jurk\",\"Mario\",B16=\"Kai Roßberg\",\"Kai\",B16=\"Deniz Hagelstein\",\"Deniz\",B16=\"Frank Nijholt\",\"Frank\",B16=\"Matthias Nolte\",\"Matthias\",B16=\"Jörg Frahm\",\"Jörg\")","v":"Frank"},null,null,{"$f":"_xlfn.IFS(K16=\"Annegret Schmidt\",\"Anne\",K16=\"Ilona Wetzel\",\"Ilona\",K16=\"Michael Wetzel\",\"Michael\",K16=\"Mario Jurk\",\"Mario\",K16=\"Kai Roßberg\",\"Kai\",K16=\"Deniz Hagelstein\",\"Deniz\",K16=\"Frank Nijholt\",\"Frank\",K16=\"Matthias Nolte\",\"Matthias\",K16=\"Jörg Frahm\",\"Jörg\")","v":"Ilona"},null,null,{"$f":"_xlfn.IFS(T16=\"Annegret Schmidt\",\"Anne\",T16=\"Ilona Wetzel\",\"Ilona\",T16=\"Michael Wetzel\",\"Michael\",T16=\"Mario Jurk\",\"Mario\",T16=\"Kai Roßberg\",\"Kai\",T16=\"Deniz Hagelstein\",\"Deniz\",T16=\"Frank Nijholt\",\"Frank\",T16=\"Matthias Nolte\",\"Matthias\",T16=\"Jörg Frahm\",\"Jörg\")","v":"Frank"},null,null,{"$f":"_xlfn.IFS(AC16=\"Annegret Schmidt\",\"Anne\",AC16=\"Ilona Wetzel\",\"Ilona\",AC16=\"Michael Wetzel\",\"Michael\",AC16=\"Mario Jurk\",\"Mario\",AC16=\"Kai Roßberg\",\"Kai\",AC16=\"Deniz Hagelstein\",\"Deniz\",AC16=\"Frank Nijholt\",\"Frank\",AC16=\"Matthias Nolte\",\"Matthias\",AC16=\"Jörg Frahm\",\"Jörg\",AC16=\"Jörg Frahm (Abw)\",\"Jörg (Abw)\",AC16=\"Michael Wetzel (Abw)\",\"Michael (Abw)\")","v":"Jörg (Abw)"},null,null,{"$f":"_xlfn.IFS(AL16=\"Annegret Schmidt\",\"Anne\",AL16=\"Ilona Wetzel\",\"Ilona\",AL16=\"Michael Wetzel\",\"Michael\",AL16=\"Mario Jurk\",\"Mario\",AL16=\"Kai Roßberg\",\"Kai\",AL16=\"Deniz Hagelstein\",\"Deniz\",AL16=\"Frank Nijholt\",\"Frank\",AL16=\"Matthias Nolte\",\"Matthias\",AL16=\"Jörg Frahm\",\"Jörg\",AL16=\"Jörg Frahm (Abw)\",\"Jörg (Abw)\",AL16=\"Michael Wetzel (Abw)\",\"Michael (Abw)\")","v":"Jörg (Abw)"},null,null,{"$f":"_xlfn.IFS(AU16=\"Annegret Schmidt\",\"Anne\",AU16=\"Ilona Wetzel\",\"Ilona\",AU16=\"Michael Wetzel\",\"Michael\",AU16=\"Mario Jurk\",\"Mario\",AU16=\"Kai Roßberg\",\"Kai\",AU16=\"Deniz Hagelstein\",\"Deniz\",AU16=\"Frank Nijholt\",\"Frank\",AU16=\"Matthias Nolte\",\"Matthias\",AU16=\"Jörg Frahm\",\"Jörg\",AU16=\"Jörg Frahm (Abw)\",\"Jörg (Abw)\",AU16=\"Michael Wetzel (Abw)\",\"Michael (Abw)\")","v":"Matthias"},null,null,{"$f":"_xlfn.IFS(B32=\"Annegret Schmidt\",\"Anne\",B32=\"Ilona Wetzel\",\"Ilona\",B32=\"Michael Wetzel\",\"Michael\",B32=\"Mario Jurk\",\"Mario\",B32=\"Kai Roßberg\",\"Kai\",B32=\"Deniz Hagelstein\",\"Deniz\",B32=\"Frank Nijholt\",\"Frank\",B32=\"Matthias Nolte\",\"Matthias\",B32=\"Jörg Frahm\",\"Jörg\",B32=\"Jörg Frahm (Abw)\",\"Jörg (Abw)\",B32=\"Michael Wetzel (Abw)\",\"Michael (Abw)\")","v":"Jörg (Abw)"},null,null,{"$f":"_xlfn.IFS(K32=\"Annegret Schmidt\",\"Anne\",K32=\"Ilona Wetzel\",\"Ilona\",K32=\"Michael Wetzel\",\"Michael\",K32=\"Mario Jurk\",\"Mario\",K32=\"Kai Roßberg\",\"Kai\",K32=\"Deniz Hagelstein\",\"Deniz\",K32=\"Frank Nijholt\",\"Frank\",K32=\"Matthias Nolte\",\"Matthias\",K32=\"Jörg Frahm\",\"Jörg\")","v":"Jörg"},null,null,{"$f":"_xlfn.IFS(T32=\"Annegret Schmidt\",\"Anne\",T32=\"Ilona Wetzel\",\"Ilona\",T32=\"Michael Wetzel\",\"Michael\",T32=\"Mario Jurk\",\"Mario\",T32=\"Kai Roßberg\",\"Kai\",T32=\"Deniz Hagelstein\",\"Deniz\",T32=\"Frank Nijholt\",\"Frank\",T32=\"Matthias Nolte\",\"Matthias\",T32=\"Jörg Frahm\",\"Jörg\")","v":"Matthias"},null,null,{"$f":"_xlfn.IFS(AC32=\"Annegret Schmidt\",\"Anne\",AC32=\"Ilona Wetzel\",\"Ilona\",AC32=\"Michael Wetzel\",\"Michael\",AC32=\"Mario Jurk\",\"Mario\",AC32=\"Kai Roßberg\",\"Kai\",AC32=\"Deniz Hagelstein\",\"Deniz\",AC32=\"Frank Nijholt\",\"Frank\",AC32=\"Matthias Nolte\",\"Matthias\",AC32=\"Jörg Frahm\",\"Jörg\")","v":"Matthias"},null,null,{"$f":"_xlfn.IFS(AL32=\"Annegret Schmidt\",\"Anne\",AL32=\"Ilona Wetzel\",\"Ilona\",AL32=\"Michael Wetzel\",\"Michael\",AL32=\"Mario Jurk\",\"Mario\",AL32=\"Kai Roßberg\",\"Kai\",AL32=\"Deniz Hagelstein\",\"Deniz\",AL32=\"Frank Nijholt\",\"Frank\",AL32=\"Matthias Nolte\",\"Matthias\",AL32=\"Jörg Frahm\",\"Jörg\")","v":"Frank"},null,null,{"$f":"_xlfn.IFS(AU32=\"Annegret Schmidt\",\"Anne\",AU32=\"Ilona Wetzel\",\"Ilona\",AU32=\"Michael Wetzel\",\"Michael\",AU32=\"Mario Jurk\",\"Mario\",AU32=\"Kai Roßberg\",\"Kai\",AU32=\"Deniz Hagelstein\",\"Deniz\",AU32=\"Frank Nijholt\",\"Frank\",AU32=\"Matthias Nolte\",\"Matthias\",AU32=\"Jörg Frahm\",\"Jörg\")","v":"Matthias"},null,null,{"$f":"_xlfn.IFS(B46=\"Annegret Schmidt\",\"Anne\",B46=\"Ilona Wetzel\",\"Ilona\",B46=\"Michael Wetzel\",\"Michael\",B46=\"Mario Jurk\",\"Mario\",B46=\"Kai Roßberg\",\"Kai\",B46=\"Deniz Hagelstein\",\"Deniz\",B46=\"Frank Nijholt\",\"Frank\",B46=\"Matthias Nolte\",\"Matthias\",B46=\"Jörg Frahm\",\"Jörg\")","v":"Frank"},null,null,{"$f":"_xlfn.IFS(K46=\"Annegret Schmidt\",\"Anne\",K46=\"Ilona Wetzel\",\"Ilona\",K46=\"Michael Wetzel\",\"Michael\",K46=\"Mario Jurk\",\"Mario\",K46=\"Kai Roßberg\",\"Kai\",K46=\"Deniz Hagelstein\",\"Deniz\",K46=\"Frank Nijholt\",\"Frank\",K46=\"Matthias Nolte\",\"Matthias\",K46=\"Jörg Frahm\",\"Jörg\")","v":"Matthias"}]
[null,{"$f":"_xlfn.IFS(B17=\"Annegret Schmidt\",\"Anne\",B17=\"Ilona Wetzel\",\"Ilona\",B17=\"Michael Wetzel\",\"Michael\",B17=\"Mario Jurk\",\"Mario\",B17=\"Kai Roßberg\",\"Kai\",B17=\"Deniz Hagelstein\",\"Deniz\",B17=\"Frank Nijholt\",\"Frank\",B17=\"Matthias Nolte\",\"Matthias\",B17=\"Jörg Frahm\",\"Jörg\",B17=\"Jörg Frahm (Abw)\",\"Jörg (Abw)\",B17=\"Michael Wetzel (Abw)\",\"Michael (Abw)\")","v":"Jörg (Abw)"},null,null,{"$f":"_xlfn.IFS(K17=\"Annegret Schmidt\",\"Anne\",K17=\"Ilona Wetzel\",\"Ilona\",K17=\"Michael Wetzel\",\"Michael\",K17=\"Mario Jurk\",\"Mario\",K17=\"Kai Roßberg\",\"Kai\",K17=\"Deniz Hagelstein\",\"Deniz\",K17=\"Frank Nijholt\",\"Frank\",K17=\"Matthias Nolte\",\"Matthias\",K17=\"Jörg Frahm\",\"Jörg\",K17=\"Jörg Frahm (Abw)\",\"Jörg (Abw)\",K17=\"Michael Wetzel (Abw)\",\"Michael (Abw)\")","v":"Jörg (Abw)"},null,null,{"$f":"_xlfn.IFS(T17=\"Annegret Schmidt\",\"Anne\",T17=\"Ilona Wetzel\",\"Ilona\",T17=\"Michael Wetzel\",\"Michael\",T17=\"Mario Jurk\",\"Mario\",T17=\"Kai Roßberg\",\"Kai\",T17=\"Deniz Hagelstein\",\"Deniz\",T17=\"Frank Nijholt\",\"Frank\",T17=\"Matthias Nolte\",\"Matthias\",T17=\"Jörg Frahm\",\"Jörg\",T17=\"Jörg Frahm (Abw)\",\"Jörg (Abw)\",T17=\"Michael Wetzel (Abw)\",\"Michael (Abw)\")","v":"Jörg (Abw)"},null,null,{"$f":"_xlfn.IFS(AC17=\"Annegret Schmidt\",\"Anne\",AC17=\"Ilona Wetzel\",\"Ilona\",AC17=\"Michael Wetzel\",\"Michael\",AC17=\"Mario Jurk\",\"Mario\",AC17=\"Kai Roßberg\",\"Kai\",AC17=\"Deniz Hagelstein\",\"Deniz\",AC17=\"Frank Nijholt\",\"Frank\",AC17=\"Matthias Nolte\",\"Matthias\",AC17=\"Jörg Frahm\",\"Jörg\",AC17=\"Jörg Frahm (Abw)\",\"Jörg (Abw)\",AC17=\"Michael Wetzel (Abw)\",\"Michael (Abw)\")","v":"Michael (Abw)"},null,null,{"$f":"_xlfn.IFS(AL17=\"Annegret Schmidt\",\"Anne\",AL17=\"Ilona Wetzel\",\"Ilona\",AL17=\"Michael Wetzel\",\"Michael\",AL17=\"Mario Jurk\",\"Mario\",AL17=\"Kai Roßberg\",\"Kai\",AL17=\"Deniz Hagelstein\",\"Deniz\",AL17=\"Frank Nijholt\",\"Frank\",AL17=\"Matthias Nolte\",\"Matthias\",AL17=\"Jörg Frahm\",\"Jörg\",AL17=\"Jörg Frahm (Abw)\",\"Jörg (Abw)\",AL17=\"Michael Wetzel (Abw)\",\"Michael (Abw)\")","v":"Michael (Abw)"},null,null,{"$f":"_xlfn.IFS(AU17=\"Annegret Schmidt\",\"Anne\",AU17=\"Ilona Wetzel\",\"Ilona\",AU17=\"Michael Wetzel\",\"Michael\",AU17=\"Mario Jurk\",\"Mario\",AU17=\"Kai Roßberg\",\"Kai\",AU17=\"Deniz Hagelstein\",\"Deniz\",AU17=\"Frank Nijholt\",\"Frank\",AU17=\"Matthias Nolte\",\"Matthias\",AU17=\"Jörg Frahm\",\"Jörg\",AU17=\"Jörg Frahm (Abw)\",\"Jörg (Abw)\",AU17=\"Michael Wetzel (Abw)\",\"Michael (Abw)\")","v":"Michael (Abw)"},null,null,{"$f":"_xlfn.IFS(B33=\"Annegret Schmidt\",\"Anne\",B33=\"Ilona Wetzel\",\"Ilona\",B33=\"Michael Wetzel\",\"Michael\",B33=\"Mario Jurk\",\"Mario\",B33=\"Kai Roßberg\",\"Kai\",B33=\"Deniz Hagelstein\",\"Deniz\",B33=\"Frank Nijholt\",\"Frank\",B33=\"Matthias Nolte\",\"Matthias\",B33=\"Jörg Frahm\",\"Jörg\",B33=\"Jörg Frahm (Abw)\",\"Jörg (Abw)\",B33=\"Michael Wetzel (Abw)\",\"Michael (Abw)\")","v":"Michael (Abw)"},null,null,{"$f":"_xlfn.IFS(K33=\"Annegret Schmidt\",\"Anne\",K33=\"Ilona Wetzel\",\"Ilona\",K33=\"Michael Wetzel\",\"Michael\",K33=\"Mario Jurk\",\"Mario\",K33=\"Kai Roßberg\",\"Kai\",K33=\"Deniz Hagelstein\",\"Deniz\",K33=\"Frank Nijholt\",\"Frank\",K33=\"Matthias Nolte\",\"Matthias\",K33=\"Jörg Frahm\",\"Jörg\",K33=\"Jörg Frahm (Abw)\",\"Jörg (Abw)\",K33=\"Michael Wetzel (Abw)\",\"Michael (Abw)\")","v":"Michael (Abw)"},null,null,{"$f":"_xlfn.IFS(T33=\"Annegret Schmidt\",\"Anne\",T33=\"Ilona Wetzel\",\"Ilona\",T33=\"Michael Wetzel\",\"Michael\",T33=\"Mario Jurk\",\"Mario\",T33=\"Kai Roßberg\",\"Kai\",T33=\"Deniz Hagelstein\",\"Deniz\",T33=\"Frank Nijholt\",\"Frank\",T33=\"Matthias Nolte\",\"Matthias\",T33=\"Jörg Frahm\",\"Jörg\",I33=\"Jörg Frahm (Abw)\",\"Jörg (Abw)\",T33=\"Michael Wetzel (Abw)\",\"Michael (Abw)\")","v":"Michael (Abw)"},null,null,{"$f":"_xlfn.IFS(AC33=\"Annegret Schmidt\",\"Anne\",AC33=\"Ilona Wetzel\",\"Ilona\",AC33=\"Michael Wetzel\",\"Michael\",AC33=\"Mario Jurk\",\"Mario\",AC33=\"Kai Roßberg\",\"Kai\",AC33=\"Deniz Hagelstein\",\"Deniz\",AC33=\"Frank Nijholt\",\"Frank\",AC33=\"Matthias Nolte\",\"Matthias\",AC33=\"Jörg Frahm\",\"Jörg\",AC33=\"Jörg Frahm (Abw)\",\"Jörg (Abw)\",AC33=\"Michael Wetzel (Abw)\",\"Michael (Abw)\")","v":"Michael (Abw)"},null,null,{"$f":"_xlfn.IFS(AL33=\"Annegret Schmidt\",\"Anne\",AL33=\"Ilona Wetzel\",\"Ilona\",AL33=\"Michael Wetzel\",\"Michael\",AL33=\"Mario Jurk\",\"Mario\",AL33=\"Kai Roßberg\",\"Kai\",AL33=\"Deniz Hagelstein\",\"Deniz\",AL33=\"Frank Nijholt\",\"Frank\",AL33=\"Matthias Nolte\",\"Matthias\",AL33=\"Jörg Frahm\",\"Jörg\",AL33=\"Jörg Frahm (Abw)\",\"Jörg (Abw)\",AL33=\"Michael Wetzel (Abw)\",\"Michael (Abw)\")","v":"Michael (Abw)"},null,null,{"$f":"_xlfn.IFS(AU33=\"Annegret Schmidt\",\"Anne\",AU33=\"Ilona Wetzel\",\"Ilona\",AU33=\"Michael Wetzel\",\"Michael\",AU33=\"Mario Jurk\",\"Mario\",AU33=\"Kai Roßberg\",\"Kai\",AU33=\"Deniz Hagelstein\",\"Deniz\",AU33=\"Frank Nijholt\",\"Frank\",AU33=\"Matthias Nolte\",\"Matthias\",AU33=\"Jörg Frahm\",\"Jörg\",AU33=\"Jörg Frahm (Abw)\",\"Jörg (Abw)\",AU33=\"Michael Wetzel (Abw)\",\"Michael (Abw)\")","v":"Michael (Abw)"},null,null,{"$f":"_xlfn.IFS(B47=\"Annegret Schmidt\",\"Anne\",B47=\"Ilona Wetzel\",\"Ilona\",B47=\"Michael Wetzel\",\"Michael\",B47=\"Mario Jurk\",\"Mario\",B47=\"Kai Roßberg\",\"Kai\",B47=\"Deniz Hagelstein\",\"Deniz\",B47=\"Frank Nijholt\",\"Frank\",B47=\"Matthias Nolte\",\"Matthias\",B47=\"Jörg Frahm\",\"Jörg\",B47=\"Jörg Frahm (Abw)\",\"Jörg (Abw)\",B47=\"Michael Wetzel (Abw)\",\"Michael (Abw)\")","v":"Ilona"},null,null,{"$f":"_xlfn.IFS(K47=\"Annegret Schmidt\",\"Anne\",K47=\"Ilona Wetzel\",\"Ilona\",K47=\"Michael Wetzel\",\"Michael\",K47=\"Mario Jurk\",\"Mario\",K47=\"Kai Roßberg\",\"Kai\",K47=\"Deniz Hagelstein\",\"Deniz\",K47=\"Frank Nijholt\",\"Frank\",K47=\"Matthias Nolte\",\"Matthias\",K47=\"Jörg Frahm\",\"Jörg\",K47=\"Jörg Frahm (Abw)\",\"Jörg (Abw)\",K47=\"Michael Wetzel (Abw)\",\"Michael (Abw)\")","v":"Michael (Abw)"}]

{"sheet":"Abschlusstabelle  23-24","index":22,"n_rows":149,"n_cols":11,"rows_kept":149,"cut":false,"hidden":false,"merged":[[0,3,0,10],[2,3,2,10],[4,3,4,7]]}
[null,"Start",null,"Betriebssportverband Hamburg    -    Sparte Bowling"]
[null,"Rangliste"]
[null,null,null,"ABSCHLUSSTABELLEN     PUNKTSPIELSAISON    2023 / 24"]
[]
[null,null,null,"HAMBURGER VERBANDSMEISTER  2024",null,null,null,null,"B W V L 1"]
[]
[null,null,null,null,"SONDERKLASSE"]
[null,null,null,null,null,"Punkte","Spiele","Pins","Schnitt Mann.","Schnitt Einzel"]
[null,null,null,1,"B W V L 1",155,168,33455,2389.6428571428569,199.13690476190476,"Meister"]
[null,null,null,2,"Edeka 1",119,168,31925,2280.3571428571427,190.0297619047619]
[null,null,null,3,"Stahlhandel Nord 1",116.5,168,31519,2251.3571428571431,187.61309523809524]
[null,null,null,4,"Hamburger Sparkasse 1",110,168,31076,2219.7142857142858,184.97619047619048]
[null,null,null,5,"Condor-Versicherung 1",103,156,29093,2237.9230769230771,186.49358974358975]
[null,null,null,6,"Hamburger Hochbahn 1",96,168,30785,2198.9285714285716,183.24404761904762]
[null,null,null,7,"SG Deutsche Bank Deutschland e.V. 1",91,168,30476,2176.8571428571427,181.4047619047619]
[null,null,null,8,"Körber Sports             vormals HAU 1",78,168,30095,2149.6428571428569,179.13690476190476]
[null,null,null,9,"HHLA 1",78,168,29850,2132.1428571428569,177.67857142857142]
[null,null,null,10,"Hamburger Hochbahn 2",70,168,29511,2107.9285714285716,175.66071428571428,"Absteiger"]
[null,null,null,11,"Postamt  2 1",47.5,168,28945,2067.5,172.29166666666666,"Absteiger"]
[null,null,null,12,"B W V L 2",27,168,28110,2007.8571428571431,167.32142857142858,"Absteiger"]
[]
[null,null,null,null,"KLASSE  A 1","MEISTER",null,"Otto 1"]
[null,null,null,null,null,"Punkte","Spiele","Pins","Schnitt Mann.","Schnitt Einzel"]
[null,null,null,1,"Otto 1",126.5,168,30463,2175.9285714285716,181.32738095238096,"Aufsteiger"]
[null,null,null,2,"Sportclub Dt. Bundesbank 1",90.5,168,28828,2059.1428571428573,171.5952380952381]
[null,null,null,3,"Energie Sportvereinigung 1",90,168,28984,2070.2857142857142,172.52380952380952]
[null,null,null,4,"Hamburger Hochbahn 3",84.5,168,28359,2025.6428571428569,168.80357142857142]
[null,null,null,5,"LG Finanzämter Hamburg 1",74,168,28440,2031.4285714285713,169.28571428571428]
[null,null,null,6,"Aurubis 1",73,168,28004,2000.2857142857144,166.6904761904762]
[null,null,null,7,"Die Aktiven 1",66.5,168,27624,1973.1428571428569,164.42857142857142]
[null,null,null,8,"Lufthansa 1",61,168,27861,1990.0714285714287,165.83928571428572]
[null,null,null,9,"Feuerwehr Hamburg 1",54.5,168,27090,1935,161.25,"Absteiger"]
[null,null,null,10,"Elbe-Sport eV 2",49.5,168,27598,1971.2857142857142,164.27380952380952,"Absteiger"]
[]
[null,null,null,null,"KLASSE  A 2","MEISTER",null,"B W V L 3"]
[null,null,null,null,null,"Punkte","Spiele","Pins","Schnitt Mann.","Schnitt Einzel"]
[null,null,null,1,"B W V L 3",124,168,30182,2155.8571428571427,179.6547619047619,"Aufsteiger"]
[null,null,null,2,"Hamburger Sparkasse 2",118,168,29743,2124.5,177.04166666666666]
[null,null,null,3,"SV Signal Iduna 1",99.5,168,28278,2019.8571428571431,168.32142857142858]
[null,null,null,4,"Justizbehörde 1",91,168,28087,2006.2142857142856,167.1845238095238]
[null,null,null,5,"Commerzbank 1",88.5,168,28012,2000.8571428571429,166.73809523809524]
[null,null,null,6,"Generali Versicherungen 1",59.5,165,26370,1917.8181818181818,159.81818181818181]
[null,null,null,7,"Still 1",57,168,26511,1893.6428571428569,157.80357142857142]
[null,null,null,8,"Hamburger Hochbahn 4",53,168,26315,1879.6428571428571,156.63690476190476]
[null,null,null,9,"Eppendorf AG 1",46,168,25961,1854.3571428571427,154.5297619047619,"Absteiger"]
[null,null,null,10,"SG Deutsche Bank Deutschland e.V. 2",33.5,168,25580,1827.1428571428571,152.26190476190476,"Absteiger"]
[]
[null,null,null,null,"KLASSE  A 3","MEISTER",null,"Edeka 2"]
[null,null,null,null,null,"Punkte","Spiele","Pins","Schnitt Mann.","Schnitt Einzel"]
[null,null,null,1,"Edeka 2",125,168,30642,2188.7142857142858,182.39285714285714,"Aufsteiger"]
[null,null,null,2,"Stadtreinigung 1",119,168,30231,2159.3571428571431,179.94642857142858]
[null,null,null,3,"Dakosy 1",89,168,28794,2056.7142857142858,171.39285714285714]
[null,null,null,4,"B W V L 4",88,168,28614,2043.8571428571431,170.32142857142858]
[null,null,null,5,"Jornitz u. Luth 1",82,168,28458,2032.7142857142858,169.39285714285714]
[null,null,null,6,"Elbe-Sport eV 1",78,168,28548,2039.1428571428569,169.92857142857142]
[null,null,null,7,"Dataport Hamburg 1",56,168,27174,1941,161.75]
[null,null,null,8,"BWVL Hamburg Port Authority 1",49.5,162,26365,1952.962962962963,162.74691358024691]
[null,null,null,9,"Körber Sports             vormals HAU 2",46.5,165,26663,1939.1272727272726,161.59393939393939,"Absteiger"]
[null,null,null,10,"Panasonic 1",37,165,26087,1897.2363636363634,158.10303030303029,"Absteiger"]
[null,null,null," ","","","","","",""]
[null,null,null,null,"KLASSE  B 1","MEISTER",null,"Hamburger Sparkasse 3"]
[null,null,null,null,null,"Punkte","Spiele","Pins","Schnitt Mann.","Schnitt Einzel"]
[null,null,null,1,"Hamburger Sparkasse 3",81,168,25638,1831.2857142857142,152.60714285714286,"Aufsteiger"]
[null,null,null,2,"Energie Sportvereinigung 2",76,168,25413,1815.2142857142858,151.26785714285714,"Aufsteiger"]
[null,null,null,3,"ERGO Sports Hamburg 1",76,168,25406,1814.7142857142858,151.22619047619048]
[null,null,null,4,"AXA Sportvereinigung 1",73,165,25050,1821.8181818181818,151.81818181818181]
[null,null,null,5,"Polizei Hamburg v. 1872 1",68,168,25072,1790.8571428571429,149.23809523809524]
[null,null,null,6,"Hamburger Sparkasse 4",54,168,24479,1748.5,145.70833333333334]
[null,null,null,7,"Feuerwehr Hamburg 2",52,168,24403,1743.0714285714284,145.25595238095238]
[null,null,null,8,"H+R Ölwerke Schindler GmbH 1",22,129,18140,1687.4418604651164,140.62015503875969,"Absteiger"]
[]
[null,null,null,null,"KLASSE  B 2","MEISTER",null,"Commerzbank 2"]
[null,null,null,null,null,"Punkte","Spiele","Pins","Schnitt Mann.","Schnitt Einzel"]
[null,null,null,1,"Commerzbank 2",113,168,26326,1880.4285714285716,156.70238095238096,"Aufsteiger"]
[null,null,null,2,"SG Deutsche Bank Deutschland e.V. 3",109,168,25786,1841.8571428571429,153.48809523809524,"Aufsteiger"]
[null,null,null,3,"D A K 1",99,165,25705,1869.4545454545455,155.78787878787878]
[null,null,null,4,"Still 2",95,168,25567,1826.2142857142856,152.1845238095238]
[null,null,null,5,"Aurubis 2",90,168,25354,1811,150.91666666666666]
[null,null,null,6,"Generali Versicherungen 3",73,165,24447,1777.9636363636364,148.16363636363636]
[null,null,null,7,"Elbe-Sport eV 3",62,168,24443,1745.9285714285716,145.49404761904762]
[null,null,null,8,"Die Socke 1",59,168,23740,1695.7142857142856,141.3095238095238]
[null,null,null,9,"Energie Sportvereinigung 3",50,168,23852,1703.7142857142858,141.97619047619048,"Absteiger"]
[null,null,null,10,"Hamburger Hochbahn 5",20,162,20467,1516.0740740740741,126.33950617283951,"Absteiger"]
[null,null,null," ","","","","","",""]
[null,null,null,null,"KLASSE  B 3","MEISTER",null,"LG Finanzämter Hambureg 2"]
[null,null,null,null,null,"Punkte","Spiele","Pins","Schnitt Mann.","Schnitt Einzel"]
[null,null,null,1,"LG Finanzämter Hamburg 2",124,168,26942,1924.4285714285716,160.36904761904762,"Aufsteiger"]
[null,null,null,2,"SV Signal Iduna 2",108,168,26264,1876,156.33333333333334,"Aufsteiger"]
[null,null,null,3,"Generali Versicherungen 2",106,168,26415,1886.7857142857142,157.23214285714286]
[null,null,null,4,"Still 3",87,168,25349,1810.6428571428571,150.88690476190476]
[null,null,null,5,"Dataport Hamburg 2",84,168,25372,1812.2857142857142,151.02380952380952]
[null,null,null,6,"Smart Blue Club Hamburg         vormals IBM Club 1",84,168,25168,1797.7142857142856,149.8095238095238]
[null,null,null,7,"Postamt  2 2",71,168,24697,1764.0714285714284,147.00595238095238]
[null,null,null,8,"Generali Versicherungen 4",40,138,19745,1716.9565217391305,143.07971014492753]
[null,null,null,9,"Steinway & Sons 1",36,168,22691,1620.7857142857144,135.0654761904762,"Absteiger"]
[null,null,null,10,"SV Signal Iduna 3",27,155,19753,1529.2645161290322,127.43870967741935,"Absteiger"]
[]
[null,null,null,null,"KLASSE  C 1","MEISTER",null,"Jungheinrich 1"]
[null,null,null,null,null,"Punkte","Spiele","Pins","Schnitt Mann.","Schnitt Einzel"]
[null,null,null,1,"Jungheinrich 1",109,168,26782,1913,159.41666666666666,"Aufsteiger"]
[null,null,null,2,"ERGO Sports Hamburg 2",74.5,168,24540,1752.8571428571431,146.07142857142858]
[null,null,null,3,"Hamburger Sparkasse 5",70.5,167,24365,1750.7784431137725,145.89820359281438]
[null,null,null,4,"Hanse Merkur 1",61.5,168,23461,1675.7857142857142,139.64880952380952]
[null,null,null,5,"Feuerwehr Hamburg 3",60,168,23822,1701.5714285714284,141.79761904761904]
[null,null,null,6,"HHLA 2",55.5,165,22878,1663.8545454545456,138.65454545454546]
[null,null,null,7,"SV Weiß Blau Allianz 1",49.5,168,22946,1639,136.58333333333334]
[null,null,null,8,"HHLA 3",20.5,117,15561,1596,133]
[]
[null,null,null,null,"KLASSE  C 2","MEISTER",null,"Otto 2"]
[null,null,null,null,null,"Punkte","Spiele","Pins","Schnitt Mann.","Schnitt Einzel"]
[null,null,null,1,"Otto 2",113.5,168,25189,1799.2142857142856,149.9345238095238,"Aufsteiger"]
[null,null,null,2,"Commerzbank 3",83,168,23901,1707.2142857142858,142.26785714285714,"Aufsteiger"]
[null,null,null,3,"Hamburger Hochbahn 6",83,159,22844,1724.0754716981132,143.67295597484278]
[null,null,null,4,"Polizei Hamburg v. 1872 2",80,165,22978,1671.1272727272726,139.26060606060605]
[null,null,null,5,"LG Finanzämter Hamburg 3",76,165,23630,1718.5454545454545,143.21212121212122]
[null,null,null,6,"ERGO Sports Hamburg 3",65,150,21206,1696.48,141.37333333333333]
[null,null,null,7,"Sportclub Dt. Bundesbank 2",50.5,123,17533,1710.5365853658536,142.54471544715446]
[null,null,null,8,"Hamburg Messe und Congress GmbH 1",47.5,168,21346,1524.7142857142858,127.05952380952381]
[null,null,null,9,"SV Weiß Blau Allianz 3",26.5,159,18347,1384.6792452830189,115.38993710691824]
[null,null,null," ","","","","","",""]
[null,null,null,null,"KLASSE  C 3","MEISTER",null,"Edeka 3"]
[null,null,null,null,null,"Punkte","Spiele","Pins","Schnitt Mann.","Schnitt Einzel"]
[null,null,null,1,"Edeka 3",78,168,24782,1770.1428571428571,147.51190476190476,"Aufsteiger"]
[null,null,null,2,"B W V L 5",60,165,23991,1744.8000000000002,145.4]
[null,null,null,3,"Lufthansa 2",47,168,22819,1629.9285714285716,135.82738095238096]
[null,null,null,4,"SV Weiß Blau Allianz 2",37,162,21560,1597.0370370370372,133.08641975308643]
[null,null,null,5,"Jungheinrich 2",36,161,21394,1594.5838509316773,132.88198757763976]
[null,null,null,6,"Tretorn 1",35,138,19237,1672.7826086956522,139.39855072463769]
[]
[null,null,null,null,"KLASSE  C 4","MEISTER",null,"Otto 3"]
[null,null,null,null,null,"Punkte","Spiele","Pins","Schnitt Mann.","Schnitt Einzel"]
[null,null,null,1,"Otto 3",69,168,24931,1780.7857142857142,148.39880952380952,"Aufsteiger"]
[null,null,null,2,"Berufgen. für Gesundheitsdienst 1",63.5,168,24893,1778.0714285714284,148.17261904761904]
[null,null,null,3,"Hamburger Sparkasse 6",54,168,24467,1747.6428571428571,145.63690476190476]
[null,null,null,4,"SG Deutsche Bank Deutschland e.V. 4",51.5,165,24149,1756.2909090909088,146.35757575757575]
[null,null,null,5,"Baloise e.V.  1",38,168,23723,1694.5,141.20833333333334]
[null,null,null,6,"Agentur für Arbeit Hamburg 1",18,165,21317,1550.3272727272727,129.19393939393939]
[]
[null,null,null,null,"KLASSE  C 5","MEISTER",null,"Justizbehörde 2"]
[null,null,null,null,null,"Punkte","Spiele","Pins","Schnitt Mann.","Schnitt Einzel"]
[null,null,null,1,"Justizbehörde 2",102,168,24770,1769.2857142857144,147.4404761904762,"Aufsteiger"]
[null,null,null,2,"SG Stern Hamburg   1",95,165,24494,1781.3818181818181,148.44848484848484,"Aufsteiger"]
[null,null,null,3,"Hamburger Sparkasse 7",85,167,23835,1712.6946107784433,142.7245508982036]
[null,null,null,4,"Elbe-Sport eV 4",83,168,23725,1694.6428571428573,141.2202380952381]
[null,null,null,5,"BMH-Claudius Peters AG 1",78.5,168,23438,1674.1428571428571,139.51190476190476]
[null,null,null,6,"Stadtreinigung 2",77.5,165,22993,1672.2181818181816,139.35151515151514]
[null,null,null,7,"Energie Sportvereinigung 4",38,168,21657,1546.9285714285713,128.91071428571428]
[null,null,null,8,"Baloise e.V.  2",36,168,21758,1554.1428571428571,129.51190476190476]
[null,null,null,9,"Amandus Kahl 1",35,165,21139,1537.3818181818183,128.11515151515152]

{"sheet":"Spielbogen 7er","index":23,"n_rows":49,"n_cols":19,"rows_kept":49,"cut":false,"hidden":false,"merged":[[33,12,33,13],[33,14,33,15],[33,16,33,17],[33,18,33,19],[31,6,31,7],[31,8,31,9],[31,10,31,11],[31,12,31,13],[31,14,31,15],[31,16,31,17],[31,18,31,19],[33,6,33,7],[33,8,33,9],[33,10,33,11],[35,18,35,19],[37,6,37,7],[37,8,37,9],[37,10,37,11],[37,12,37,13],[37,14,37,15],[37,16,37,17],[37,18,37,19],[35,6,35,7],[35,8,35,9],[35,10,35,11],[35,12,35,13],[35,14,35,15],[35,16,35,17],[43,18,43,19],[45,6,45,7],[45,8,45,9],[45,10,45,11],[45,12,45,13],[45,14,45,15],[45,16,45,17],[45,18,45,19],[43,6,43,7],[43,8,43,9],[43,10,43,11],[43,12,43,13],[43,14,43,15],[43,16,43,17],[39,18,39,19],[41,6,41,7],[41,8,41,9],[41,10,41,11],[41,12,41,13],[41,14,41,15],[41,16,41,17],[41,18,41,19],[39,6,39,7],[39,8,39,9],[39,10,39,11],[39,12,39,13],[39,14,39,15],[39,16,39,17],[29,18,29,19],[29,6,29,7],[29,8,29,9],[29,10,29,11],[29,12,29,13],[29,14,29,15],[29,16,29,17],[25,18,25,19],[27,6,27,7],[27,8,27,9],[27,10,27,11],[27,12,27,13],[27,14,27,15],[27,16,27,17],[27,18,27,19],[25,6,25,7],[25,8,25,9],[25,10,25,11],[25,12,25,13],[25,14,25,15],[25,16,25,17],[23,16,23,17],[23,18,23,19],[21,6,21,7],[21,16,21,17],[21,18,21,19],[21,14,21,15],[21,12,21,13],[21,10,21,11],[21,8,21,9],[45,2,45,5],[46,3,46,5],[47,2,47,5],[4,2,5,3],[4,5,5,5],[39,2,39,5],[40,3,40,5],[41,2,41,5],[42,3,42,5],[43,2,43,5],[44,3,44,5],[33,2,33,5],[34,3,34,5],[35,2,35,5],[36,3,36,5],[37,2,37,5],[38,3,38,5],[27,2,27,5],[28,3,28,5],[29,2,29,5],[30,3,30,5],[31,2,31,5],[32,3,32,5],[21,2,21,5],[22,3,22,5],[23,2,23,5],[24,3,24,5],[25,2,25,5],[26,3,26,5],[16,13,16,14],[18,3,18,5],[19,2,19,5],[20,3,20,5],[23,6,23,7],[23,8,23,9],[23,10,23,11],[23,12,23,13],[23,14,23,15],[14,3,14,7],[14,13,14,14],[15,3,15,7],[15,13,15,14],[12,3,12,7],[12,13,12,14],[13,3,13,7],[13,13,13,14],[10,3,10,7],[10,13,10,14],[11,3,11,7],[11,13,11,14],[8,13,8,14],[9,3,9,7],[9,13,9,14],[6,13,6,14],[7,13,7,14],[4,13,4,14],[5,13,5,14],[0,2,0,19],[1,2,1,9],[1,12,1,19],[2,12,2,14],[3,13,3,14]]}
["Start",null,"Betriebssportverband Hamburg e.V."]
["Rangliste",null," -  Sparte Bowling  -",null,null,null,null,null,null,null,null,null,"-  Spielsystembogen  -"]
[null,null,null,null,null,null,null,null,null,null," "," ","Antritt    Bahn",null,null,"Datum",null,"Ausrichter"]
[null,null,null,null,null,null,null,null,null,null,null,null,"1.","OT",null,"2024-09-12",null,1,{"$f":"I10","v":"PAN 1"}]
[null,null,"Klasse",null,null,{"$f":"+'Hilfstabelle Mannschaften'!I4","v":"B4"},null,null,null,null,null,null,"2.","OT",null,"2024-09-26",null,2,{"$f":"I11","v":"DAT 2"}]
[null,null,null,null,null,null,null,null,null,null," ",null,"3.","WB",null,"2024-10-10",null,3,{"$f":"I12","v":"STI 3"}]
[null,null,null,null,null,null,null,null,null,null,null,null,"4.","OT",null,"2024-10-24",null,4,"SGS 1"]
[null,null,null,null,null,null,null,null,null," ",null,null,"5.","WB",null,"2024-11-07",null,5,"JUS 2"]
[null,null,null,"BSG",null,null,null,null,"Kurzf.",null,null,null,"6.","WB",null,"2025-01-16",null,6,"P2 2"]
[null,null,1,"Panasonic 1",null,null,null,null,"PAN 1",null,null,null,"7.","OT",null,"2025-01-30",null,7,"KS 2"]
[null,null,2,"Dataport 2",null,null,null,null,"DAT 2",null,null,null,"8.","WB",null,"2025-02-13",null,1,{"$f":"I10","v":"PAN 1"}]
[null,null,3,"Still 3",null,null,null,null,"STI 3",null,null,null,"9.","OT",null,"2025-02-27",null,2,{"$f":"I11","v":"DAT 2"}]
[null,null,4,"SG Stern Hamburg 1",null,null,null,null,"SGS 1",null,null,null,"10.","WB",null,"2025-03-13",null,3,"STI 3"]
[null,null,5,"Justitzbehörde 2",null,null,null,null,"JUS 2",null,null,null,"11.","OT",null,"2025-03-27",null,4,"SGS 1"]
[null,null,6,"Postamt 2",null,null,null,null,"P2 2",null,null,null,"12.","WB",null,"2025-04-10",null,5,"JUS 2"]
[null,null,7,"Körber Sports 2",null,null,null,null,"KS 2",null,null,null,"13.","OT",null,"2025-04-24",null,6,"P2 2"]
[null,null,null,null,null,null,null,null,null,null,null,null,"14.","WB",null,"2025-05-08",null,7,{"$f":"I16","v":"KS 2"}]
[null,null,null,null,null,null,null,null,null,null,null,null,null," "]
[null,null,"Antritt","Halle"]
[null,null,"Datum"]
[null,null,"1 . A.","OT",null,null,7,null,6,null,4,null,5,null,3,null,1,null,2]
[null,null,"2024-09-12",null,null,null,{"$f":"VLOOKUP(G21,$C$10:$J$17,7,0)","v":"KS 2"},null,{"$f":"VLOOKUP(I21,$C$10:$J$17,7,0)","v":"P2 2"},null,{"$f":"VLOOKUP(K21,$C$10:$J$17,7,0)","v":"SGS 1"},null,{"$f":"VLOOKUP(M21,$C$10:$J$17,7,0)","v":"JUS 2"},null,{"$f":"VLOOKUP(O21,$C$10:$J$17,7,0)","v":"STI 3"},null,{"$f":"VLOOKUP(Q21,$C$10:$J$17,7,0)","v":"PAN 1"},null,{"$f":"VLOOKUP(S21,$C$10:$J$17,7,0)","v":"DAT 2"}]
[null,null,"2 . A.","OT",null,null,3,null,4,null,2,null,1,null,5,null,6,null,7]
[null,null,"2024-09-26",null,null,null,{"$f":"VLOOKUP(G23,$C$10:$J$17,7,0)","v":"STI 3"},null,{"$f":"VLOOKUP(I23,$C$10:$J$17,7,0)","v":"SGS 1"},null,{"$f":"VLOOKUP(K23,$C$10:$J$17,7,0)","v":"DAT 2"},null,{"$f":"VLOOKUP(M23,$C$10:$J$17,7,0)","v":"PAN 1"},null,{"$f":"VLOOKUP(O23,$C$10:$J$17,7,0)","v":"JUS 2"},null,{"$f":"VLOOKUP(Q23,$C$10:$J$17,7,0)","v":"P2 2"},null,{"$f":"VLOOKUP(S23,$C$10:$J$17,7,0)","v":"KS 2"}]
[null,null,"3 . A.","WB",null,null,5,null,7,null,3,null,2,null,1,null,4,null,6]
[null,null,"2024-10-10",null,null,null,{"$f":"VLOOKUP(G25,$C$10:$J$17,7,0)","v":"JUS 2"},null,{"$f":"VLOOKUP(I25,$C$10:$J$17,7,0)","v":"KS 2"},null,{"$f":"VLOOKUP(K25,$C$10:$J$17,7,0)","v":"STI 3"},null,{"$f":"VLOOKUP(M25,$C$10:$J$17,7,0)","v":"DAT 2"},null,{"$f":"VLOOKUP(O25,$C$10:$J$17,7,0)","v":"PAN 1"},null,{"$f":"VLOOKUP(Q25,$C$10:$J$17,7,0)","v":"SGS 1"},null,{"$f":"VLOOKUP(S25,$C$10:$J$17,7,0)","v":"P2 2"}]
[null,null,"4 . A.","OT",null,null,4,null,2,null,6,null,1,null,7,null,3,null,5]
[null,null," 24.10.24",null,null,null,{"$f":"VLOOKUP(G27,$C$10:$J$17,7,0)","v":"SGS 1"},null,{"$f":"VLOOKUP(I27,$C$10:$J$17,7,0)","v":"DAT 2"},null,{"$f":"VLOOKUP(K27,$C$10:$J$17,7,0)","v":"P2 2"},null,{"$f":"VLOOKUP(M27,$C$10:$J$17,7,0)","v":"PAN 1"},null,{"$f":"VLOOKUP(O27,$C$10:$J$17,7,0)","v":"KS 2"},null,{"$f":"VLOOKUP(Q27,$C$10:$J$17,7,0)","v":"STI 3"},null,{"$f":"VLOOKUP(S27,$C$10:$J$17,7,0)","v":"JUS 2"}]
[null,null,"5 . A.","WB",null,null,1,null,5,null,2,null,7,null,4,null,6,null,3]
[null,null,"2024-11-07",null,null,null,{"$f":"VLOOKUP(G29,$C$10:$J$17,7,0)","v":"PAN 1"},null,{"$f":"VLOOKUP(I29,$C$10:$J$17,7,0)","v":"JUS 2"},null,{"$f":"VLOOKUP(K29,$C$10:$J$17,7,0)","v":"DAT 2"},null,{"$f":"VLOOKUP(M29,$C$10:$J$17,7,0)","v":"KS 2"},null,{"$f":"VLOOKUP(O29,$C$10:$J$17,7,0)","v":"SGS 1"},null,{"$f":"VLOOKUP(Q29,$C$10:$J$17,7,0)","v":"P2 2"},null,{"$f":"VLOOKUP(S29,$C$10:$J$17,7,0)","v":"STI 3"}]
[null,null,"6 . A.","WB",null,null,6,null,3,null,7,null,4,null,2,null,5,null,1]
[null,null,"2025-01-16",null,null,null,{"$f":"VLOOKUP(G31,$C$10:$J$17,7,0)","v":"P2 2"},null,{"$f":"VLOOKUP(I31,$C$10:$J$17,7,0)","v":"STI 3"},null,{"$f":"VLOOKUP(K31,$C$10:$J$17,7,0)","v":"KS 2"},null,{"$f":"VLOOKUP(M31,$C$10:$J$17,7,0)","v":"SGS 1"},null,{"$f":"VLOOKUP(O31,$C$10:$J$17,7,0)","v":"DAT 2"},null,{"$f":"VLOOKUP(Q31,$C$10:$J$17,7,0)","v":"JUS 2"},null,{"$f":"VLOOKUP(S31,$C$10:$J$17,7,0)","v":"PAN 1"}]
[null,null,"7 . A.","OT",null,null,7,null,1,null,5,null,3,null,6,null,2,null,4]
[null,null,"2025-01-30",null,null,null,{"$f":"VLOOKUP(G33,$C$10:$J$17,7,0)","v":"KS 2"},null,{"$f":"VLOOKUP(I33,$C$10:$J$17,7,0)","v":"PAN 1"},null,{"$f":"VLOOKUP(K33,$C$10:$J$17,7,0)","v":"JUS 2"},null,{"$f":"VLOOKUP(M33,$C$10:$J$17,7,0)","v":"STI 3"},null,{"$f":"VLOOKUP(O33,$C$10:$J$17,7,0)","v":"P2 2"},null,{"$f":"VLOOKUP(Q33,$C$10:$J$17,7,0)","v":"DAT 2"},null,{"$f":"VLOOKUP(S33,$C$10:$J$17,7,0)","v":"SGS 1"}]
[null,null,"8 . A.","WB",null,null,5,null,2,null,1,null,4,null,3,null,7,null,6]
[null,null,"2025-02-13",null,null,null,{"$f":"VLOOKUP(G35,$C$10:$J$17,7,0)","v":"JUS 2"},null,{"$f":"VLOOKUP(I35,$C$10:$J$17,7,0)","v":"DAT 2"},null,{"$f":"VLOOKUP(K35,$C$10:$J$17,7,0)","v":"PAN 1"},null,{"$f":"VLOOKUP(M35,$C$10:$J$17,7,0)","v":"SGS 1"},null,{"$f":"VLOOKUP(O35,$C$10:$J$17,7,0)","v":"STI 3"},null,{"$f":"VLOOKUP(Q35,$C$10:$J$17,7,0)","v":"KS 2"},null,{"$f":"VLOOKUP(S35,$C$10:$J$17,7,0)","v":"P2 2"}]
[null,null,"9 . A.","OT",null,null,2,null,4,null,3,null,6,null,7,null,1,null,5]
[null,null,"2025-02-27",null,null,null,{"$f":"VLOOKUP(G37,$C$10:$J$17,7,0)","v":"DAT 2"},null,{"$f":"VLOOKUP(I37,$C$10:$J$17,7,0)","v":"SGS 1"},null,{"$f":"VLOOKUP(K37,$C$10:$J$17,7,0)","v":"STI 3"},null,{"$f":"VLOOKUP(M37,$C$10:$J$17,7,0)","v":"P2 2"},null,{"$f":"VLOOKUP(O37,$C$10:$J$17,7,0)","v":"KS 2"},null,{"$f":"VLOOKUP(Q37,$C$10:$J$17,7,0)","v":"PAN 1"},null,{"$f":"VLOOKUP(S37,$C$10:$J$17,7,0)","v":"JUS 2"}]
[null,null,"10 . A.","WB",null,null,3,null,1,null,5,null,7,null,6,null,4,null,2]
[null,null,"2025-03-13",null,null,null,{"$f":"VLOOKUP(G39,$C$10:$J$17,7,0)","v":"STI 3"},null,{"$f":"VLOOKUP(I39,$C$10:$J$17,7,0)","v":"PAN 1"},null,{"$f":"VLOOKUP(K39,$C$10:$J$17,7,0)","v":"JUS 2"},null,{"$f":"VLOOKUP(M39,$C$10:$J$17,7,0)","v":"KS 2"},null,{"$f":"VLOOKUP(O39,$C$10:$J$17,7,0)","v":"P2 2"},null,{"$f":"VLOOKUP(Q39,$C$10:$J$17,7,0)","v":"SGS 1"},null,{"$f":"VLOOKUP(S39,$C$10:$J$17,7,0)","v":"DAT 2"}]
[null,null,"11 . A.","OT",null,null,6,null,5,null,4,null,3,null,1,null,2,null,7]
[null,null,"2025-03-27",null,null,null,{"$f":"VLOOKUP(G41,$C$10:$J$17,7,0)","v":"P2 2"},null,{"$f":"VLOOKUP(I41,$C$10:$J$17,7,0)","v":"JUS 2"},null,{"$f":"VLOOKUP(K41,$C$10:$J$17,7,0)","v":"SGS 1"},null,{"$f":"VLOOKUP(M41,$C$10:$J$17,7,0)","v":"STI 3"},null,{"$f":"VLOOKUP(O41,$C$10:$J$17,7,0)","v":"PAN 1"},null,{"$f":"VLOOKUP(Q41,$C$10:$J$17,7,0)","v":"DAT 2"},null,{"$f":"VLOOKUP(S41,$C$10:$J$17,7,0)","v":"KS 2"}]
[null,null,"12 . A.","WB",null,null,2,null,3,null,7,null,6,null,4,null,5,null,1]
[null,null,"2025-04-10",null,null,null,{"$f":"VLOOKUP(G43,$C$10:$J$17,7,0)","v":"DAT 2"},null,{"$f":"VLOOKUP(I43,$C$10:$J$17,7,0)","v":"STI 3"},null,{"$f":"VLOOKUP(K43,$C$10:$J$17,7,0)","v":"KS 2"},null,{"$f":"VLOOKUP(M43,$C$10:$J$17,7,0)","v":"P2 2"},null,{"$f":"VLOOKUP(O43,$C$10:$J$17,7,0)","v":"SGS 1"},null,{"$f":"VLOOKUP(Q43,$C$10:$J$17,7,0)","v":"JUS 2"},null,{"$f":"VLOOKUP(S43,$C$10:$J$17,7,0)","v":"PAN 1"}]
[null,null,"13 . A.","OT",null,null,1,null,6,null,3,null,5,null,2,null,7,null,4]
[null,null,"2025-04-24",null,null,null,{"$f":"VLOOKUP(G45,$C$10:$J$17,7,0)","v":"PAN 1"},null,{"$f":"VLOOKUP(I45,$C$10:$J$17,7,0)","v":"P2 2"},null,{"$f":"VLOOKUP(K45,$C$10:$J$17,7,0)","v":"STI 3"},null,{"$f":"VLOOKUP(M45,$C$10:$J$17,7,0)","v":"JUS 2"},null,{"$f":"VLOOKUP(O45,$C$10:$J$17,7,0)","v":"DAT 2"},null,{"$f":"VLOOKUP(Q45,$C$10:$J$17,7,0)","v":"KS 2"},null,{"$f":"VLOOKUP(S45,$C$10:$J$17,7,0)","v":"SGS 1"}]
[null,null,"14 . A.","WB",null,null,"6 .",null,"7 .",null,"3 .",null,"4 .",null,"1 .",null,"2 .",null,"5 ."]
[null,null,"2025-05-08",null,null,null,null,null,null,null," ",null,null,null," "]
[null,null,"Stand Mai 2015"]

{"sheet":"BSG-Schnittliste Saison 23-24","index":24,"n_rows":16,"n_cols":10,"rows_kept":16,"cut":false,"hidden":false,"merged":[[5,5,5,6],[5,7,5,8]]}
[null,"Start"]
[null,"Rangliste",null,"BSG-Schnittliste Saison 2023-2024"]
[]
[null,null,"Rangliste","Pass-Nr.","Name","BSG","m/w","Anz. Spiele","Pins","Schnitt"]
[]
[null,null,"","PAN","Panasonic","BSG-Nr.",null,53807,null,""]
[null,null,54,null,"Frahm, Jörg","PAN","m",55,9481,172.38181818181818]
[null,null,"",null,"Hagelstein, Deniz","PAN","m",21,2931,139.57142857142858]
[null,null,"",null,"Jurk, Mario","PAN","m",12,2225,185.41666666666666]
[null,null,"",null,"Nijholt, Frank","PAN","m",15,2045,136.33333333333334]
[null,null,"",null,"Nolte, Matthias","PAN","m",6,808,134.66666666666666]
[null,null,"",null,"Roßberg, Kai","PAN","m",12,2326,193.83333333333334]
[null,null,35,null,"Schmidt, Annegret","PAN","w",62,8712,140.51612903225808]
[null,null,"",null,"Wetzel, Ilona","PAN","w",42,6011,143.11904761904762]
[null,null,50,null,"Wetzel, Michael","PAN","m",64,11154,174.28125]
[null,null,"",null,null,null,null,289,45693,158.10726643598616]

{"sheet":"\"Alters\"-Übersicht","index":25,"n_rows":14,"n_cols":12,"rows_kept":14,"cut":false,"hidden":false,"merged":[[2,3,2,12],[3,4,3,5],[3,7,3,8],[3,10,3,12],[4,5,4,6],[4,8,4,9],[4,11,4,12],[5,5,5,6],[5,8,5,9],[5,11,5,12],[6,5,6,6],[6,8,6,9],[6,11,6,12],[7,5,7,6],[7,8,7,9],[7,11,7,12],[8,5,8,6],[8,8,8,9],[8,11,8,12],[9,5,9,6],[9,8,9,9],[9,11,9,12],[10,5,10,6],[10,8,10,9],[10,11,10,12],[11,5,11,6],[11,8,11,9],[11,11,11,12],[12,5,12,6],[12,8,12,9],[12,11,12,12]]}
[null,"Start"]
[null,"Rangliste"]
[null,null,null,"\"Alters\"-Übersicht über alle in der Saison 2023-24 aktiven Spieler/innen"]
[null,null,null,"bis Ende des Jahres","Damen",null,null,"Herren",null,null,"Gesamt"]
[null,null,null,"80 und älter",4,2.2988505747126436E-2,null,17,3.4764826175869123E-2,null,21,3.1674208144796379E-2]
[null,null,null,"70-79 Jahre",24,0.13793103448275862,null,100,0.20449897750511248,null,124,0.18702865761689291]
[null,null,null,"60-69 Jahre",71,0.40804597701149425,null,184,0.37627811860940696,null,255,0.38461538461538464]
[null,null,null,"50-59 Jahre",37,0.21264367816091953,null,86,0.17586912065439672,null,123,0.18552036199095023]
[null,null,null,"davon Senioren",136,0.7816091954022989,null,387,0.79141104294478526,null,523,0.78883861236802411]
[null,null,null,"40-49 Jahre",22,0.12643678160919541,null,56,0.11451942740286299,null,78,0.11764705882352941]
[null,null,null,"30-39 Jahre",11,6.3218390804597707E-2,null,33,6.7484662576687116E-2,null,44,6.636500754147813E-2]
[null,null,null,"20-29 Jahre",5,2.8735632183908046E-2,null,11,2.2494887525562373E-2,null,16,2.4132730015082957E-2]
[null,null,null,"unter 20 Jahre",0,0,null,2,4.0899795501022499E-3,null,2,3.0165912518853697E-3]
[null,null,null,"Gesamt",174,0.26244343891402716,null,489,0.73755656108597289,null,663]

{"sheet":"Ergebnisse nach BVH","index":26,"n_rows":14,"n_cols":96,"rows_kept":14,"cut":false,"hidden":false,"merged":[[3,0,3,8],[3,14,3,21],[3,28,3,36],[3,84,3,92],[0,14,0,21],[0,28,0,36],[0,42,0,50],[0,56,0,64],[0,84,0,92],[0,70,0,78],[3,42,3,50],[3,56,3,64],[3,70,3,78]]}
["Start"]
["Rangliste"]
[]
["Ergebnisse der Punktspielsaison  2024 / 2025",null,null,null,null,null,null,null,null,null,null,null,null,null,"Ergebnisse der Punktspielsaison  2024 / 2025",null,null,null,null,null,null,null,null,null,null,null,null,null,"Ergebnisse der Punktspielsaison  2024 / 2025",null,null,null,null,null,null,null,null,null,null,null,null,null,"Ergebnisse der Punktspielsaison  2024 / 2025",null,null,null,null,null,null,null,null,null,null,null,null,null,"Ergebnisse der Punktspielsaison  2024 / 2025",null,null,null,null,null,null,null,null,null,null,null,null,null,"Ergebnisse der Punktspielsaison  2024 / 2025",null,null,null,null,null,null,null,null,null,null,null,null,null,"Ergebnisse der Punktspielsaison  2024 / 2025"]
[null,null,null,null,null,"Punktspiele 1 + 2",null,null,null,null,null,null,null,null,null,null,null,null,null,"Punktspiele 3 + 4",null,null,null,null,null,null,null,null,null,null,null,null,null,"Punktspiele 5 + 6",null,null,null,null,null,null,null,null,null,null,null,null,null,"Punktspiele 7 + 8",null,null,null,null,null,null,null,null,null,null,null,null,null,"Punktspiele 9 + 10",null,null,null,null,null,null,null,null,null,null,null,null,null,"Punktspiele 11 + 12",null,null,null,null,null,null,null,null,"Bemerkungen",null,null,null,null,"Punktspiele 13 + 14"]
["BSG","Pins Antritt","Punkte Antritt","Punkte gesamt",null,null,null,"BSG","Pins Antritt","Punkte Antritt","Punkte gesamt","Pins gesamt",null,null,"BSG","Pins Antritt","Punkte Antritt","Punkte gesamt","Pins gesamt",null,null,"BSG","Pins Antritt","Punkte Antritt","Punkte gesamt","Pins gesamt",null,null,"BSG","Pins Antritt","Punkte Antritt","Punkte gesamt","Pins gesamt",null,null,"BSG","Pins Antritt","Punkte Antritt","Punkte gesamt","Pins gesamt",null,null,"BSG","Pins Antritt","Punkte Antritt","Punkte gesamt","Pins gesamt",null,null,"BSG","Pins Antritt","Punkte Antritt","Punkte gesamt","Pins gesamt",null,null,"BSG","Pins Antritt","Punkte Antritt","Punkte gesamt","Pins gesamt",null,null,"BSG","Pins Antritt","Punkte Antritt","Punkte gesamt","Pins gesamt",null,null,"BSG","Pins Antritt","Punkte Antritt","Punkte gesamt","Pins gesamt",null,null,"BSG","Pins Antritt","Punkte Antritt","Punkte gesamt","Pins gesamt",null,null,"BSG","Pins Antritt","Punkte Antritt","Punkte gesamt","Pins gesamt",null,null,"BSG","Pins Antritt","Punkte Antritt","Punkte gesamt","Pins gesamt"]
["Klasse  ","B 4","01. Antritt",null,null,null,null,"Klasse  ","B 4","02. Antritt",null,null,null,null,"Klasse  ","B 4","03. Antritt",null,null,null,null,"Klasse  ","B 4","04. Antritt",null,null,null,null,"Klasse  ","B 4","05. Antritt",null,null,null,null,"Klasse  ","B 4","06. Antritt",null,null,null,null,"Klasse  ","B 4","07. Antritt",null,null,null,null,"Klasse  ","B 4","08. Antritt",null,null,null,null,"Klasse  ","B 4","09. Antritt",null,null,null,null,"Klasse  ","B 4","10. Antritt",null,null,null,null,"Klasse  ","B 4","11. Antritt",null,null,null,null,"Klasse  ","B 4","12. Antritt",null,null,null,null,"Klasse  ","B 4","13. Antritt",null,null,null,null,"Klasse  ","B 4","14. Antritt"]
["PAN 1",1914,7,7,null,null,null,"PAN 1",1912,7,14,3826,null,null,"PAN 1",1975,7,21,5801,null,null,"PAN 1",1777,5,26,7578,null,null,"PAN 1",1907,6,32,9485,null,null,"PAN 1",1880,4,36,11365,null,null,"PAN 1",1686,1,37,13051,null,null,"PAN 1",1817,2,39,14868,null,null,"PAN 1",1832,5,44,16700,null,null,"PAN 1",2017,7,51,18717,null,null,"PAN 1",1867,4,55,20584,null,null,"PAN 1",1845,3,58,22429,null,null,"KS 2",1922,7,65,23341,null,null,null,null,null,null,{"$f":"IF(CN8=\"\",\"\",VLOOKUP(CN8,CG$5:CK$169,5,0)+CO8)","v":""}]
["P2 2",1740,6,6,null,null,null,"P2 2",1761,6,12,3501,null,null,"P2 2",1781,4,16,5282,null,null,"STI 3",1788,6,18,6897,null,null,"KS 2",1914,7,22,8286,null,null,"DAT 2",1968,6,24,10490,null,null,"DAT 2",1822,6,30,12312,null,null,"DAT 2",1940,5,35,14252,null,null,"KS 2",2014,7,42,15671,null,null,"KS 2",1974,6,48,17645,null,null,"KS 2",1757,3,51,19402,null,null,"KS 2",2017,7,58,21419,null,null,"PAN 1",1900,5,63,24329,null,null,null,null,null,null,""]
["STI 3",1732,5,5,null,null,null,"DAT 2",1748,5,9,3334,null,null,"STI 3",1805,5,12,5109,null,null,"P2 2",1659,1,17,6941,null,null,"STI 3",1806,2,20,8703,null,null,"STI 3",1853,3,23,10556,null,null,"SGS 1",1830,7,28,12119,null,null,"KS 2",2149,7,35,13657,null,null,"DAT 2",1762,4,39,16014,null,null,"DAT 2",1842,5,44,17856,null,null,"DAT 2",1952,5,49,19808,null,null,"DAT 2",1888,4,53,21696,null,null,"DAT 2",1733,2,55,23429,null,null,null,null,null,null,""]
["DAT 2",1586,4,4,null,null,null,"STI 3",1572,2,7,3304,null,null,"DAT 2",1606,2,11,4940,null,null,"KS 2",1952,7,15,6372,null,null,"P2 2",1759,1,18,8700,null,null,"KS 2",1445,1,23,9731,null,null,"KS 2",1777,5,28,11508,null,null,"SGS 1",1822,3,31,13941,null,null,"SGS 1",1661,2,33,15602,null,null,"JUS 2",1756,4,36,17151,null,null,"SGS 1",1953,6,41,19261,null,null,"SGS 1",1984,6,47,21245,null,null,"STI 3",1906,6,48,23055,null,null,null,null,null,null,""]
["SGS 1",1528,3,3,null,null,null,"SGS 1",1637,3,6,3165,null,null,"JUS 2",1609,3,9,4622,null,null,"DAT 2",1733,3,14,6673,null,null,"DAT 2",1849,4,18,8522,null,null,"SGS 1",2011,7,21,10289,null,null,"STI 3",1724,2,25,12280,null,null,"JUS 2",1958,6,31,13840,null,null,"STI 3",1835,6,32,15893,null,null,"STI 3",1718,3,35,17611,null,null,"P2 2",2062,7,38,19411,null,null,"STI 3",1899,5,42,21149,null,null,"SGS 1",1541,1,48,22786,null,null,null,null,null,null,""]
["JUS 2",1349,2,2,null,null,null,"JUS 2",1664,4,6,3013,null,null,"KS 2",1909,6,8,4420,null,null,"JUS 2",1734,4,13,6356,null,null,"JUS 2",1811,3,16,8167,null,null,"JUS 2",1961,5,21,10128,null,null,"JUS 2",1754,4,25,11882,null,null,"P2 2",1824,4,27,13965,null,null,"JUS 2",1555,1,32,15395,null,null,"SGS 1",1706,2,35,17308,null,null,"STI 3",1639,2,37,19250,null,null,"P2 2",1718,1,39,21129,null,null,"JUS 2",1841,4,43,22212,null,null,null,null,null,null,""]
["KS 2",1229,1,1,null,null,null,"KS 2",1282,1,2,2511,null,null,"SGS 1",1502,1,7,4667,null,null,"SGS 1",1714,2,9,6381,null,null,"SGS 1",1897,5,14,8278,null,null,"P2 2",1692,2,20,10392,null,null,"P2 2",1749,3,23,12141,null,null,"STI 3",1778,1,26,14058,null,null,"P2 2",1751,3,30,15716,null,null,"P2 2",1633,1,31,17349,null,null,"JUS 2",1418,1,37,18569,null,null,"JUS 2",1802,2,39,20371,null,null,"P2 2",1793,3,42,22922,null,null,null,null,null,null,""]

{"sheet":"10er","index":27,"n_rows":50,"n_cols":11,"rows_kept":50,"cut":false,"hidden":true,"merged":[[0,0,0,10],[1,0,1,4],[1,6,1,10]]}
[" Betriebssportverband Hamburg e.V."]
["-  Sparte Bowling  -",null,null,null,null,null,"-  Spielsystembogen  -"]
[]
["Klasse       ",null,null,null,null,null,"Antritt","Bahn","Datum","    Ausrichter"]
[null,null,null,null,null,null,"1."," "," ",1,{"$f":"E9","v":"  "}]
[null,null,null,null,null,null,"2."," "," ",2,{"$f":"E10","v":" "}]
[null,null,null,null," ",null,"3."," "," ",3,{"$f":"E11","v":" "}]
[null,"BSG",null,null,"Kurzf.",null,"4."," "," ",4," "]
[1,null,null,null,"  ",null,"5."," "," ",5," "]
[2,null,null,null," ",null,"6."," "," ",6," "]
[3," ",null,null," ",null,"7."," "," ",7," "]
[4,null,null,null," ",null,"8."," "," ",8," "]
[5,null,null,null," ",null,"9."," "," ",9," "]
[6,null,null,null," ",null,"10."," "," ",10," "]
[7,null,null,null," ",null,"11."," "," ",1,{"$f":"E9","v":"  "}]
[8,null,null,null," ",null,"12."," "," ",2,{"$f":"E10","v":" "}]
[9,null,null,null," ",null,"13."," "," ",3," "]
[10,null,null,null," ",null,"14."," "," ",4,{"$f":"E12","v":" "}]
[null,null,null,null,null,null," "]
["Antritt"]
["Halle"]
["1 . A.",1,6,8,3,7,10,9,4,5,2]
[" ",{"$f":"VLOOKUP(B22,$A$7:$E$18,5,0)","v":"  "},{"$f":"VLOOKUP(C22,$A$7:$E$18,5,0)","v":" "},{"$f":"VLOOKUP(D22,$A$7:$E$18,5,0)","v":" "}," "," "," "," "," "," "," "]
["2 . A.",5,8,10,1,9,2,4,7,3,6]
[" ",{"$f":"VLOOKUP(B24,$A$7:$E$18,5,0)","v":" "},{"$f":"VLOOKUP(C24,$A$7:$E$18,5,0)","v":" "},{"$f":"VLOOKUP(D24,$A$7:$E$18,5,0)","v":" "},"  "," "," "," "," "," "," "]
["3 . A.",3,1,7,5,10,8,6,9,2,4]
[" ",{"$f":"VLOOKUP(B26,$A$7:$E$18,5,0)","v":" "},{"$f":"VLOOKUP(C26,$A$7:$E$18,5,0)","v":"  "},{"$f":"VLOOKUP(D26,$A$7:$E$18,5,0)","v":" "}," "," "," "," "," "," "," "]
["4 . A.",2,7,5,9,8,1,4,6,10,3]
[" ",{"$f":"VLOOKUP(B28,$A$7:$E$18,5,0)","v":" "},{"$f":"VLOOKUP(C28,$A$7:$E$18,5,0)","v":" "},{"$f":"VLOOKUP(D28,$A$7:$E$18,5,0)","v":" "}," "," ","  "," "," "," "," "]
["5 . A.",8,4,10,2,1,9,5,3,6,7]
[" ",{"$f":"VLOOKUP(B30,$A$7:$E$18,5,0)","v":" "},{"$f":"VLOOKUP(C30,$A$7:$E$18,5,0)","v":" "},{"$f":"VLOOKUP(D30,$A$7:$E$18,5,0)","v":" "}," ","  "," "," "," "," "," "]
["6 . A.",6,2,4,10,3,7,1,5,8,9]
[" ",{"$f":"VLOOKUP(B32,$A$7:$E$18,5,0)","v":" "},{"$f":"VLOOKUP(C32,$A$7:$E$18,5,0)","v":" "},{"$f":"VLOOKUP(D32,$A$7:$E$18,5,0)","v":" "}," "," "," ","  "," "," "," "]
["7 . A.",7,9,6,8,10,5,3,2,4,1]
[" ",{"$f":"VLOOKUP(B34,$A$7:$E$18,5,0)","v":" "},{"$f":"VLOOKUP(C34,$A$7:$E$18,5,0)","v":" "},{"$f":"VLOOKUP(D34,$A$7:$E$18,5,0)","v":" "}," "," "," "," "," "," ","  "]
["8 . A.",4,5,1,7,2,8,10,6,9,3]
[" ",{"$f":"VLOOKUP(B36,$A$7:$E$18,5,0)","v":" "},{"$f":"VLOOKUP(C36,$A$7:$E$18,5,0)","v":" "},{"$f":"VLOOKUP(D36,$A$7:$E$18,5,0)","v":"  "}," "," "," "," "," "," "," "]
["9 . A.",9,10,3,4,5,6,2,1,7,8]
[" ",{"$f":"VLOOKUP(B38,$A$7:$E$18,5,0)","v":" "},{"$f":"VLOOKUP(C38,$A$7:$E$18,5,0)","v":" "},{"$f":"VLOOKUP(D38,$A$7:$E$18,5,0)","v":" "}," "," "," "," ","  "," "," "]
["10 . A.",3,7,2,6,9,4,8,10,1,5]
[" ",{"$f":"VLOOKUP(B40,$A$7:$E$18,5,0)","v":" "},{"$f":"VLOOKUP(C40,$A$7:$E$18,5,0)","v":" "},{"$f":"VLOOKUP(D40,$A$7:$E$18,5,0)","v":" "}," "," "," "," "," ","  "," "]
["11 . A.",4,8,9,5,6,3,7,1,2,10]
[" ",{"$f":"VLOOKUP(B42,$A$7:$E$18,5,0)","v":" "},{"$f":"VLOOKUP(C42,$A$7:$E$18,5,0)","v":" "},{"$f":"VLOOKUP(D42,$A$7:$E$18,5,0)","v":" "}," "," "," "," ","  "," "," "]
["12 . A.",10,3,1,2,4,6,5,8,9,7]
[" ",{"$f":"VLOOKUP(B44,$A$7:$E$18,5,0)","v":" "},{"$f":"VLOOKUP(C44,$A$7:$E$18,5,0)","v":" "},{"$f":"VLOOKUP(D44,$A$7:$E$18,5,0)","v":"  "}," "," "," "," "," "," "," "]
["13 . A.",2,5,4,7,3,1,10,9,8,6]
[" ",{"$f":"VLOOKUP(B46,$A$7:$E$18,5,0)","v":" "},{"$f":"VLOOKUP(C46,$A$7:$E$18,5,0)","v":" "},{"$f":"VLOOKUP(D46,$A$7:$E$18,5,0)","v":" "}," "," ","  "," "," "," "," "]
["14 . A.","7.","8.","3.","4.","1.","2.","5.","6.","9.","10."]
[" "]
["Stand Mai 2015"]

{"sheet":"Spielbogen 8er","index":28,"n_rows":49,"n_cols":19,"rows_kept":49,"cut":false,"hidden":true,"merged":[[0,2,0,19],[1,2,1,9],[1,12,1,19],[21,14,21,15],[21,16,21,17],[21,18,21,19],[23,4,23,5],[23,6,23,7],[23,8,23,9],[23,10,23,11],[23,12,23,13],[23,14,23,15],[23,16,23,17],[21,4,21,5],[21,6,21,7],[21,8,21,9],[21,10,21,11],[21,12,21,13],[23,18,23,19],[25,4,25,5],[25,6,25,7],[25,8,25,9],[25,10,25,11],[25,12,25,13],[25,14,25,15],[25,16,25,17],[25,18,25,19],[27,16,27,17],[27,18,27,19],[29,4,29,5],[29,6,29,7],[29,8,29,9],[29,10,29,11],[29,12,29,13],[29,14,29,15],[29,16,29,17],[29,18,29,19],[27,4,27,5],[27,6,27,7],[27,8,27,9],[27,10,27,11],[27,12,27,13],[27,14,27,15],[31,16,31,17],[31,18,31,19],[33,4,33,5],[33,6,33,7],[33,8,33,9],[33,10,33,11],[33,12,33,13],[33,14,33,15],[33,16,33,17],[33,18,33,19],[31,4,31,5],[31,6,31,7],[31,8,31,9],[31,10,31,11],[31,12,31,13],[31,14,31,15],[35,16,35,17],[35,18,35,19],[37,4,37,5],[37,6,37,7],[37,8,37,9],[37,10,37,11],[37,12,37,13],[37,14,37,15],[37,16,37,17],[37,18,37,19],[35,4,35,5],[35,6,35,7],[35,8,35,9],[35,10,35,11],[35,12,35,13],[35,14,35,15],[43,14,43,15],[39,16,39,17],[39,18,39,19],[41,4,41,5],[41,6,41,7],[41,8,41,9],[41,10,41,11],[41,12,41,13],[41,14,41,15],[41,16,41,17],[41,18,41,19],[39,4,39,5],[39,6,39,7],[39,8,39,9],[39,10,39,11],[39,12,39,13],[39,14,39,15],[47,16,47,17],[47,18,47,19],[4,2,5,3],[47,4,47,5],[47,6,47,7],[47,8,47,9],[47,10,47,11],[47,12,47,13],[47,14,47,15],[43,16,43,17],[43,18,43,19],[45,4,45,5],[45,6,45,7],[45,8,45,9],[45,10,45,11],[45,12,45,13],[45,14,45,15],[45,16,45,17],[45,18,45,19],[43,4,43,5],[43,6,43,7],[43,8,43,9],[43,10,43,11],[43,12,43,13]]}
["Start",null,"Betriebssportverband Hamburg e.V."]
["Rangliste",null,"-  Sparte Bowling  -",null,null,null,null,null,null,null,null,null,"-  Spielsystembogen  -"]
[null,null,null,null,null,null,null,null,null,null," "," ","Antritt    Bahn",null,null,"Datum",null,"Ausrichter"]
[null,null,null,null,null,null,null,null,null,null,null,null,"1.","OT",null,"2024-09-12",null,1,{"$f":"I10","v":"PAN 1"}]
[null,null,"Klasse      ",null,null,null,null,null,null,null,null,null,"2.","OT",null,"2024-09-26",null,2,{"$f":"I11","v":"DB 3"}]
[null,null,null,null,null,null,null,null,null,null," ",null,"3.","WB",null,"2024-10-10",null,3,{"$f":"I12","v":"DAT 2"}]
[null,null,null,null,null,null,null,null,null,null,null,null,"4.","OT",null,"2024-10-24",null,4,"STI 3"]
[null,null,null,null,null,null,null,null,null," ",null,null,"5.","WB",null,"2024-11-07",null,5,"SGS 1"]
[null,null,null,"BSG",null,null,null,null,"Kurzf.",null,null,null,"6.","WB",null,"2025-01-16",null,6,"JUS 2"]
[null,null,1,"Panasonic 1",null,null,null,null,"PAN 1",null,null,null,"7.","OT",null,"2025-01-30",null,7,"P2 2"]
[null,null,2,"Deutsche Bank 3",null,null,null,null,"DB 3",null,null,null,"8.","WB",null,"2025-02-13",null,8,"KS 2"]
[null,null,3,"Dataport 2",null,null,null,null,"DAT 2",null,null,null,"9.","OT",null,"2025-02-27",null,1,{"$f":"I10","v":"PAN 1"}]
[null,null,4,"Still 3",null,null,null,null,"STI 3",null,null,null,"10.","WB",null,"2025-03-13",null,2,{"$f":"I11","v":"DB 3"}]
[null,null,5,"SG Stern Hamburg 1",null,null,null,null,"SGS 1",null,null,null,"11.","OT",null,"2025-03-27",null,3,"DAT 2"]
[null,null,6,"Justitzbehörde 2",null,null,null,null,"JUS 2",null,null,null,"12.","WB",null,"2025-04-10",null,4,"STI 3"]
[null,null,7,"Postamt 2",null,null,null,null,"P2 2",null,null,null,"13.","OT",null,"2025-04-24",null,5,"SGS 1"]
[null,null,8,"Körber Sports 2",null,null,null,null,"KS 2",null,null,null,"14.","WB",null,"2025-05-08",null,6,{"$f":"I15","v":"JUS 2"}]
[null,null,null,null,null,null,null,null,null,null,null,null,null," "]
[null,null,"Antritt","Halle"]
[null,null,"Datum"]
[null,null,"1 . A.","OT",6,null,7,null,5,null,8,null,4,null,1,null,3,null,2]
[null,null,"2024-09-12",null,{"$f":"VLOOKUP(E21,$C$10:$J$17,7,0)","v":"JUS 2"},null,{"$f":"VLOOKUP(G21,$C$10:$J$17,7,0)","v":"P2 2"},null,{"$f":"VLOOKUP(I21,$C$10:$J$17,7,0)","v":"SGS 1"},null,{"$f":"VLOOKUP(K21,$C$10:$J$17,7,0)","v":"KS 2"},null,{"$f":"VLOOKUP(M21,$C$10:$J$17,7,0)","v":"STI 3"},null,{"$f":"VLOOKUP(O21,$C$10:$J$17,7,0)","v":"PAN 1"},null,{"$f":"VLOOKUP(Q21,$C$10:$J$17,7,0)","v":"DAT 2"},null,{"$f":"VLOOKUP(S21,$C$10:$J$17,7,0)","v":"DB 3"}]
[null,null,"2 . A.","OT",1,null,2,null,3,null,4,null,5,null,6,null,8,null,7]
[null,null,"2024-09-16",null,{"$f":"VLOOKUP(E23,$C$10:$J$17,7,0)","v":"PAN 1"},null,{"$f":"VLOOKUP(G23,$C$10:$J$17,7,0)","v":"DB 3"},null,{"$f":"VLOOKUP(I23,$C$10:$J$17,7,0)","v":"DAT 2"},null,{"$f":"VLOOKUP(K23,$C$10:$J$17,7,0)","v":"STI 3"},null,{"$f":"VLOOKUP(M23,$C$10:$J$17,7,0)","v":"SGS 1"},null,{"$f":"VLOOKUP(O23,$C$10:$J$17,7,0)","v":"JUS 2"},null,{"$f":"VLOOKUP(Q23,$C$10:$J$17,7,0)","v":"KS 2"},null,{"$f":"VLOOKUP(S23,$C$10:$J$17,7,0)","v":"P2 2"}]
[null,null,"3 . A.","WB",5,null,4,null,7,null,2,null,1,null,8,null,6,null,3]
[null,null,"2024-10-10",null,{"$f":"VLOOKUP(E25,$C$10:$J$17,7,0)","v":"SGS 1"},null,{"$f":"VLOOKUP(G25,$C$10:$J$17,7,0)","v":"STI 3"},null,{"$f":"VLOOKUP(I25,$C$10:$J$17,7,0)","v":"P2 2"},null,{"$f":"VLOOKUP(K25,$C$10:$J$17,7,0)","v":"DB 3"},null,{"$f":"VLOOKUP(M25,$C$10:$J$17,7,0)","v":"PAN 1"},null,{"$f":"VLOOKUP(O25,$C$10:$J$17,7,0)","v":"KS 2"},null,{"$f":"VLOOKUP(Q25,$C$10:$J$17,7,0)","v":"JUS 2"},null,{"$f":"VLOOKUP(S25,$C$10:$J$17,7,0)","v":"DAT 2"}]
[null,null,"4 . A.",null,1,null,6,null,3,null,8,null,4,null,7,null,2,null,5]
[null,null,"2024-10-24",null,{"$f":"VLOOKUP(E27,$C$10:$J$17,7,0)","v":"PAN 1"},null,{"$f":"VLOOKUP(G27,$C$10:$J$17,7,0)","v":"JUS 2"},null,{"$f":"VLOOKUP(I27,$C$10:$J$17,7,0)","v":"DAT 2"},null,{"$f":"VLOOKUP(K27,$C$10:$J$17,7,0)","v":"KS 2"},null,{"$f":"VLOOKUP(M27,$C$10:$J$17,7,0)","v":"STI 3"},null,{"$f":"VLOOKUP(O27,$C$10:$J$17,7,0)","v":"P2 2"},null,{"$f":"VLOOKUP(Q27,$C$10:$J$17,7,0)","v":"DB 3"},null,{"$f":"VLOOKUP(S27,$C$10:$J$17,7,0)","v":"SGS 1"}]
[null,null,"5 . A.","WB",8,null,4,null,7,null,5,null,6,null,2,null,1,null,3]
[null,null,"2024-11-07",null,{"$f":"VLOOKUP(E29,$C$10:$J$17,7,0)","v":"KS 2"},null,{"$f":"VLOOKUP(G29,$C$10:$J$17,7,0)","v":"STI 3"},null,{"$f":"VLOOKUP(I29,$C$10:$J$17,7,0)","v":"P2 2"},null,{"$f":"VLOOKUP(K29,$C$10:$J$17,7,0)","v":"SGS 1"},null,{"$f":"VLOOKUP(M29,$C$10:$J$17,7,0)","v":"JUS 2"},null,{"$f":"VLOOKUP(O29,$C$10:$J$17,7,0)","v":"DB 3"},null,{"$f":"VLOOKUP(Q29,$C$10:$J$17,7,0)","v":"PAN 1"},null,{"$f":"VLOOKUP(S29,$C$10:$J$17,7,0)","v":"DAT 2"}]
[null,null,"6 . A.","WB",4,null,6,null,5,null,3,null,7,null,1,null,2,null,8]
[null,null,"2025-01-16",null,{"$f":"VLOOKUP(E31,$C$10:$J$17,7,0)","v":"STI 3"},null,{"$f":"VLOOKUP(G31,$C$10:$J$17,7,0)","v":"JUS 2"},null,{"$f":"VLOOKUP(I31,$C$10:$J$17,7,0)","v":"SGS 1"},null,{"$f":"VLOOKUP(K31,$C$10:$J$17,7,0)","v":"DAT 2"},null,{"$f":"VLOOKUP(M31,$C$10:$J$17,7,0)","v":"P2 2"},null,{"$f":"VLOOKUP(O31,$C$10:$J$17,7,0)","v":"PAN 1"},null,{"$f":"VLOOKUP(Q31,$C$10:$J$17,7,0)","v":"DB 3"},null,{"$f":"VLOOKUP(S31,$C$10:$J$17,7,0)","v":"KS 2"}]
[null,null,"7 . A.","OT",7,null,3,null,2,null,4,null,6,null,8,null,5,null,1]
[null,null,"2025-01-30",null,{"$f":"VLOOKUP(E33,$C$10:$J$17,7,0)","v":"P2 2"},null,{"$f":"VLOOKUP(G33,$C$10:$J$17,7,0)","v":"DAT 2"},null,{"$f":"VLOOKUP(I33,$C$10:$J$17,7,0)","v":"DB 3"},null,{"$f":"VLOOKUP(K33,$C$10:$J$17,7,0)","v":"STI 3"},null,{"$f":"VLOOKUP(M33,$C$10:$J$17,7,0)","v":"JUS 2"},null,{"$f":"VLOOKUP(O33,$C$10:$J$17,7,0)","v":"KS 2"},null,{"$f":"VLOOKUP(Q33,$C$10:$J$17,7,0)","v":"SGS 1"},null,{"$f":"VLOOKUP(S33,$C$10:$J$17,7,0)","v":"PAN 1"}]
[null,null,"8 . A.","WB",8,null,2,null,1,null,7,null,3,null,5,null,4,null,6]
[null,null,"2025-02-13",null,{"$f":"VLOOKUP(E35,$C$10:$J$17,7,0)","v":"KS 2"},null,{"$f":"VLOOKUP(G35,$C$10:$J$17,7,0)","v":"DB 3"},null,{"$f":"VLOOKUP(I35,$C$10:$J$17,7,0)","v":"PAN 1"},null,{"$f":"VLOOKUP(K35,$C$10:$J$17,7,0)","v":"P2 2"},null,{"$f":"VLOOKUP(M35,$C$10:$J$17,7,0)","v":"DAT 2"},null,{"$f":"VLOOKUP(O35,$C$10:$J$17,7,0)","v":"SGS 1"},null,{"$f":"VLOOKUP(Q35,$C$10:$J$17,7,0)","v":"STI 3"},null,{"$f":"VLOOKUP(S35,$C$10:$J$17,7,0)","v":"JUS 2"}]
[null,null,"9 . A.","OT",3,null,1,null,6,null,2,null,8,null,4,null,7,null,5]
[null,null,"2025-02-27",null,{"$f":"VLOOKUP(E37,$C$10:$J$17,7,0)","v":"DAT 2"},null,{"$f":"VLOOKUP(G37,$C$10:$J$17,7,0)","v":"PAN 1"},null,{"$f":"VLOOKUP(I37,$C$10:$J$17,7,0)","v":"JUS 2"},null,{"$f":"VLOOKUP(K37,$C$10:$J$17,7,0)","v":"DB 3"},null,{"$f":"VLOOKUP(M37,$C$10:$J$17,7,0)","v":"KS 2"},null,{"$f":"VLOOKUP(O37,$C$10:$J$17,7,0)","v":"STI 3"},null,{"$f":"VLOOKUP(Q37,$C$10:$J$17,7,0)","v":"P2 2"},null,{"$f":"VLOOKUP(S37,$C$10:$J$17,7,0)","v":"SGS 1"}]
[null,null,"10 . A.","WB",6,null,7,null,8,null,5,null,2,null,3,null,1,null,4]
[null,null,"2025-03-13",null,{"$f":"VLOOKUP(E39,$C$10:$J$17,7,0)","v":"JUS 2"},null,{"$f":"VLOOKUP(G39,$C$10:$J$17,7,0)","v":"P2 2"},null,{"$f":"VLOOKUP(I39,$C$10:$J$17,7,0)","v":"KS 2"},null,{"$f":"VLOOKUP(K39,$C$10:$J$17,7,0)","v":"SGS 1"},null,{"$f":"VLOOKUP(M39,$C$10:$J$17,7,0)","v":"DB 3"},null,{"$f":"VLOOKUP(O39,$C$10:$J$17,7,0)","v":"DAT 2"},null,{"$f":"VLOOKUP(Q39,$C$10:$J$17,7,0)","v":"PAN 1"},null,{"$f":"VLOOKUP(S39,$C$10:$J$17,7,0)","v":"STI 3"}]
[null,null,"11 . A.","OT",2,null,5,null,4,null,7,null,1,null,6,null,3,null,8]
[null,null,"2025-03-27",null,{"$f":"VLOOKUP(E41,$C$10:$J$17,7,0)","v":"DB 3"},null,{"$f":"VLOOKUP(G41,$C$10:$J$17,7,0)","v":"SGS 1"},null,{"$f":"VLOOKUP(I41,$C$10:$J$17,7,0)","v":"STI 3"},null,{"$f":"VLOOKUP(K41,$C$10:$J$17,7,0)","v":"P2 2"},null,{"$f":"VLOOKUP(M41,$C$10:$J$17,7,0)","v":"PAN 1"},null,{"$f":"VLOOKUP(O41,$C$10:$J$17,7,0)","v":"JUS 2"},null,{"$f":"VLOOKUP(Q41,$C$10:$J$17,7,0)","v":"DAT 2"},null,{"$f":"VLOOKUP(S41,$C$10:$J$17,7,0)","v":"KS 2"}]
[null,null,"12 . A.","WB",7,null,8,null,2,null,1,null,3,null,4,null,5,null,6]
[null,null,"2025-04-10",null,{"$f":"VLOOKUP(E43,$C$10:$J$17,7,0)","v":"P2 2"},null,{"$f":"VLOOKUP(G43,$C$10:$J$17,7,0)","v":"KS 2"},null,{"$f":"VLOOKUP(I43,$C$10:$J$17,7,0)","v":"DB 3"},null,{"$f":"VLOOKUP(K43,$C$10:$J$17,7,0)","v":"PAN 1"},null,{"$f":"VLOOKUP(M43,$C$10:$J$17,7,0)","v":"DAT 2"},null,{"$f":"VLOOKUP(O43,$C$10:$J$17,7,0)","v":"STI 3"},null,{"$f":"VLOOKUP(Q43,$C$10:$J$17,7,0)","v":"SGS 1"},null,{"$f":"VLOOKUP(S43,$C$10:$J$17,7,0)","v":"JUS 2"}]
[null,null,"13 . A.","OT",5,null,1,null,8,null,6,null,7,null,3,null,4,null,2]
[null,null,"2025-04-24",null,{"$f":"VLOOKUP(E45,$C$10:$J$17,7,0)","v":"SGS 1"},null,{"$f":"VLOOKUP(G45,$C$10:$J$17,7,0)","v":"PAN 1"},null,{"$f":"VLOOKUP(I45,$C$10:$J$17,7,0)","v":"KS 2"},null,{"$f":"VLOOKUP(K45,$C$10:$J$17,7,0)","v":"JUS 2"},null,{"$f":"VLOOKUP(M45,$C$10:$J$17,7,0)","v":"P2 2"},null,{"$f":"VLOOKUP(O45,$C$10:$J$17,7,0)","v":"DAT 2"},null,{"$f":"VLOOKUP(Q45,$C$10:$J$17,7,0)","v":"STI 3"},null,{"$f":"VLOOKUP(S45,$C$10:$J$17,7,0)","v":"DB 3"}]
[null,null,"14 . A.","WB","7 .",null,"8 .",null,"3 .",null,"4 .",null,"1 .",null,"2 .",null,"5 .",null,"6 ."]
[null,null,"2025-05-08",null," ",null," ",null," ",null," ",null," ",null," ",null," ",null," "]
[null,null,"Stand Mai 2015"]

{"sheet":"Rangliste PANA-Spieler","index":29,"n_rows":67,"n_cols":20,"rows_kept":67,"cut":false,"hidden":false,"merged":[[12,4,13,4],[14,17,14,19],[0,5,0,17],[7,17,7,19],[8,7,9,7],[8,6,9,6],[8,5,9,5],[7,15,8,15],[7,16,8,16],[8,9,9,9],[8,8,9,8],[2,4,2,19],[4,4,5,12],[14,15,15,15],[8,4,9,4],[14,16,15,16],[12,9,13,9],[12,8,13,8],[12,7,13,7],[12,6,13,6],[12,5,13,5],[39,4,40,13],[52,4,53,13],[28,4,29,13],[17,4,18,12],[38,4,38,9]]}
[null,"Start",null,null,null,{"$f":"\"Saison  \"&+Hilfstabelle!D5","v":"Saison  2024/2025"}]
[null,"Rangliste"]
[null,null,null,null,"Rangliste PANA-Spieler"]
[]
[null,null,null,null,"Rangliste >50 Spiele"]
[]
[null,null,null,null,null,null,null,null,null,null,null,null,null,null,null,null,"Damen"]
[null,null,null,null,"Damen",null,null,null,null,null,null,null,null,null,null,null,"Name","lfd. Saison Damen"]
[null,null,null,null,"Platz","Name","BSG","Anzahl\n Spiele","Pins","Schnitt",null,null,null,null,null,null,null,"Anzahl Spiele","Pins","Schnitt"]
[null,null,null,null,null,null,null,null,null,null,null,null,null,null,null,null,"Annegret Schmidt",62,8712,{"$f":"IF(S10<1,\"\",+S10/R10)","v":140.51612903225808}]
[null,null,null,null,null,null,null,null,null,null," ",null,null,null,null,null,"Ilona Wetzel",42,6011,{"$f":"IF(S11<1,\"\",+S11/R11)","v":143.11904761904762}]
[null,null,null,null,"Herren",null,null,null,null,null,null,null,null,null,null,null,null,{"$f":"SUM(S10:S11)","v":14723},{"$f":"SUM(R10:R11)","v":104},{"$f":"+R12/S12","v":141.56730769230768}]
[null,null,null,null,"Platz","Name","BSG","Anzahl\n Spiele","Pins","Schnitt"]
[null,null,null,null,null,null,null,null,null,null,null,null,null,null,null,null,"Herren"]
[null,null,null,null,null,null,null,{"$f":"VLOOKUP(F15,P17:R21,4,0)","v":{"$error":"#N/A"}},{"$f":"VLOOKUP(F15,P17:T21,3,0)","v":{"$error":"#N/A"}},{"$f":"+I15/H15","v":{"$error":"#N/A"}},null,null,null,null,null,null,"Name","lfd. Saison Herren"]
[null,null,null,null,null,null,null,null,null,null,null,null,null,null,null,null,null,"Anzahl Spiele","Pins","Schnitt"]
[null,null,null,null,null,null,null,null,null,null,null,null,null,null,null,null,"Kai Roßberg",12,2326,{"$f":"IF(S17<1,\"\",+S17/R17)","v":193.83333333333334}]
[null,null,null,null,"Höchste Einzelspiele",null,null,null,null,null,null,null,null,null,null,null,"Mario Jurk",12,2225,185.41666666666666]
[null,null,null,null,null,null,null,null,null,null,null,null,null,null,null,null,"Michael Wetzel",64,11154,174.28125]
[null,null,null,null,"Damen",null,null,null,null,null," ",null,null,null,null,null,"Jörg Frahm",55,9481,172.38181818181818]
[null,null,null,null,"Platz","Name","BSG","Pins","Datum","Bahn","Wettbewerb","Gruppe","Antritt",null,null,null,"Deniz Hagelstein",21,2931,139.57142857142858]
[null,null,null,null,null,null,null,null,null,null,null,null,null,null,null,null,"Frank Nijholt",15,2045,136.33333333333334]
[null,null,null,null,null,null,null,null,null,null,null,null,null," ",null,null,"Matthias Nolte",6,808,134.66666666666666]
[null,null,null,null,"Herren",null,null,null,null,null," ",null,null," ",null,null,null,{"$f":"SUM(S17:S23)","v":30970},{"$f":"SUM(R17:R23)","v":185},{"$f":"+R24/S24","v":167.40540540540542}]
[null,null,null,null,"Platz","Name","BSG","Pins","Datum","Bahn","Wettbewerb","Gruppe","Antritt"]
[]
[]
[]
[null,null,null,null,"Höchste Dreierserie"]
[]
[null,null,null,null,"Damen",null,null,null,null,null," "]
[null,null,null,null,"Platz","Name","BSG","Pins","Schnitt","Datum","Bahn","Wettbewerb","Gruppe","Antritt"]
[]
[]
[null,null,null,null,"Herren",null,null,null,null,null," "]
[null,null,null,null,"Platz","Name","BSG","Pins","Schnitt","Datum","Bahn","Wettbewerb","Gruppe","Antritt"]
[]
[]
[null,null,null,null,null,null,null,null,null,null," "]
[null,null,null,null,"Höchste Viererserie"]
[]
[null,null,null,null,"Damen"]
[null,null,null,null,"Platz","Name","BSG","Pins","Schnitt","Datum","Bahn","Wettbewerb","Gruppe","Antritt"]
[]
[]
[]
[null,null,null,null,"Herren",null,null,null,null,null," "]
[null,null,null,null,"Platz","Name","BSG","Pins","Schnitt","Datum","Bahn","Wettbewerb","Gruppe","Antritt"]
[]
[]
[null,null,null,null,null,null,null,null,null,null," "]
[null,null,null,null,null,null,null,null,null,null," "]
[null,null,null,null,"Höchste Sechserserie"]
[]
[null,null,null,null,"Damen",null,null,null,null,null," "]
[null,null,null,null,"Platz","Name","BSG","Pins","Schnitt","Datum","Bahn","Wettbewerb","Gruppe","Antritt"]
[]
[]
[]
[null,null,null,null,"Herren",null,null,null,null,null," ",null,null,null," "]
[null,null,null,null,"Platz","Name","BSG","Pins","Schnitt","Datum","Bahn","Wettbewerb","Gruppe","Antritt"]
[]
[null,null,null,null,null,null,null,null,null,null," "]
[null,null,null,null,null,null,null,null,null,null," "]
[null,null,null,null,null,null,null,null,null,null," "]
[null,null,null,null,null,null,null,null,null,null," "]
[null,null,null,null,null,null,null,null,null,null," "]

{"sheet":"Anmeldegruppen Turniere","index":30,"n_rows":31,"n_cols":22,"rows_kept":31,"cut":false,"hidden":false,"merged":[[28,17,29,17],[28,20,29,20],[20,17,21,17],[20,20,21,20],[23,17,26,17],[23,19,26,19],[28,21,29,21],[6,21,8,21],[10,21,11,21],[13,21,16,21],[20,21,21,21],[3,2,3,21],[4,4,4,16],[23,20,26,20],[6,17,8,17],[6,20,8,20],[10,17,11,17],[10,20,11,20],[6,9,14,9],[6,13,14,13],[18,4,19,7],[23,21,26,21],[13,17,16,17],[13,20,16,20],[13,19,16,19]]}
[null,"Start"]
[null,"Rangliste"]
[]
[null,null,{"$f":"\"Turnierplanung PUNKTSPIELSAISON  \"&'Hilfstabelle Mannschaften'!I8","v":"Turnierplanung PUNKTSPIELSAISON  2024/2025"}]
[null,null,null,null,"Bei  ED, HM,FM und DM bestimmt der/die  ranghöchste Partner/in die Meldegruppe"]
[null,null,null,null,"Mitgliedsname","Pass-Nummer","Rangliste \n2022/23","ED","HC","HM","WB","EM ","EM alternativ","FM","DM",null,null,null,"Gruppen","Termine","Meldeschluss","Letzter Abmeldetermin"]
[null,null,{"$f":"+C6+1","v":1},"D","Ilona Wetzel",22115,{"$f":"VLOOKUP(E7,'Rangliste PANA-Spieler'!$Q$10:$T$11,4,0)","v":143.11904761904762},{"$f":"IF(G7<175,\"B\",\"A\")","v":"B"},null,null,null,"DB","D-SB",null,{"$f":"IF(G7<185,\"B\",IF(G7>=185,\"A\",\"\"))","v":"B"},{"$f":"+L7","v":"DB"},null,"ED = Eröffnungsdoppel  ","Gruppe  A",null,"2024-08-14","2024-09-03"]
[null,null,{"$f":"+C7+1","v":2},"D","Annegret Schmidt",19222,{"$f":"VLOOKUP(E8,'Rangliste PANA-Spieler'!$Q$10:$T$11,4,0)","v":140.51612903225808},"B",null,null,null,"DB","D-SB",null,"B",{"$f":"+#REF!&\" / \"&#REF!","v":{"$error":"#REF!"}},null,null,"Gruppe A/B","07. / 08. Sep. 24"]
[null,null,{"$f":"+C8+1","v":3},"H","Mario Jurk",23302,{"$f":"VLOOKUP(E9,'Rangliste PANA-Spieler'!$Q$17:$T$23,4,0)","v":185.41666666666666},"A",null,null,null,"HC","H-SA",null,"A",{"$f":"+#REF!","v":{"$error":"#REF!"}},null,null,"Gruppe  B"]
[null,null,{"$f":"+C9+1","v":4},"H","Kai Roßberg",21889,{"$f":"VLOOKUP(E10,'Rangliste PANA-Spieler'!$Q$17:$T$23,4,0)","v":193.83333333333334},"A",null,null,null,"HC","H-SA",null,"A",{"$f":"+#REF!","v":{"$error":"#REF!"}}]
[null,null,{"$f":"+C10+1","v":5},"H","Michael Wetzel",22113,{"$f":"VLOOKUP(E11,'Rangliste PANA-Spieler'!$Q$17:$T$23,4,0)","v":174.28125},"B",null,null,null,"HC","H-SB",null,"B",{"$f":"+L8","v":"DB"},null,"HC = Hamburg Cup","1. Antritt","12. / 13. Nov. 24","2024-09-18","2024-10-08"]
[". ",null,1,"H","Jörg Frahm",19221,{"$f":"VLOOKUP(E12,'Rangliste PANA-Spieler'!$Q$17:$T$23,4,0)","v":172.38181818181818},"B",null,null,null,"HC","H-SC",null,"B",{"$f":"+#REF!&\" / \"&#REF!","v":{"$error":"#REF!"}},null,null,"2. Antritt","26. / 27. Nov .24"]
[null,null,{"$f":"+C12+1","v":2},"H","Deniz Hagelstein",24775,{"$f":"VLOOKUP(E13,'Rangliste PANA-Spieler'!$Q$17:$T$23,4,0)","v":139.57142857142858},"B",null,null,null,"HC","H-SA",null,"B",{"$f":"+L10&\" / \"&M10","v":"HC / H-SA"}]
[null,null,{"$f":"+C13+1","v":3},"H","Frank Nijholt",24774,{"$f":"VLOOKUP(E14,'Rangliste PANA-Spieler'!$Q$17:$T$23,4,0)","v":136.33333333333334},"B",null,null,null,"HC","H-SA",null,"B",{"$f":"+#REF!","v":{"$error":"#REF!"}},null,"HM = Herbst-Mixed","Gruppe A","16. / 17. November 2024","2024-10-23","2024-11-12"]
[null,null,{"$f":"+C14+1","v":4},"H","Matthias Nolte",20137,{"$f":"VLOOKUP(E15,'Rangliste PANA-Spieler'!$Q$17:$T$23,4,0)","v":134.66666666666666},"B",null,null,null,"HC","H-SA",null,"B",{"$f":"+L12&\" / \"&M12","v":"HC / H-SC"},null,null,"Gruppe B"]
[null,null,null,null,null,null,null,null,null,"HM und FM siehe Berechnungsmodul",null,null,null,null,null,{"$f":"+#REF!&\" / \"&#REF!","v":{"$error":"#REF!"}},null,null,"Gruppe C"]
[null,null,null,null,null,null,null,null,null,null,null,null,null,null,null,{"$f":"+#REF!&\" / \"&#REF!","v":{"$error":"#REF!"}},null,null,"Gruppe D"]
[null,null,null,null,null,null,null,null,null,null,null,null,null,null,null,{"$f":"+#REF!&\" / \"&#REF!","v":{"$error":"#REF!"}}]
[null,null,null,null,"Berechnungsmodul für Herbst- und Frühjarsmixed",null,null,null,null,null,null,null,null,null,null,{"$f":"+#REF!","v":{"$error":"#REF!"}},null,"WB = Weihnachts-Bowling",null,"14. / 15. Dezember 2024","2024-11-20","2024-12-10"]
[null,null,null,null,null,null,null,null,null,null,null,null,null,null,null,{"$f":"+#REF!&\" / \"&#REF!","v":{"$error":"#REF!"}}]
[null,null,null,null,"Schnitt Spieler 1:",174.28,null,null,null,null,null,null,null,null,null,{"$f":"+#REF!","v":{"$error":"#REF!"}},null,"EM = Einzelmeisterschaft\n (alle Gruppen)","1. Antritt","18. / 19. Jan. 25","2024-12-25","2025-01-14"]
[null,null,null,null,"Schnitt Spieler 2:",143.12,null,null,null,null,null,null,null,null,null,{"$f":"+#REF!","v":{"$error":"#REF!"}},null,null,"2. Antritt","01. / 02. Feb. 25"]
[null,null,null,null,"Meldeschnitt =",{"$f":"SUM(F21:F22/2)","v":158.69999999999999},null,null,null,null,null,null,null,null,null,{"$f":"+#REF!","v":{"$error":"#REF!"}}]
[null,null,null,null,"also Gruppe",{"$f":"VLOOKUP(F23,G27:H31,2)","v":"C"},null,null,null,null,null,null,null,null,null,{"$f":"+#REF!&\" / \"&#REF!","v":{"$error":"#REF!"}},null,"FM = Frühjahrs-Mixed","Gruppe A","22. / 23. März 2025","2025-02-26","2025-03-18"]
[null,null,null,null,null,null,null,null,null,null,null,null,null,null,null,{"$f":"+L13&\" / \"&M13","v":"HC / H-SA"},null,null,"Gruppe B"]
[null,null,null,null,null,null,null,"Gruppe",null,null,null,null,null,null,null,{"$f":"+E30&\" / \"&#REF!","v":{"$error":"#REF!"}},null,null,"Gruppe C"]
[null,null,null,null,"Schnitt",0,0,"A",null,null,null,null,null,null,null,{"$f":"+E31&\" / \"&#REF!","v":{"$error":"#REF!"}},null,null,"Gruppe D"]
[null,null,null,null,"Schnitt bis",154.99,0.01,"D",null,null,null,null,null,null,null,{"$f":"+#REF!","v":{"$error":"#REF!"}}]
[null,null,null,null,"Schnitt ab",155,155,"C",null,null,null,null,null,null,null,{"$f":"+#REF!&\" / \"&#REF!","v":{"$error":"#REF!"}},null,"DM = Doppelmeisterschaft\n  (alle Gruppen)","1. Antritt","12. / 13. Apr. 25","2025-03-19","2024-04-09"]
[null,null,null,null,"Schnitt ab",165,165,"B",null,null,null,null,null,null,null,null,null,null,"2. Antritt","10. / 11. Mai  25"]
[null,null,null,null,"Schnitt ab",175,175,"A"]

{"sheet":"BSG-Kürzel 2023","index":31,"n_rows":101,"n_cols":6,"rows_kept":101,"cut":false,"hidden":false,"merged":[]}
["Start"]
["Rangliste",null,"BSV Hamburg  -  Betriebssportgemeinschaften der Sparte Bowling"]
[]
[null,null,null,"BSG-Nr.",55,"  BSG'en in dieser Saison"]
[]
[null,null,null,51021,"AAH","Agentur für Arbeit Hamburg"]
[null,null,null,53207,"AIR","Airbus AG"]
[null,null,null,55404,"ALL","SV Weiß Blau Allianz"]
[null,null,null,53405,"AU","Aurubis"]
[null,null,null,51026,"AXA","AXA Sportvereinigung"]
[null,null,null,51240,"B36","Berufgen. für Gesundheitsdienst"]
[null,null,null,51618,"BAL","Baloise e.V.         Vormals Basler"]
[null,null,null,53002,"BBK","Sportclub Dt. Bundesbank"]
[null,null,null,51211,"BWV","B W V L"]
[null,null,null,51409,"CLP","BMH-Claudius Peters AG"]
[null,null,null,51405,"COM","Commerzbank"]
[null,null,null,51406,"CON","Condor-Versicherung"]
[null,null,null,51609,"DA","Die Aktiven"]
[null,null,null,51602,"DAK","D A K"]
[null,null,null,53009,"DAT","Dataport Hamburg"]
[null,null,null,51613,"DB","SG Deutsche Bank Deutschland e.V."]
[null,null,null,51628,"DKY","Dakosy"]
[null,null,null,51624,"DSO","Die Socke"]
[null,null,null,51809,"EAG","Eppendorf AG"]
[null,null,null,51801,"ED","Edeka"]
[null,null,null,51003,"ELB","Elbe-Sport eV"]
[null,null,null,52408,"ERG","ERGO Sports Hamburg"]
[null,null,null,52440,"ESV","Energie Sportvereinigung"]
[null,null,null,52021,"FAH","LG Finanzämter Hamburg"]
[null,null,null,55555,"FIT","FIT im Betrieb"]
[null,null,null,52002,"FW","Feuerwehr Hamburg"]
[null,null,null,52433,"GAS","Gasnetz-Hamburg"]
[null,null,null,55212,"GEN","Generali Versicherungen"]
[null,null,null,52419,"HAN","Hanse Merkur"]
[null,null,null,52411,"HAS","Hamburger Sparkasse"]
[null,null,null,52441,"HHA","Hamburger Hochbahn"]
[null,null,null,54807,"HLA","HHLA"]
[null,null,null,52410,"HMC","Hamburg Messe und Congress GmbH"]
[null,null,null,51211,"HPA","BWVL Hamburg Port Authority"]
[null,null,null,51019,"JH","Jungheinrich"]
[null,null,null,52621,"JUL","Jornitz u. Luth"]
[null,null,null,52613,"JUS","Justizbehörde"]
[null,null,null,51085,"KAH","Amandus Kahl"]
[null,null,null,52429,"KS","Körber Sports"]
[null,null,null,53016,"LSV","Lufthansa"]
[null,null,null,53602,"OIL","H+R Ölwerke Schindler GmbH"]
[null,null,null,53609,"OTT","Otto"]
[null,null,null,53823,"P 2","Postamt  2"]
[null,null,null,53807,"PAN","Panasonic"]
[null,null,null,53819,"POL","Polizei Hamburg v. 1872"]
[null,null,null,52600,"SBC","Smart Blue Club Nord"]
[null,null,null,54608,"SGS","SG Stern Hamburg  "]
[null,null,null,54800,"SHN","Stahlhandel Nord"]
[null,null,null,52601,"SID","SV Signal Iduna"]
[null,null,null,54620,"SRH","Stadtreinigung"]
[null,null,null,54605,"STI","Still"]
[null,null,null,54607,"STW","Steinway & Sons"]
[null,null,null,52000,"TEL","Deutsche Telekom"]
[null,null,null,54816,"TRE","Tretorn"]
[null,null,null,54824,"TÜV","TÜV Nord"]
[null,null,"","",""]
[null,null,"","",""]
[null,null,"","",""]
[null,null,"","",""]
[null,null,"","",""]
[null,null,"","",""]
[null,null,"","",""]
[null,null,"","",""]
[null,null,"","",""]
[null,null,"","",""]
[null,null,"","",""]
[null,null,"","",""]
[null,null,"","",""]
[null,null,"","",""]
[null,null,"","",""]
[null,null,"","",""]
[null,null,"","",""]
[null,null,"","",""]
[null,null,"","",""]
[null,null,"","",""]
[null,null,"","",""]
[null,null,"","",""]
[null,null,"","",""]
[null,null,"","",""]
[null,null,"","",""]
[null,null,"","",""]
[null,null,"","",""]
[null,null,"","",""]
[null,null,"","",""]
[null,null,"","",""]
[null,null,"","",""]
[null,null,"","",""]
[null,null,"","",""]
[null,null,"","",""]
[null,null,"","",""]
[null,null,"","",""]
[null,null,"","",""]
[null,null,"","",""]
[null,null,"","",""]
[null,null,"","",""]
[null,null,"","",""]