{"text_format":"1","workbook":"xlsx","n_sheets":35,"sheets":["Spielberichte-Blanko","Anhang Blanko","MI-DO","Start","PANA-Rangliste","Mannschaftsübersicht","Übersicht der Klasse B4","Hilfstabelle Spieler","Annegret S.","Ilona W.","Michael W.","Mario J.","Kai R.","Frank N.","Jörg F.","Matthias N.","Deniz H.","Spielbogen 7er","Hilfstabelle Mannschaften","Hilfstabelle","Anhang zum Spielbericht","Spielberichte","Spielereinteilung","Anmeldegruppen Turniere","Offizielle BSV-Rangliste","BSG-Schnittliste Saison 23-24","Spielbogen 10er","Ergebnisse nach BVH","Abschlusstabelle  24-25","BSG-Schnittliste 24-25","Spielbogen 11er","\"Alters\"-Übersicht","BSG-Kürzel 2025","10er","Spielbogen 8er"],"not_rendered":{"charts":0,"images":18,"macros":1,"external_links":1,"defined_names":109,"comments":1,"pivot_tables":0},"unopened":[],"bounds":{"document_bytes":16777216,"sheet_cells":100000,"rows_first":2000,"rows_last":500,"rows_between":2000,"halvings":0,"cell_chars":16384,"cell_head_chars":4096},"cells_cut":0,"cells_raw":0,"read":"whole","date_system":"1900"}

{"sheet":"Spielberichte-Blanko","index":0,"n_rows":30,"n_cols":12,"rows_kept":30,"cut":false,"hidden":true,"merged":[]}
[]
[null," Spielbericht BOWLING"]
[null,"Betriebssportverband Hamburg e.V.",null,null,null,null,null,null,null,null,null,"Punktspielserie"]
[null,"alle Felder sind unbedingt auszufüllen,da sonst der Spielbericht ungültig ist "]
[]
[null,"Klasse","Herren",null,"     Antritt     Nr.",null,null,"Datum",null,"BSG"]
[]
[null,null,"X)","Pass-Nr.",null,null,"Vor-und Zuname",null,"I","II","III","Gesamt"]
[null,1]
[null,2]
[null,3]
[null,4]
[null,5]
[null,"Bitte mit einem x) versehen",null,null,"     Unterschrift des Spiel-"]
[null,"wenn Ersatzspieler/in",null,null,"     partners"]
[]
[null," Spielbericht BOWLING"]
[null,"Betriebssportverband Hamburg e.V.",null,null,null,null,null,null,null,null,null,"Punktspielserie"]
[null,"alle Felder sind unbedingt auszufüllen,da sonst der Spielbericht ungültig ist "]
[]
[null,"Klasse","  Herren",null,"     Antritt     Nr.",null,null,"Datum",null,"BSG"]
[]
[null,null,"X)","Pass-Nr.",null,null,"Vor-und Zuname",null,"I","II","III","Gesamt"]
[null,1]
[null,2]
[null,3]
[null,4]
[null,5]
[null,"Bitte mit einem x) versehen",null,null,"     Unterschrift des Spiel-"]
[null,"wenn Ersatzspieler/in",null,null,"     partners"]

{"sheet":"Anhang Blanko","index":1,"n_rows":19,"n_cols":14,"rows_kept":19,"cut":false,"hidden":true,"merged":[[18,0,18,1],[4,0,4,1],[4,6,4,7],[6,3,6,4],[8,0,10,1],[11,0,11,1],[12,0,12,1],[13,0,13,1],[14,0,14,1],[15,0,15,1],[16,0,16,1],[17,0,17,1]]}
["Anhang zum Spielbericht  B O W L I N G"]
[null,null,null,null,null,null,null,null,null,null,null,"Punktspielserie"]
["alle Felder sind unbedingt auszufüllen und mit dem Original-Spielbericht einzusenden."]
[]
["Klasse:",null,null,"Antritt-Nr. :",null,"Datum :",null,null,"Halle :"]
[]
[null,null,"Ausrichter BSG:",null,null,"Mannschaftsführer: ",null,null,null,"Telefon:"]
[]
["Durch-\ngänge",null,"BSG","BSG","BSG","BSG","BSG","BSG","BSG","BSG","BSG","BSG","BSG","BSG"]
[null,null,null,null,null,null,null,null,null,null,null,null,{"$f":"VLOOKUP(M11,Hilfstabelle!$L$5:$M$16,2,0)","v":"EAG 1"},{"$f":"VLOOKUP(N11,Hilfstabelle!$L$5:$M$16,2,0)","v":"ESV 2"}]
[null,null,null,null,null,null,null,null,null,null,null,null,{"$f":"+Hilfstabelle!$L15","v":"Eppendorf AG 1"},{"$f":"+Hilfstabelle!$L16","v":"Energie Sportvereinigung 2"}]
[1]
[2]
["1 + 2",null,{"$f":"+C13+C12","v":0},{"$f":"+D13+D12","v":0},0,0,0,0,0,0,0,0,0,0]
[3]
["Pins\nGesamt",null,{"$f":"+C15+C14","v":0},{"$f":"+D15+D14","v":0},0,0,0,0,0,0,0,0,0,0]
["Punkte\nAntritt",null,{"$f":"IF(C12>0,RANK(C16,$C$16:$N$16,12),\" \")","v":" "},{"$f":"IF(D12>0,RANK(D16,$C$16:$N$16,12),\" \")","v":" "}," "," "," "," "," "," "," "," "," "," "]
["Punkte\nA L T"]
["Punkte\nN E U",null," "," "," "," "," "," "," "," "," "," "," "," "]

{"sheet":"MI-DO","index":2,"n_rows":38,"n_cols":8,"rows_kept":38,"cut":false,"hidden":true,"merged":[[19,4,23,4],[24,4,32,4],[0,0,0,7],[1,2,1,3],[1,6,1,7],[17,2,18,2],[17,3,18,3],[17,6,18,6],[17,7,18,7]]}
["BOWLING   -   Punktspielsaison 2025 / 26"]
[null,null,"MITTWOCH",null,null,null,"DONNERSTAG"]
[]
["KLASSE",null,"A 3","B 3",null,null,"A 4","B 4"]
[null,null,"17.35","17.35",null,null,"17.35","17.35"]
[]
[null,null,"BWV 4","BAL 1",null,null,"BWV 3","ELB 4"]
[null,null,"DB 3","STI 2",null,null,"COM 1","STI 3"]
[null,null,"DSO 1","LSV 2",null,null,"JUL 1","BAL 2"]
[null,null,"HAS 4","HAN 1",null,null,"ED 2","CLP 1"]
[null,null,"STI 1","HHA 5",null,null,"FAH 2","HAS 7"]
[null,null,"LSV 1","B36 1",null,null,"GEN 1","KAH 1"]
[null,null,"HPA 2","COM 3",null,null,"HHA 3","PAN 1"]
[null,null,"DAK 1","HAS 6",null,null,"SID 2","SGS 1"]
[null,null,"AU 2","ALL 2",null,null,"KS 2","ALL 3"]
[null,null,"ELB 2","ELB 5",null,null,"HPA 1","SID 3"]
[null,null,null,"JH 3",null,null,null,"ELB 3"]
[]
[]
[37,"2025-09-10","WB",null,null,"2025-09-11",null,"WB"]
[39,"2025-09-24","OT",null,null,"2025-09-25",null,"OT"]
[41,"2025-10-08","WB",null,null,"2025-10-09",null,"WB"]
[43,"2025-10-22","OT",null,null,"2025-10-23",null,"OT"]
[45,"2025-11-05","WB",null,null,"2025-11-06",null,"WB"]
["3.","2026-01-14","OT",null,null,"2026-01-15","WB","OT"]
["5.","2026-01-28","WB",null,null,"2026-01-29",null,"WB"]
["7.","2026-02-11","OT",null,null,"2026-02-12",null,"OT"]
["9.","2026-02-25","WB",null,null,"2026-02-26",null,"WB"]
["11.","2026-03-11","OT",null,null,"2026-03-12","WB","OT"]
["13.","2026-03-25","WB",null,null,"2026-03-26",null,"WB"]
["15.","2026-04-08","OT",null,null,"2026-04-09",null,"OT"]
["17.","2026-04-22","WB",null,null,"2026-04-23",null,"WB"]
["19.","2026-05-06","OT",null,null,"2026-05-07",null,"OT"]
[null,null,null,null,null,null,"Stand :   ","2025-07-20"]
[]
[]
[]
[null,null,0,0,null,null,0,0]

{"sheet":"Start","index":3,"n_rows":21,"n_cols":7,"rows_kept":21,"cut":false,"hidden":false,"merged":[[20,1,20,3],[21,1,21,3],[13,1,13,3],[14,6,14,8],[15,6,15,8],[16,6,16,8],[20,5,20,6],[19,5,19,6],[11,1,11,3],[18,1,18,3],[14,1,14,3],[15,1,15,3],[18,5,18,6],[8,1,8,3],[10,1,10,3],[9,1,9,3],[2,1,2,8],[4,1,4,3],[5,1,5,3],[6,1,6,3],[7,1,7,3]]}
[]
[]
[null,{"$f":"\"PUNKTSPIELSAISON \"&+'Hilfstabelle Mannschaften'!I6","v":"PUNKTSPIELSAISON 2025/2026"}]
[]
[null,"PANA-Rangliste",null,null,null,"Damen"]
[null,"Mannschaftsübersicht",null,null,null,"Annegret Schmidt"]
[null,{"$f":"\"Übersicht aller Spiele der Klasse \"&'Hilfstabelle Mannschaften'!I4","v":"Übersicht aller Spiele der Klasse B2"},null,null,null,"Ilona Wetzel"]
[null,"Spielereinteilung"]
[null,"Spielberichte",null,null,null,"Herren"]
[null,"Anhang zum Spielbericht",null,null,null,"Kai Roßberg"]
[null,"Spielbogen ",null,null,null,"Deniz Hagelstein"]
[null,"Ergebnisse nach BVH",null,null,null,"Frank Nijholt"]
[null,null,null,null,null,"Jörg Frahm"]
[null,{"$f":"+B3","v":"PUNKTSPIELSAISON 2025/2026"},null,null,null,"Mario Jurk"]
[null,"Anmeldegruppen / Turnierplanung",null,null,null,"Matthias Nolte","Zuletzt aktualisiert am:"]
[null,{"$f":"\"Rangliste PANA-Spieler Saison \"&'Hilfstabelle Mannschaften'!I7","v":"Rangliste PANA-Spieler Saison 24/25"},null,null,null,"Michael Wetzel",{"$f":"NOW()","v":"2025-11-16T15:41:11.980"}]
[null,null,null,null,null,null,{"$f":"NOW()","v":45977.653610879628}]
[]
[null,"BSG-Kürzel 2025",null,null,null,{"$f":"\"Abschlusstabelle \"&'Hilfstabelle Mannschaften'!I7","v":"Abschlusstabelle 24/25"}]
[null,null,null,null,null,{"$f":"\"BSG-Schnittliste Saison \"&'Hilfstabelle Mannschaften'!I7","v":"BSG-Schnittliste Saison 24/25"}]
[null,null,null,null,null,"\"Alters\"-Übersicht (Nur mal so)"]

{"sheet":"PANA-Rangliste","index":4,"n_rows":30,"n_cols":18,"rows_kept":30,"cut":false,"hidden":false,"merged":[[20,2,20,10],[21,8,21,9],[22,8,22,9],[23,8,23,9],[24,8,24,9],[21,6,21,7],[22,6,22,7],[23,6,23,7],[24,6,24,7],[11,11,11,17],[15,11,15,17],[3,3,3,8],[1,2,1,16],[3,11,3,17],[7,11,7,17],[9,3,9,8]]}
[]
[null,"Start",{"$f":"+\"Rangliste Saison  \"&+'Hilfstabelle Mannschaften'!I6","v":"Rangliste Saison  2025/2026"}]
[]
[null,null,null,"DAMEN                        NEU",null,null,null,null,null,null,null,"Höchstes Einzel"]
[null,null,"Name","Pass.-Nr.","Pins","Spiele","Schnitt","+/-",{"$f":"\"Ø \"&+'Hilfstabelle Mannschaften'!$I$7","v":"Ø 24/25"},null,"D.",{"$f":"+IF('Hilfstabelle Spieler'!$E$18,'Hilfstabelle Spieler'!$F$18,\"\")","v":"Annegret Schmidt"},{"$f":"+IF('Hilfstabelle Spieler'!$E$18,\":\",\"\")","v":":"},{"$f":"+IF('Hilfstabelle Spieler'!$E$18,'Hilfstabelle Spieler'!$E$18,\"\")","v":192},{"$f":"+IF('Hilfstabelle Spieler'!$E$18,\"Pins\",\"\")","v":"Pins"}]
[null,null,"Ilona Wetzel",{"$f":"VLOOKUP(C6,Rangliste_Mannschaften_Passnummern,2,0)","v":22115},{"$f":"+'Ilona W.'!G8","v":4052},{"$f":"+'Ilona W.'!H8","v":27},{"$f":"+'Ilona W.'!I8","v":150.07407407407408},{"$f":"IFERROR(+G6-I6,)","v":-3.6810279667422492},{"$f":"VLOOKUP(D6,'Anmeldegruppen Turniere'!$H$7:$M$15,4,0)","v":153.75510204081633},null,"H.",{"$f":"+IF('Hilfstabelle Spieler'!E13,'Hilfstabelle Spieler'!F13,\"\")","v":"Jörg Frahm"},{"$f":"+IF('Hilfstabelle Spieler'!$E$13,\":\",\"\")","v":":"},{"$f":"+IF('Hilfstabelle Spieler'!E13,'Hilfstabelle Spieler'!E13,\"\")","v":227},{"$f":"+IF('Hilfstabelle Spieler'!$E$13,\"Pins\",\"\")","v":"Pins"}]
[null,null,"Annegret Schmidt",{"$f":"VLOOKUP(C7,Rangliste_Mannschaften_Passnummern,2,0)","v":19222},{"$f":"+'Annegret S.'!G8","v":4391},{"$f":"+'Annegret S.'!H8","v":32},{"$f":"+'Annegret S.'!I8","v":137.21875},{"$f":"IFERROR(+G7-I7,)","v":-0.28918650793650613},{"$f":"VLOOKUP(D7,'Anmeldegruppen Turniere'!$H$7:$M$15,4,0)","v":137.50793650793651}]
[null,null,null,null,{"$f":"SUM(E6:E7)","v":8443},{"$f":"SUM(F6:F7)","v":59},{"$f":"IF(E8>1,+E8/F8,\"\")","v":143.10169491525423},null,null,null,null,"Höchste 3.er Serie"]
[null,null,null,null,null,null,null,null,null,null,"D.",{"$f":"+IF('Hilfstabelle Spieler'!G18,'Hilfstabelle Spieler'!H18,\"\")","v":"Ilona Wetzel"},{"$f":"+IF(+'Hilfstabelle Spieler'!$G$18>1,\":\",\"\")","v":":"},{"$f":"+IF('Hilfstabelle Spieler'!G18,'Hilfstabelle Spieler'!G18,\"\")","v":475},{"$f":"+IF(+'Hilfstabelle Spieler'!$G$18>1,\"Pins\",\"\")","v":"Pins"},{"$f":"+IF(+'Hilfstabelle Spieler'!$G$18>1,\"=\",\"\")","v":"="},{"$f":"+IF(+'Hilfstabelle Spieler'!G18>1,'Hilfstabelle Spieler'!G19,\"\")","v":158.33333333333334},{"$f":"+IF(+'Hilfstabelle Spieler'!G18>1,\"Schnitt\",\"\")","v":"Schnitt"}]
[null,null,null,"HERREN                       NEU",null,null,"Schnitt",null,null,null,"H.",{"$f":"+IF('Hilfstabelle Spieler'!G13,'Hilfstabelle Spieler'!H13,\"\")","v":"Mario Jurk"},{"$f":"+IF(+'Hilfstabelle Spieler'!$G$13>1,\":\",\"\")","v":":"},{"$f":"+IF(+'Hilfstabelle Spieler'!G13>1,'Hilfstabelle Spieler'!G13,\"\")","v":628},{"$f":"+IF(+'Hilfstabelle Spieler'!$G$13>1,\"Pins\",\"\")","v":"Pins"},{"$f":"+IF(+'Hilfstabelle Spieler'!$G$13>1,\"=\",\"\")","v":"="},{"$f":"+IF(+'Hilfstabelle Spieler'!G13>1,'Hilfstabelle Spieler'!G14,\"\")","v":209.33333333333334},{"$f":"+IF(+'Hilfstabelle Spieler'!G13>1,\"Schnitt\",\"\")","v":"Schnitt"}]
[null,null,"Name","Pass.-Nr.","Pins","Spiele","Schnitt","+/-",{"$f":"+I5","v":"Ø 24/25"}]
[null,null,"Mario Jurk",{"$f":"VLOOKUP(C12,Rangliste_Mannschaften_Passnummern,2,0)","v":23302},{"$f":"+'Mario J.'!G8","v":1167},{"$f":"+'Mario J.'!H8","v":6},{"$f":"+'Mario J.'!I8","v":194.5},{"$f":"IFERROR(+G12-I12,)","v":14.222222222222229},{"$f":"VLOOKUP(D12,'Anmeldegruppen Turniere'!$H$7:$M$15,4,0)","v":180.27777777777777},{"$f":"VLOOKUP(D12,'Anmeldegruppen Turniere'!$H$7:$N$15,2,0)","v":0},null,"Höchste 4.er Serie"]
[null,null,"Kai Roßberg",21889,{"$f":"+'Kai R.'!$G$8","v":2116},{"$f":"+'Kai R.'!$H$8","v":12},{"$f":"+'Kai R.'!$I$8","v":176.33333333333334},-3.0833333333333144,{"$f":"VLOOKUP(D13,'Anmeldegruppen Turniere'!$H$7:$M$15,4,0)","v":179.41666666666666},null,"D.",{"$f":"+IF(+'Hilfstabelle Spieler'!$I$18>1,+'Hilfstabelle Spieler'!$J$18,\"\")","v":"Ilona Wetzel"},{"$f":"+IF(+'Hilfstabelle Spieler'!$I$18>1,\":\",\"\")","v":":"},{"$f":"+IF(+'Hilfstabelle Spieler'!$I$18>1,'Hilfstabelle Spieler'!$I$18,\"\")","v":646},{"$f":"+IF(+'Hilfstabelle Spieler'!$I$18>1,\"Pins\",\"\")","v":"Pins"},{"$f":"+IF(+'Hilfstabelle Spieler'!$I$18>1,\"=\",\"\")","v":"="},{"$f":"+IF(+'Hilfstabelle Spieler'!$I$18>1,'Hilfstabelle Spieler'!$I$19,\"\")","v":161.5},{"$f":"+IF(+'Hilfstabelle Spieler'!$I$18>1,\"Schnitt\",\"\")","v":"Schnitt"}]
[null,null,"Jörg Frahm",19221,{"$f":"+'Jörg F.'!G8","v":2769},{"$f":"+'Jörg F.'!H8","v":16},{"$f":"+'Jörg F.'!I8","v":173.0625},2.0947580645161281,{"$f":"VLOOKUP(D14,'Anmeldegruppen Turniere'!$H$7:$M$15,4,0)","v":170.96774193548387},null,"H.",{"$f":"+IF('Hilfstabelle Spieler'!I13,'Hilfstabelle Spieler'!J13,\"\")","v":"Jörg Frahm"},{"$f":"+IF('Hilfstabelle Spieler'!$I$13,\":\",\"\")","v":":"},{"$f":"+IF('Hilfstabelle Spieler'!I13,'Hilfstabelle Spieler'!I13,\"\")","v":761},{"$f":"+IF('Hilfstabelle Spieler'!$I$13,\"Pins\",\"\")","v":"Pins"},{"$f":"+IF('Hilfstabelle Spieler'!$I$13,\"=\",\"\")","v":"="},{"$f":"+IF('Hilfstabelle Spieler'!I13,'Hilfstabelle Spieler'!I14,\"\")","v":190.25},{"$f":"+IF('Hilfstabelle Spieler'!I13,\"Schnitt\",\"\")","v":"Schnitt"}]
[null,null,"Michael Wetzel",22113,{"$f":"+'Michael W.'!G8","v":2764},{"$f":"+'Michael W.'!H8","v":16},{"$f":"+'Michael W.'!I8","v":172.75},-4.0357142857142776,{"$f":"VLOOKUP(D15,'Anmeldegruppen Turniere'!$H$7:$M$15,4,0)","v":176.78571428571428}]
[null,null,"Deniz Hagelstein",24775,{"$f":"+'Deniz H.'!G8","v":485},{"$f":"+'Deniz H.'!H8","v":3},{"$f":"+'Deniz H.'!I8","v":161.66666666666666},27.476190476190453,{"$f":"VLOOKUP(D16,'Anmeldegruppen Turniere'!$H$7:$M$15,4,0)","v":134.1904761904762},null,null,"Höchste 6.er Serie"]
[null,null,"Frank Nijholt",24774,{"$f":"+'Frank N.'!G8","v":931},{"$f":"+'Frank N.'!H8","v":6},{"$f":"+'Frank N.'!I8","v":155.16666666666666},18.433333333333337,{"$f":"VLOOKUP(D17,'Anmeldegruppen Turniere'!$H$7:$M$15,4,0)","v":136.73333333333332},null,"D.",{"$f":"+IF('Hilfstabelle Spieler'!K18,'Hilfstabelle Spieler'!L18,\"\")","v":"Ilona Wetzel"},{"$f":"+IF(+'Hilfstabelle Spieler'!$K$18>1,\":\",\"\")","v":":"},{"$f":"+IF(+'Hilfstabelle Spieler'!K18>1,'Hilfstabelle Spieler'!K18,\"\")","v":876},{"$f":"+IF(+'Hilfstabelle Spieler'!$K$18>1,\"Pins\",\"\")","v":"Pins"},{"$f":"+IF(+'Hilfstabelle Spieler'!$K$18>1,\"=\",\"\")","v":"="},{"$f":"+IF(+'Hilfstabelle Spieler'!K18>1,'Hilfstabelle Spieler'!K19,\"\")","v":146},{"$f":"+IF(+'Hilfstabelle Spieler'!K18>1,\"Schnitt\",\"\")","v":"Schnitt"}]
[null,null,"Matthias Nolte",20137,{"$f":"+'Matthias N.'!G8","v":821},{"$f":"+'Matthias N.'!H8","v":6},{"$f":"+'Matthias N.'!I8","v":136.83333333333334},3.5,{"$f":"VLOOKUP(D18,'Anmeldegruppen Turniere'!$H$7:$M$15,4,0)","v":133.33333333333334},null,"H.",{"$f":"+IF('Hilfstabelle Spieler'!K13,'Hilfstabelle Spieler'!L13,\"\")","v":"Jörg Frahm"},{"$f":"+IF(+'Hilfstabelle Spieler'!$K$13>1,\":\",\"\")","v":":"},{"$f":"+IF(+'Hilfstabelle Spieler'!K13>1,'Hilfstabelle Spieler'!K13,\"\")","v":1081},{"$f":"+IF(+'Hilfstabelle Spieler'!$K$13>1,\"Pins\",\"\")","v":"Pins"},{"$f":"+IF(+'Hilfstabelle Spieler'!$K$13>1,\"=\",\"\")","v":"="},{"$f":"+IF(+'Hilfstabelle Spieler'!K13>1,'Hilfstabelle Spieler'!K14,\"\")","v":180.16666666666666},{"$f":"+IF(+'Hilfstabelle Spieler'!K13>1,\"Schnitt\",\"\")","v":"Schnitt"}]
[null,null,null,null,{"$f":"SUM(E12:E18)","v":11053},{"$f":"SUM(F12:F18)","v":65},{"$f":"IF(E19>1,+E19/F19,\"\")","v":170.04615384615386}]
[]
[null,null,"Gesamter PANA-Schnitt"]
[null,null,{"$f":"\"Ø \"&+'Hilfstabelle Mannschaften'!$I$8","v":"Ø 2025/2026"},"Ø Damen:","Ø Herren:","Ø Liga:","Ø Sonstige:",null,"Ø Gesamt:"]
[null,null,"Spiele",{"$f":"+F8","v":59},{"$f":"+F19","v":65},{"$f":"+Mannschaftsübersicht!G13","v":60},{"$f":"+'Hilfstabelle Spieler'!BH11","v":64},null,{"$f":"SUM(E23,D23)","v":124}]
[null,null,"Pins",{"$f":"+E8","v":8443},{"$f":"+E19","v":11053},{"$f":"+Mannschaftsübersicht!E14","v":8772},{"$f":"+'Hilfstabelle Spieler'!BI11","v":9862},null,{"$f":"SUM(E24,D24)","v":19496}]
[null,null,"Schnitt",{"$f":"IF(D24>1,+D24/D23,\" \")","v":143.10169491525423},{"$f":"IF(E24>1,+E24/E23,\" \")","v":170.04615384615386},{"$f":"IFERROR(+F24/F23,\"\")","v":146.19999999999999},{"$f":"IFERROR(+G24/G23,\"\")","v":154.09375},null,{"$f":"IF(I24>1,+I24/I23,\" \")","v":157.2258064516129}]
[]
[null,null,{"$f":"\"Ø \"&+'Hilfstabelle Mannschaften'!$I$9","v":"Ø 2024/2025"},"Ø Damen:","Ø Herren:","Ø Gesamt:"]
[null,null,"Spiele",{"$f":"+'Offizielle BSV-Rangliste'!S12","v":0},{"$f":"+'Offizielle BSV-Rangliste'!S24","v":0},{"$f":"+E28+D28","v":0}]
[null,null,"Pins",{"$f":"+'Offizielle BSV-Rangliste'!R12","v":0},{"$f":"+'Offizielle BSV-Rangliste'!R24","v":0},{"$f":"+E29+D29","v":0}]
[null,null,"Schnitt",{"$f":"+'Offizielle BSV-Rangliste'!T12","v":0},{"$f":"+'Offizielle BSV-Rangliste'!T24","v":0},{"$f":"IFERROR(+F29/F28,\"\")","v":""}]

{"sheet":"Mannschaftsübersicht","index":5,"n_rows":18,"n_cols":10,"rows_kept":18,"cut":false,"hidden":false,"merged":[[3,2,3,7],[5,2,5,7]]}
[]
[null,"Start"]
[null,"Rangliste"]
[null,null,"Übersicht"]
[]
[null,null,{"$f":"\"1. Mannschaft, \"&+'Hilfstabelle Mannschaften'!I3&\" \"&+'Hilfstabelle Mannschaften'!I4","v":"1. Mannschaft, Klasse B2"}]
[null,null,"Platz","Mannschaft","Pins","Pkt.","Spiele","Schnitt",null,"Vorjahres-\nSchnitt"]
[null,null,"1.",{"$f":"+'Hilfstabelle Mannschaften'!L9","v":"Panasonic 1"},{"$f":"VLOOKUP(D8,'Hilfstabelle Mannschaften'!$L$4:$M$11,2,0)","v":9634},{"$f":"VLOOKUP(D8,'Übersicht der Klasse B4'!$D$8:$E$29,2,0)","v":42},{"$f":"VLOOKUP(D8,'Hilfstabelle Mannschaften'!$L$34:$M$45,2,0)","v":60},{"$f":"IF(F8>=1,+E8/G8,\"\")","v":160.56666666666666},null,156.27380952380952]
[null,null,"2.",{"$f":"+'Hilfstabelle Mannschaften'!L6","v":"AXA 1"},{"$f":"VLOOKUP(D9,'Hilfstabelle Mannschaften'!$L$4:$M$11,2,0)","v":9487},{"$f":"VLOOKUP(D9,'Übersicht der Klasse B4'!$D$8:$E$29,2,0)","v":41},{"$f":"VLOOKUP(D9,'Hilfstabelle Mannschaften'!$L$34:$M$45,2,0)","v":60},158.11666666666667,null,156.85185185185185]
[null,null,"3.",{"$f":"+'Hilfstabelle Mannschaften'!L8","v":"Dataport 2"},{"$f":"VLOOKUP(D10,'Hilfstabelle Mannschaften'!$L$4:$M$11,2,0)","v":9425},{"$f":"VLOOKUP(D10,'Übersicht der Klasse B4'!$D$8:$E$29,2,0)","v":35},{"$f":"VLOOKUP(D10,'Hilfstabelle Mannschaften'!$L$34:$M$45,2,0)","v":60},157.08333333333334,null,150.36309523809524]
[null,null,"4.",{"$f":"+'Hilfstabelle Mannschaften'!L12","v":"HASPA 5"},{"$f":"VLOOKUP(D11,'Hilfstabelle Mannschaften'!$L$4:$M$15,2,0)","v":9100},{"$f":"VLOOKUP(D11,'Übersicht der Klasse B4'!$D$8:$E$29,2,0)","v":32},{"$f":"VLOOKUP(D11,'Hilfstabelle Mannschaften'!$L$34:$M$45,2,0)","v":60},151.66666666666666,null,141]
[null,null,"5.",{"$f":"+'Hilfstabelle Mannschaften'!L13","v":"BWVL 5"},{"$f":"VLOOKUP(D12,'Hilfstabelle Mannschaften'!$L$4:$M$15,2,0)","v":8727},{"$f":"VLOOKUP(D12,'Übersicht der Klasse B4'!$D$8:$E$29,2,0)","v":28},{"$f":"VLOOKUP(D12,'Hilfstabelle Mannschaften'!$L$34:$M$45,2,0)","v":60},145.44999999999999,null,149.33333333333334]
[null,null,"6.",{"$f":"+'Hilfstabelle Mannschaften'!L14","v":"Eppendorf AG 1"},{"$f":"VLOOKUP(D13,'Hilfstabelle Mannschaften'!$L$4:$M$15,2,0)","v":8859},{"$f":"VLOOKUP(D13,'Übersicht der Klasse B4'!$D$8:$E$29,2,0)","v":26},{"$f":"VLOOKUP(D13,'Hilfstabelle Mannschaften'!$L$34:$M$45,2,0)","v":60},147.65,null,149.0297619047619]
[null,null,"7.",{"$f":"+'Hilfstabelle Mannschaften'!L10","v":"Generali 3"},{"$f":"VLOOKUP(D14,'Hilfstabelle Mannschaften'!$L$4:$M$11,2,0)","v":8772},{"$f":"VLOOKUP(D14,'Übersicht der Klasse B4'!$D$8:$E$29,2,0)","v":26},{"$f":"VLOOKUP(D14,'Hilfstabelle Mannschaften'!$L$34:$M$45,2,0)","v":60},146.19999999999999,null,143.97619047619048]
[null,null,"8.",{"$f":"+'Hilfstabelle Mannschaften'!L11","v":"Finanzamt 3"},{"$f":"VLOOKUP(D15,'Hilfstabelle Mannschaften'!$L$4:$M$11,2,0)","v":8223},{"$f":"VLOOKUP(D15,'Übersicht der Klasse B4'!$D$8:$E$29,2,0)","v":20},{"$f":"VLOOKUP(D15,'Hilfstabelle Mannschaften'!$L$34:$M$45,2,0)","v":60},137.05000000000001,null,143.11515151515152]
[null,null,"9.",{"$f":"+'Hilfstabelle Mannschaften'!L7","v":"ERGO Sports 3"},{"$f":"VLOOKUP(D16,'Hilfstabelle Mannschaften'!$L$4:$M$11,2,0)","v":8054},{"$f":"VLOOKUP(D16,'Übersicht der Klasse B4'!$D$8:$E$29,2,0)","v":13},{"$f":"VLOOKUP(D16,'Hilfstabelle Mannschaften'!$L$34:$M$45,2,0)","v":60},134.23333333333332,null,139.39333333333335]
[null,null,"10.",{"$f":"+'Hilfstabelle Mannschaften'!L5","v":"Energie Sportvereinigung 2"},{"$f":"VLOOKUP(D17,'Hilfstabelle Mannschaften'!$L$4:$M$11,2,0)","v":7877},{"$f":"VLOOKUP(D17,'Übersicht der Klasse B4'!$D$8:$E$29,2,0)","v":12},{"$f":"VLOOKUP(D17,'Hilfstabelle Mannschaften'!$L$34:$M$45,2,0)","v":60},131.28333333333333,null,139.7202380952381]
[null,null,"11.",{"$f":"+'Hilfstabelle Mannschaften'!L4","v":"Eppendorf AG 1"},{"$f":"VLOOKUP(D18,'Hilfstabelle Mannschaften'!$L$4:$M$11,2,0)","v":8859},{"$f":"VLOOKUP(D18,'Übersicht der Klasse B4'!$D$8:$E$29,2,0)","v":26},{"$f":"VLOOKUP(D18,'Hilfstabelle Mannschaften'!$L$34:$M$45,2,0)","v":60},{"$f":"IF(F18>=1,+E18/G18,\"\")","v":147.65},null,130.9047619047619]

{"sheet":"Übersicht der Klasse B4","index":6,"n_rows":31,"n_cols":21,"rows_kept":31,"cut":false,"hidden":false,"merged":[[27,3,28,3],[29,3,30,3],[25,3,26,3],[25,4,26,4],[7,1,8,1],[9,1,10,1],[11,1,12,1],[13,1,14,1],[25,1,26,1],[17,1,18,1],[19,1,20,1],[21,1,22,1],[15,1,16,1],[23,1,24,1],[23,3,24,3],[21,3,22,3],[19,3,20,3],[17,3,18,3],[23,4,24,4],[21,4,22,4],[19,4,20,4],[9,4,10,4],[7,4,8,4],[17,4,18,4],[32,6,32,14],[25,5,26,5],[23,5,24,5],[21,5,22,5],[19,5,20,5],[17,5,18,5],[11,5,12,5],[13,4,14,4],[11,4,12,4],[27,5,28,5],[27,4,28,4],[27,1,28,1],[1,6,1,20],[15,3,16,3],[13,3,14,3],[11,3,12,3],[9,3,10,3],[7,3,8,3],[5,3,6,3],[5,6,6,6],[5,5,6,5],[5,4,6,4],[15,5,16,5],[13,5,14,5],[7,5,8,5],[15,4,16,4],[9,5,10,5]]}
[]
[null,"Start",null,null,null,null,{"$f":"\"Übersicht aller Spiele der Klasse \"&+'Hilfstabelle Mannschaften'!I4&\" der 1. Mannschaft in der Saison \"&+'Hilfstabelle Mannschaften'!I6","v":"Übersicht aller Spiele der Klasse B2 der 1. Mannschaft in der Saison 2025/2026"}]
[null,"Rangliste"]
[null,null,null,null,null,null,"Datum",{"$f":"+Hilfstabelle!BS5","v":"2025-09-09"},{"$f":"+Hilfstabelle!BT5","v":"2025-09-23"},{"$f":"+Hilfstabelle!BU5","v":"2025-10-07"},{"$f":"+Hilfstabelle!BV5","v":"2025-10-21"},{"$f":"+Hilfstabelle!BW5","v":"2025-11-04"},{"$f":"+Hilfstabelle!BX5","v":"2025-11-18"},{"$f":"+Hilfstabelle!BY5","v":"2026-01-13"},{"$f":"+Hilfstabelle!BZ5","v":"2026-01-27"},{"$f":"+Hilfstabelle!CA5","v":"2026-02-10"},{"$f":"+Hilfstabelle!CB5","v":"2026-02-24"},{"$f":"+Hilfstabelle!CC5","v":"2026-03-10"},{"$f":"+Hilfstabelle!CD5","v":"2026-03-24"},{"$f":"+Hilfstabelle!CE5","v":"2026-04-07"},{"$f":"+Hilfstabelle!CF5","v":"2026-04-21"}]
[null,null,null,null,null,null,"Bahn",{"$f":"+Hilfstabelle!BS4","v":"OT"},{"$f":"+Hilfstabelle!BT4","v":"WB"},{"$f":"+Hilfstabelle!BU4","v":"OT"},{"$f":"+Hilfstabelle!BV4","v":"WB"},{"$f":"+Hilfstabelle!BW4","v":"OT"},{"$f":"+Hilfstabelle!BX4","v":"WB"},{"$f":"+Hilfstabelle!BY4","v":"OT"},{"$f":"+Hilfstabelle!BZ4","v":"WB"},{"$f":"+Hilfstabelle!CA4","v":"OT"},{"$f":"+Hilfstabelle!CB4","v":"WB"},{"$f":"+Hilfstabelle!CC4","v":"OT"},{"$f":"+Hilfstabelle!CD4","v":"WB"},{"$f":"+Hilfstabelle!CE4","v":"OT"},{"$f":"+Hilfstabelle!CF4","v":"WB"}]
[null,null,null,"Mannschaften","Punkte","Pins",null,"Antritt","Antritt","Antritt","Antritt","Antritt","Antritt","Antritt","Antritt","Antritt","Antritt","Antritt","Antritt","Antritt","Antritt"]
[null,"Kurzf.",null,null,null,null,null,1,{"$f":"+H7+1","v":2},3,4,5,6,7,8,9,10,11,12,13,14]
[null,{"$f":"VLOOKUP(D8,Hilfstabelle!$L$5:$M$18,2,0)","v":"EAG 1"},null,{"$f":"+Hilfstabelle!L5","v":"Eppendorf AG 1"},{"$f":"SUM(H9:U9)","v":26},{"$f":"SUM(H8:U8)","v":8859},"Pins",{"$f":"VLOOKUP(B8,'Hilfstabelle Mannschaften'!$AD$53:$AE$62,2,0)","v":1886},{"$f":"VLOOKUP(B8,'Hilfstabelle Mannschaften'!$AD$53:$AF$62,3,0)","v":1744},{"$f":"VLOOKUP(B8,'Hilfstabelle Mannschaften'!$AD$53:$AG$62,4,0)","v":1556},{"$f":"VLOOKUP(B8,'Hilfstabelle Mannschaften'!$AD$53:$AH$62,5,0)","v":2006},{"$f":"VLOOKUP(B8,'Hilfstabelle Mannschaften'!$AD$53:$AI$62,6,0)","v":1667},{"$f":"VLOOKUP(B8,'Hilfstabelle Mannschaften'!$AD$53:$AJ$62,7,0)","v":0},{"$f":"VLOOKUP(B8,'Hilfstabelle Mannschaften'!$AD$53:$AK$62,8,0)","v":0},{"$f":"VLOOKUP(B8,'Hilfstabelle Mannschaften'!$AD$53:$AL$62,9,0)","v":0},{"$f":"VLOOKUP(B8,'Hilfstabelle Mannschaften'!$AD$53:$AM$62,10,0)","v":0},{"$f":"VLOOKUP(B8,'Hilfstabelle Mannschaften'!$AD$53:$AN$62,11,0)","v":0},{"$f":"VLOOKUP(B8,'Hilfstabelle Mannschaften'!$AD$53:$AO$62,12,0)","v":0},{"$f":"VLOOKUP(B8,'Hilfstabelle Mannschaften'!$AD$53:$AP$62,13,0)","v":0},{"$f":"VLOOKUP(B8,'Hilfstabelle Mannschaften'!$AD$53:$AQ$62,14,0)","v":0},{"$f":"VLOOKUP(B8,'Hilfstabelle Mannschaften'!$AD$53:$AR$62,15,0)","v":0}]
[null,null,null,null,null,null,"Punkte",{"$f":"IF(H8<1,\"\",'Hilfstabelle Mannschaften'!Q24)","v":8},{"$f":"IF(I8<1,\"\",+'Hilfstabelle Mannschaften'!$Q29)","v":5},{"$f":"IF(J8<1,\"\",+'Hilfstabelle Mannschaften'!$Q34)","v":2},{"$f":"IF(K8<1,\"\",+'Hilfstabelle Mannschaften'!$Q39)","v":7},{"$f":"IF(L8<1,\"\",+'Hilfstabelle Mannschaften'!$Q44)","v":4},{"$f":"IF(M8<1,\"\",+'Hilfstabelle Mannschaften'!$Q49)","v":""},{"$f":"IF(N8<1,\"\",+'Hilfstabelle Mannschaften'!$Q54)","v":""},{"$f":"IF(O8<1,\"\",+'Hilfstabelle Mannschaften'!$Q59)","v":""},{"$f":"IF(P8<1,\"\",+'Hilfstabelle Mannschaften'!$Q64)","v":""},{"$f":"IF(Q8<1,\"\",+'Hilfstabelle Mannschaften'!$Q69)","v":""},{"$f":"IF(R8<1,\"\",+'Hilfstabelle Mannschaften'!$Q74)","v":""},{"$f":"IF(S8<1,\"\",+'Hilfstabelle Mannschaften'!$Q79)","v":""},{"$f":"IF(T8<1,\"\",+'Hilfstabelle Mannschaften'!$Q84)","v":""},{"$f":"IF(U8<1,\"\",'Hilfstabelle Mannschaften'!Q89)","v":""}]
[null,{"$f":"VLOOKUP(D10,Hilfstabelle!$L$5:$M$18,2,0)","v":"ESV 2"},null,{"$f":"+Hilfstabelle!L6","v":"Energie Sportvereinigung 2"},{"$f":"SUM(H11:U11)","v":12},{"$f":"SUM(H10:U10)","v":7877},"Pins",{"$f":"VLOOKUP(B10,'Hilfstabelle Mannschaften'!$AD$53:$AE$62,2,0)","v":1512},{"$f":"VLOOKUP(B10,'Hilfstabelle Mannschaften'!$AD$53:$AF$62,3,0)","v":1687},{"$f":"VLOOKUP(B10,'Hilfstabelle Mannschaften'!$AD$53:$AG$62,4,0)","v":1438},{"$f":"VLOOKUP(B10,'Hilfstabelle Mannschaften'!$AD$53:$AH$62,5,0)","v":1569},{"$f":"VLOOKUP(B10,'Hilfstabelle Mannschaften'!$AD$53:$AI$62,6,0)","v":1671},{"$f":"VLOOKUP(B10,'Hilfstabelle Mannschaften'!$AD$53:$AJ$62,7,0)","v":0},{"$f":"VLOOKUP(B10,'Hilfstabelle Mannschaften'!$AD$53:$AK$62,8,0)","v":0},{"$f":"VLOOKUP(B10,'Hilfstabelle Mannschaften'!$AD$53:$AL$62,9,0)","v":0},{"$f":"VLOOKUP(B10,'Hilfstabelle Mannschaften'!$AD$53:$AM$62,10,0)","v":0},{"$f":"VLOOKUP(B10,'Hilfstabelle Mannschaften'!$AD$53:$AN$62,11,0)","v":0},{"$f":"VLOOKUP(B10,'Hilfstabelle Mannschaften'!$AD$53:$AO$62,12,0)","v":0},{"$f":"VLOOKUP(B10,'Hilfstabelle Mannschaften'!$AD$53:$AP$62,13,0)","v":0},{"$f":"VLOOKUP(B10,'Hilfstabelle Mannschaften'!$AD$53:$AQ$62,14,0)","v":0},{"$f":"VLOOKUP(B10,'Hilfstabelle Mannschaften'!$AD$53:$AR$62,15,0)","v":0}]
[null,null,null,null,null,null,"Punkte",{"$f":"IF(H10<1,\"\",+'Hilfstabelle Mannschaften'!$R24)","v":1},{"$f":"IF(I10<1,\"\",+'Hilfstabelle Mannschaften'!$R29)","v":4},{"$f":"IF(J10<1,\"\",+'Hilfstabelle Mannschaften'!$R34)","v":1},{"$f":"IF(K10<1,\"\",+'Hilfstabelle Mannschaften'!$R39)","v":1},{"$f":"IF(L10<1,\"\",+'Hilfstabelle Mannschaften'!$R44)","v":5},{"$f":"IF(M10<1,\"\",+'Hilfstabelle Mannschaften'!$R49)","v":""},{"$f":"IF(N10<1,\"\",+'Hilfstabelle Mannschaften'!$R54)","v":""},{"$f":"IF(O10<1,\"\",+'Hilfstabelle Mannschaften'!$R59)","v":""},{"$f":"IF(P10<1,\"\",+'Hilfstabelle Mannschaften'!$R64)","v":""},{"$f":"IF(Q10<1,\"\",+'Hilfstabelle Mannschaften'!$R69)","v":""},{"$f":"IF(R10<1,\"\",+'Hilfstabelle Mannschaften'!$R74)","v":""},{"$f":"IF(S10<1,\"\",+'Hilfstabelle Mannschaften'!$R79)","v":""},{"$f":"IF(T10<1,\"\",+'Hilfstabelle Mannschaften'!$R84)","v":""},{"$f":"IF(U10<1,\"\",'Hilfstabelle Mannschaften'!R89)","v":""}]
[null,{"$f":"VLOOKUP(D12,Hilfstabelle!$L$5:$M$18,2,0)","v":"AXA 1"},null,{"$f":"+Hilfstabelle!L7","v":"AXA 1"},{"$f":"SUM(H13:U13)","v":41},9487,"Pins",{"$f":"VLOOKUP(B12,'Hilfstabelle Mannschaften'!$AD$53:$AE$62,2,0)","v":1599},{"$f":"VLOOKUP(B12,'Hilfstabelle Mannschaften'!$AD$53:$AF$62,3,0)","v":2044},{"$f":"VLOOKUP(B12,'Hilfstabelle Mannschaften'!$AD$53:$AG$62,4,0)","v":1865},{"$f":"VLOOKUP(B12,'Hilfstabelle Mannschaften'!$AD$53:$AH$62,5,0)","v":2034},{"$f":"VLOOKUP(B12,'Hilfstabelle Mannschaften'!$AD$53:$AI$62,6,0)","v":1945},{"$f":"VLOOKUP(B12,'Hilfstabelle Mannschaften'!$AD$53:$AJ$62,7,0)","v":0},{"$f":"VLOOKUP(B12,'Hilfstabelle Mannschaften'!$AD$53:$AK$62,8,0)","v":0},{"$f":"VLOOKUP(B12,'Hilfstabelle Mannschaften'!$AD$53:$AL$62,9,0)","v":0},{"$f":"VLOOKUP(B12,'Hilfstabelle Mannschaften'!$AD$53:$AM$62,10,0)","v":0},{"$f":"VLOOKUP(B12,'Hilfstabelle Mannschaften'!$AD$53:$AN$62,11,0)","v":0},{"$f":"VLOOKUP(B12,'Hilfstabelle Mannschaften'!$AD$53:$AO$62,12,0)","v":0},{"$f":"VLOOKUP(B12,'Hilfstabelle Mannschaften'!$AD$53:$AP$62,13,0)","v":0},{"$f":"VLOOKUP(B12,'Hilfstabelle Mannschaften'!$AD$53:$AQ$62,14,0)","v":0},{"$f":"VLOOKUP(B12,'Hilfstabelle Mannschaften'!$AD$53:$AR$62,15,0)","v":0}]
[null,null,null,null,null,null,"Punkte",{"$f":"IF(H12<1,\"\",'Hilfstabelle Mannschaften'!$S24)","v":3},{"$f":"IF(I12<1,\"\",'Hilfstabelle Mannschaften'!$S29)","v":10},{"$f":"IF(J12<1,\"\",'Hilfstabelle Mannschaften'!$S34)","v":9},{"$f":"IF(K12<1,\"\",'Hilfstabelle Mannschaften'!$S39)","v":10},{"$f":"IF(L12<1,\"\",'Hilfstabelle Mannschaften'!$S44)","v":9},{"$f":"IF(M12<1,\"\",'Hilfstabelle Mannschaften'!$S49)","v":""},{"$f":"IF(N12<1,\"\",'Hilfstabelle Mannschaften'!$S54)","v":""},{"$f":"IF(O12<1,\"\",'Hilfstabelle Mannschaften'!$S59)","v":""},{"$f":"IF(P12<1,\"\",'Hilfstabelle Mannschaften'!$S64)","v":""},{"$f":"IF(Q12<1,\"\",'Hilfstabelle Mannschaften'!$S69)","v":""},{"$f":"IF(R12<1,\"\",'Hilfstabelle Mannschaften'!$S74)","v":""},{"$f":"IF(S12<1,\"\",'Hilfstabelle Mannschaften'!$S79)","v":""},{"$f":"IF(T12<1,\"\",'Hilfstabelle Mannschaften'!$S84)","v":""},{"$f":"IF(U12<1,\"\",'Hilfstabelle Mannschaften'!S89)","v":""}]
[null,{"$f":"VLOOKUP(D14,Hilfstabelle!$L$5:$M$18,2,0)","v":"ERG 3"},null,{"$f":"+Hilfstabelle!L8","v":"ERGO Sports 3"},{"$f":"SUM(H15:U15)","v":13},{"$f":"SUM(H14:U14)","v":8054},"Pins",{"$f":"VLOOKUP(B14,'Hilfstabelle Mannschaften'!$AD$53:$AE$62,2,0)","v":1547},{"$f":"VLOOKUP(B14,'Hilfstabelle Mannschaften'!$AD$53:$AF$62,3,0)","v":1586},{"$f":"VLOOKUP(B14,'Hilfstabelle Mannschaften'!$AD$53:$AG$62,4,0)","v":1696},{"$f":"VLOOKUP(B14,'Hilfstabelle Mannschaften'!$AD$53:$AH$62,5,0)","v":1656},{"$f":"VLOOKUP(B14,'Hilfstabelle Mannschaften'!$AD$53:$AI$62,6,0)","v":1569},{"$f":"VLOOKUP(B14,'Hilfstabelle Mannschaften'!$AD$53:$AJ$62,7,0)","v":0},{"$f":"VLOOKUP(B14,'Hilfstabelle Mannschaften'!$AD$53:$AK$62,8,0)","v":0},{"$f":"VLOOKUP(B14,'Hilfstabelle Mannschaften'!$AD$53:$AL$62,9,0)","v":0},{"$f":"VLOOKUP(B14,'Hilfstabelle Mannschaften'!$AD$53:$AM$62,10,0)","v":0},{"$f":"VLOOKUP(B14,'Hilfstabelle Mannschaften'!$AD$53:$AN$62,11,0)","v":0},{"$f":"VLOOKUP(B14,'Hilfstabelle Mannschaften'!$AD$53:$AO$62,12,0)","v":0},{"$f":"VLOOKUP(B14,'Hilfstabelle Mannschaften'!$AD$53:$AP$62,13,0)","v":0},{"$f":"VLOOKUP(B14,'Hilfstabelle Mannschaften'!$AD$53:$AQ$62,14,0)","v":0},{"$f":"VLOOKUP(B14,'Hilfstabelle Mannschaften'!$AD$53:$AR$62,15,0)","v":0}]
[null,null,null,null,null,null,"Punkte",{"$f":"IF(H14<1,\"\",'Hilfstabelle Mannschaften'!$T24)","v":2},{"$f":"IF(I14<1,\"\",'Hilfstabelle Mannschaften'!$T29)","v":2},{"$f":"IF(J14<1,\"\",'Hilfstabelle Mannschaften'!$T34)","v":5},{"$f":"IF(K14<1,\"\",'Hilfstabelle Mannschaften'!$T39)","v":2},{"$f":"IF(L14<1,\"\",'Hilfstabelle Mannschaften'!$T44)","v":2},{"$f":"IF(M14<1,\"\",'Hilfstabelle Mannschaften'!$T49)","v":""},{"$f":"IF(N14<1,\"\",'Hilfstabelle Mannschaften'!$T54)","v":""},{"$f":"IF(O14<1,\"\",'Hilfstabelle Mannschaften'!$T59)","v":""},{"$f":"IF(P14<1,\"\",'Hilfstabelle Mannschaften'!$T64)","v":""},{"$f":"IF(Q14<1,\"\",'Hilfstabelle Mannschaften'!$T69)","v":""},{"$f":"IF(R14<1,\"\",'Hilfstabelle Mannschaften'!$T74)","v":""},{"$f":"IF(S14<1,\"\",'Hilfstabelle Mannschaften'!$T79)","v":""},{"$f":"IF(T14<1,\"\",'Hilfstabelle Mannschaften'!$T84)","v":""},{"$f":"IF(U14<1,\"\",'Hilfstabelle Mannschaften'!T89)","v":""}]
[null,{"$f":"VLOOKUP(D16,Hilfstabelle!$L$5:$M$18,2,0)","v":"DAT 2"},null,{"$f":"+Hilfstabelle!L9","v":"Dataport 2"},{"$f":"SUM(H17:U17)","v":35},9425,"Pins",{"$f":"VLOOKUP(B16,'Hilfstabelle Mannschaften'!$AD$53:$AE$62,2,0)","v":1817},{"$f":"VLOOKUP(B16,'Hilfstabelle Mannschaften'!$AD$53:$AF$62,3,0)","v":1967},{"$f":"VLOOKUP(B16,'Hilfstabelle Mannschaften'!$AD$53:$AG$62,4,0)","v":1661},{"$f":"VLOOKUP(B16,'Hilfstabelle Mannschaften'!$AD$53:$AH$62,5,0)","v":2005},{"$f":"VLOOKUP(B16,'Hilfstabelle Mannschaften'!$AD$53:$AI$62,6,0)","v":1975},{"$f":"VLOOKUP(B16,'Hilfstabelle Mannschaften'!$AD$53:$AJ$62,7,0)","v":0},{"$f":"VLOOKUP(B16,'Hilfstabelle Mannschaften'!$AD$53:$AK$62,8,0)","v":0},{"$f":"VLOOKUP(B16,'Hilfstabelle Mannschaften'!$AD$53:$AL$62,9,0)","v":0},{"$f":"VLOOKUP(B16,'Hilfstabelle Mannschaften'!$AD$53:$AM$62,10,0)","v":0},{"$f":"VLOOKUP(B16,'Hilfstabelle Mannschaften'!$AD$53:$AN$62,11,0)","v":0},{"$f":"VLOOKUP(B16,'Hilfstabelle Mannschaften'!$AD$53:$AO$62,12,0)","v":0},{"$f":"VLOOKUP(B16,'Hilfstabelle Mannschaften'!$AD$53:$AP$62,13,0)","v":0},{"$f":"VLOOKUP(B16,'Hilfstabelle Mannschaften'!$AD$53:$AQ$62,14,0)","v":0},{"$f":"VLOOKUP(B16,'Hilfstabelle Mannschaften'!$AD$53:$AR$62,15,0)","v":0}]
[null,null,null,null,null,null,"Punkte",{"$f":"IF(H16<1,\"\",'Hilfstabelle Mannschaften'!$U24)","v":6},{"$f":"IF(I16<1,\"\",'Hilfstabelle Mannschaften'!$U29)","v":9},{"$f":"IF(J16<1,\"\",'Hilfstabelle Mannschaften'!$U34)","v":4},{"$f":"IF(K16<1,\"\",'Hilfstabelle Mannschaften'!$U39)","v":6},{"$f":"IF(L16<1,\"\",'Hilfstabelle Mannschaften'!$U44)","v":10},{"$f":"IF(M16<1,\"\",'Hilfstabelle Mannschaften'!$U49)","v":""},{"$f":"IF(N16<1,\"\",'Hilfstabelle Mannschaften'!$U54)","v":""},{"$f":"IF(O16<1,\"\",'Hilfstabelle Mannschaften'!$U59)","v":""},{"$f":"IF(P16<1,\"\",'Hilfstabelle Mannschaften'!$U64)","v":""},{"$f":"IF(Q16<1,\"\",'Hilfstabelle Mannschaften'!$U69)","v":""},{"$f":"IF(R16<1,\"\",'Hilfstabelle Mannschaften'!$U74)","v":""},{"$f":"IF(S16<1,\"\",'Hilfstabelle Mannschaften'!$U79)","v":""},{"$f":"IF(T16<1,\"\",'Hilfstabelle Mannschaften'!$U84)","v":""},{"$f":"IF(U16<1,\"\",'Hilfstabelle Mannschaften'!U89)","v":""}]
[null,{"$f":"VLOOKUP(D18,Hilfstabelle!$L$5:$M$18,2,0)","v":"PAN 1"},null,{"$f":"+Hilfstabelle!L10","v":"Panasonic 1"},{"$f":"SUM(H19:U19)","v":42},9634,"Pins",{"$f":"VLOOKUP(B18,'Hilfstabelle Mannschaften'!$AD$53:$AE$62,2,0)","v":1921},{"$f":"VLOOKUP(B18,'Hilfstabelle Mannschaften'!$AD$53:$AF$62,3,0)","v":1955},{"$f":"VLOOKUP(B18,'Hilfstabelle Mannschaften'!$AD$53:$AG$62,4,0)","v":1847},{"$f":"VLOOKUP(B18,'Hilfstabelle Mannschaften'!$AD$53:$AH$62,5,0)","v":2032},{"$f":"VLOOKUP(B18,'Hilfstabelle Mannschaften'!$AD$53:$AI$62,6,0)","v":1879},{"$f":"VLOOKUP(B18,'Hilfstabelle Mannschaften'!$AD$53:$AJ$62,7,0)","v":0},{"$f":"VLOOKUP(B18,'Hilfstabelle Mannschaften'!$AD$53:$AK$62,8,0)","v":0},{"$f":"VLOOKUP(B18,'Hilfstabelle Mannschaften'!$AD$53:$AL$62,9,0)","v":0},{"$f":"VLOOKUP(B18,'Hilfstabelle Mannschaften'!$AD$53:$AM$62,10,0)","v":0},{"$f":"VLOOKUP(B18,'Hilfstabelle Mannschaften'!$AD$53:$AN$62,11,0)","v":0},{"$f":"VLOOKUP(B18,'Hilfstabelle Mannschaften'!$AD$53:$AO$62,12,0)","v":0},{"$f":"VLOOKUP(B18,'Hilfstabelle Mannschaften'!$AD$53:$AP$62,13,0)","v":0},{"$f":"VLOOKUP(B18,'Hilfstabelle Mannschaften'!$AD$53:$AQ$62,14,0)","v":0},{"$f":"VLOOKUP(B18,'Hilfstabelle Mannschaften'!$AD$53:$AR$62,15,0)","v":0}]
[null,null,null,null,null,null,"Punkte",{"$f":"IF(H18<1,\"\",'Hilfstabelle Mannschaften'!$V24)","v":9},{"$f":"IF(I18<1,\"\",'Hilfstabelle Mannschaften'!$V29)","v":8},{"$f":"IF(J18<1,\"\",'Hilfstabelle Mannschaften'!$V34)","v":8},{"$f":"IF(K18<1,\"\",'Hilfstabelle Mannschaften'!$V39)","v":9},{"$f":"IF(L18<1,\"\",'Hilfstabelle Mannschaften'!$V44)","v":8},{"$f":"IF(M18<1,\"\",'Hilfstabelle Mannschaften'!$V49)","v":""},{"$f":"IF(N18<1,\"\",'Hilfstabelle Mannschaften'!$V54)","v":""},{"$f":"IF(O18<1,\"\",'Hilfstabelle Mannschaften'!$V59)","v":""},{"$f":"IF(P18<1,\"\",'Hilfstabelle Mannschaften'!$V64)","v":""},{"$f":"IF(Q18<1,\"\",'Hilfstabelle Mannschaften'!$V69)","v":""},{"$f":"IF(R18<1,\"\",'Hilfstabelle Mannschaften'!$V74)","v":""},{"$f":"IF(S18<1,\"\",'Hilfstabelle Mannschaften'!$V79)","v":""},{"$f":"IF(T18<1,\"\",'Hilfstabelle Mannschaften'!$V84)","v":""},{"$f":"IF(U18<1,\"\",'Hilfstabelle Mannschaften'!V89)","v":""}]
[null,{"$f":"VLOOKUP(D20,Hilfstabelle!$L$5:$M$18,2,0)","v":"GEN 3"},null,{"$f":"+Hilfstabelle!L11","v":"Generali 3"},{"$f":"SUM(H21:U21)","v":26},8772,"Pins",{"$f":"VLOOKUP(B20,'Hilfstabelle Mannschaften'!$AD$53:$AE$62,2,0)","v":1734},{"$f":"VLOOKUP(B20,'Hilfstabelle Mannschaften'!$AD$53:$AF$62,3,0)","v":1646},{"$f":"VLOOKUP(B20,'Hilfstabelle Mannschaften'!$AD$53:$AG$62,4,0)","v":1758},{"$f":"VLOOKUP(B20,'Hilfstabelle Mannschaften'!$AD$53:$AH$62,5,0)","v":1845},{"$f":"VLOOKUP(B20,'Hilfstabelle Mannschaften'!$AD$53:$AI$62,6,0)","v":1789},{"$f":"VLOOKUP(B20,'Hilfstabelle Mannschaften'!$AD$53:$AJ$62,7,0)","v":0},{"$f":"VLOOKUP(B20,'Hilfstabelle Mannschaften'!$AD$53:$AK$62,8,0)","v":0},{"$f":"VLOOKUP(B20,'Hilfstabelle Mannschaften'!$AD$53:$AL$62,9,0)","v":0},{"$f":"VLOOKUP(B20,'Hilfstabelle Mannschaften'!$AD$53:$AM$62,10,0)","v":0},{"$f":"VLOOKUP(B20,'Hilfstabelle Mannschaften'!$AD$53:$AN$62,11,0)","v":0},{"$f":"VLOOKUP(B20,'Hilfstabelle Mannschaften'!$AD$53:$AO$62,12,0)","v":0},{"$f":"VLOOKUP(B20,'Hilfstabelle Mannschaften'!$AD$53:$AP$62,13,0)","v":0},{"$f":"VLOOKUP(B20,'Hilfstabelle Mannschaften'!$AD$53:$AQ$62,14,0)","v":0},{"$f":"VLOOKUP(B20,'Hilfstabelle Mannschaften'!$AD$53:$AR$62,15,0)","v":0}]
[null,null,null,null,null,null,"Punkte",{"$f":"IF(H20<1,\"\",'Hilfstabelle Mannschaften'!$W$24)","v":4},{"$f":"IF(I20<1,\"\",'Hilfstabelle Mannschaften'!$W29)","v":3},{"$f":"IF(J20<1,\"\",'Hilfstabelle Mannschaften'!$W34)","v":7},{"$f":"IF(K20<1,\"\",'Hilfstabelle Mannschaften'!$W39)","v":5},{"$f":"IF(L20<1,\"\",'Hilfstabelle Mannschaften'!$W44)","v":7},{"$f":"IF(M20<1,\"\",'Hilfstabelle Mannschaften'!$W49)","v":""},{"$f":"IF(N20<1,\"\",'Hilfstabelle Mannschaften'!$W54)","v":""},{"$f":"IF(O20<1,\"\",'Hilfstabelle Mannschaften'!$W59)","v":""},{"$f":"IF(P20<1,\"\",'Hilfstabelle Mannschaften'!$W64)","v":""},{"$f":"IF(Q20<1,\"\",'Hilfstabelle Mannschaften'!$W69)","v":""},{"$f":"IF(R20<1,\"\",'Hilfstabelle Mannschaften'!$W74)","v":""},{"$f":"IF(S20<1,\"\",'Hilfstabelle Mannschaften'!$W79)","v":""},{"$f":"IF(T20<1,\"\",'Hilfstabelle Mannschaften'!$W84)","v":""},{"$f":"IF(U20<1,\"\",'Hilfstabelle Mannschaften'!W89)","v":""}]
[null,{"$f":"VLOOKUP(D22,Hilfstabelle!$L$5:$M$18,2,0)","v":"FAH 3"},null,{"$f":"+Hilfstabelle!L12","v":"Finanzamt 3"},{"$f":"SUM(H23:U23)","v":20},{"$f":"SUM(H22:U22)","v":8223},"Pins",{"$f":"VLOOKUP(B22,'Hilfstabelle Mannschaften'!$AD$53:$AE$62,2,0)","v":1951},{"$f":"VLOOKUP(B22,'Hilfstabelle Mannschaften'!$AD$53:$AF$62,3,0)","v":1438},{"$f":"VLOOKUP(B22,'Hilfstabelle Mannschaften'!$AD$53:$AG$62,4,0)","v":1588},{"$f":"VLOOKUP(B22,'Hilfstabelle Mannschaften'!$AD$53:$AH$62,5,0)","v":1671},{"$f":"VLOOKUP(B22,'Hilfstabelle Mannschaften'!$AD$53:$AI$62,6,0)","v":1575},{"$f":"VLOOKUP(B22,'Hilfstabelle Mannschaften'!$AD$53:$AJ$62,7,0)","v":0},{"$f":"VLOOKUP(B22,'Hilfstabelle Mannschaften'!$AD$53:$AK$62,8,0)","v":0},{"$f":"VLOOKUP(B22,'Hilfstabelle Mannschaften'!$AD$53:$AL$62,9,0)","v":0},{"$f":"VLOOKUP(B22,'Hilfstabelle Mannschaften'!$AD$53:$AM$62,10,0)","v":0},{"$f":"VLOOKUP(B22,'Hilfstabelle Mannschaften'!$AD$53:$AN$62,11,0)","v":0},{"$f":"VLOOKUP(B22,'Hilfstabelle Mannschaften'!$AD$53:$AO$62,12,0)","v":0},{"$f":"VLOOKUP(B22,'Hilfstabelle Mannschaften'!$AD$53:$AP$62,13,0)","v":0},{"$f":"VLOOKUP(B22,'Hilfstabelle Mannschaften'!$AD$53:$AQ$62,14,0)","v":0},{"$f":"VLOOKUP(B22,'Hilfstabelle Mannschaften'!$AD$53:$AR$62,15,0)","v":0}]
[null,null,null,null,null,null,"Punkte",{"$f":"IF(H22<1,\"\",'Hilfstabelle Mannschaften'!$X$24)","v":10},{"$f":"IF(I22<1,\"\",'Hilfstabelle Mannschaften'!$X$29)","v":1},{"$f":"IF(J22<1,\"\",'Hilfstabelle Mannschaften'!$X$34)","v":3},{"$f":"IF(K22<1,\"\",'Hilfstabelle Mannschaften'!$X$39)","v":3},{"$f":"IF(L22<1,\"\",'Hilfstabelle Mannschaften'!$X$44)","v":3},{"$f":"IF(M22<1,\"\",'Hilfstabelle Mannschaften'!$X$49)","v":""},{"$f":"IF(N22<1,\"\",'Hilfstabelle Mannschaften'!$X$54)","v":""},{"$f":"IF(O22<1,\"\",'Hilfstabelle Mannschaften'!$X$59)","v":""},{"$f":"IF(P22<1,\"\",'Hilfstabelle Mannschaften'!$X$64)","v":""},{"$f":"IF(Q22<1,\"\",'Hilfstabelle Mannschaften'!$X$69)","v":""},{"$f":"IF(R22<1,\"\",'Hilfstabelle Mannschaften'!$X$74)","v":""},{"$f":"IF(S22<1,\"\",'Hilfstabelle Mannschaften'!$X$79)","v":""},{"$f":"IF(T22<1,\"\",'Hilfstabelle Mannschaften'!$X$84)","v":""},{"$f":"IF(U22<1,\"\",'Hilfstabelle Mannschaften'!X$89)","v":""}]
[null,{"$f":"VLOOKUP(D24,Hilfstabelle!$L$5:$M$18,2,0)","v":"HAS 5"},null,{"$f":"+Hilfstabelle!L13","v":"HASPA 5"},32,9100,"Pins",{"$f":"VLOOKUP(B24,'Hilfstabelle Mannschaften'!$AD$53:$AE$62,2,0)","v":1756},{"$f":"VLOOKUP(B24,'Hilfstabelle Mannschaften'!$AD$53:$AF$62,3,0)","v":1854},{"$f":"VLOOKUP(B24,'Hilfstabelle Mannschaften'!$AD$53:$AG$62,4,0)","v":1928},{"$f":"VLOOKUP(B24,'Hilfstabelle Mannschaften'!$AD$53:$AH$62,5,0)","v":1792},{"$f":"VLOOKUP(B24,'Hilfstabelle Mannschaften'!$AD$53:$AI$62,6,0)","v":1770},{"$f":"VLOOKUP(B24,'Hilfstabelle Mannschaften'!$AD$53:$AJ$62,7,0)","v":0},{"$f":"VLOOKUP(B24,'Hilfstabelle Mannschaften'!$AD$53:$AK$62,8,0)","v":0},{"$f":"VLOOKUP(B24,'Hilfstabelle Mannschaften'!$AD$53:$AL$62,9,0)","v":0},{"$f":"VLOOKUP(B24,'Hilfstabelle Mannschaften'!$AD$53:$AM$62,10,0)","v":0},{"$f":"VLOOKUP(B24,'Hilfstabelle Mannschaften'!$AD$53:$AN$62,11,0)","v":0},{"$f":"VLOOKUP(B24,'Hilfstabelle Mannschaften'!$AD$53:$AO$62,12,0)","v":0},{"$f":"VLOOKUP(B24,'Hilfstabelle Mannschaften'!$AD$53:$AP$62,13,0)","v":0},{"$f":"VLOOKUP(B24,'Hilfstabelle Mannschaften'!$AD$53:$AQ$62,14,0)","v":0},{"$f":"VLOOKUP(B24,'Hilfstabelle Mannschaften'!$AD$53:$AR$62,15,0)","v":0}]
[null,null,null,null,null,null,"Punkte",{"$f":"IF(H24<1,\"\",'Hilfstabelle Mannschaften'!$Y24)","v":5},{"$f":"IF(I24<1,\"\",'Hilfstabelle Mannschaften'!$Y29)","v":7},{"$f":"IF(J24<1,\"\",'Hilfstabelle Mannschaften'!$Y34)","v":10},{"$f":"IF(K24<1,\"\",'Hilfstabelle Mannschaften'!$Y39)","v":4},{"$f":"IF(L24<1,\"\",'Hilfstabelle Mannschaften'!$Y44)","v":6},{"$f":"IF(M24<1,\"\",'Hilfstabelle Mannschaften'!$Y49)","v":""},{"$f":"IF(N24<1,\"\",'Hilfstabelle Mannschaften'!$Y54)","v":""},{"$f":"IF(O24<1,\"\",'Hilfstabelle Mannschaften'!$Y59)","v":""},{"$f":"IF(P24<1,\"\",'Hilfstabelle Mannschaften'!$Y64)","v":""},{"$f":"IF(Q24<1,\"\",'Hilfstabelle Mannschaften'!$Y69)","v":""},{"$f":"IF(R24<1,\"\",'Hilfstabelle Mannschaften'!$Y74)","v":""},{"$f":"IF(S24<1,\"\",'Hilfstabelle Mannschaften'!$Y79)","v":""},{"$f":"IF(T24<1,\"\",'Hilfstabelle Mannschaften'!$Y84)","v":""},{"$f":"IF(U24<1,\"\",'Hilfstabelle Mannschaften'!Y89)","v":""}]
[null,{"$f":"VLOOKUP(D26,Hilfstabelle!$L$5:$M$18,2,0)","v":"BWV 5"},null,{"$f":"+Hilfstabelle!L14","v":"BWVL 5"},28,8727,"Pins",{"$f":"VLOOKUP(B26,'Hilfstabelle Mannschaften'!$AD$53:$AE$62,2,0)","v":1827},{"$f":"VLOOKUP(B26,'Hilfstabelle Mannschaften'!$AD$53:$AF$62,3,0)","v":1835},{"$f":"VLOOKUP(B26,'Hilfstabelle Mannschaften'!$AD$53:$AG$62,4,0)","v":1746},{"$f":"VLOOKUP(B26,'Hilfstabelle Mannschaften'!$AD$53:$AH$62,5,0)","v":2024},{"$f":"VLOOKUP(B26,'Hilfstabelle Mannschaften'!$AD$53:$AI$62,6,0)","v":1295},{"$f":"VLOOKUP(B26,'Hilfstabelle Mannschaften'!$AD$53:$AJ$62,7,0)","v":0},{"$f":"VLOOKUP(B26,'Hilfstabelle Mannschaften'!$AD$53:$AK$62,8,0)","v":0},{"$f":"VLOOKUP(B26,'Hilfstabelle Mannschaften'!$AD$53:$AL$62,9,0)","v":0},{"$f":"VLOOKUP(B26,'Hilfstabelle Mannschaften'!$AD$53:$AM$62,10,0)","v":0},{"$f":"VLOOKUP(B26,'Hilfstabelle Mannschaften'!$AD$53:$AN$62,11,0)","v":0},{"$f":"VLOOKUP(B26,'Hilfstabelle Mannschaften'!$AD$53:$AO$62,12,0)","v":0},{"$f":"VLOOKUP(B26,'Hilfstabelle Mannschaften'!$AD$53:$AP$62,13,0)","v":0},{"$f":"VLOOKUP(B26,'Hilfstabelle Mannschaften'!$AD$53:$AQ$62,14,0)","v":0},{"$f":"VLOOKUP(B26,'Hilfstabelle Mannschaften'!$AD$53:$AR$62,15,0)","v":0}]
[null,null,null,null,null,null,"Punkte",{"$f":"IF(H26<1,\"\",'Hilfstabelle Mannschaften'!$Z$24)","v":7},{"$f":"IF(I26<1,\"\",'Hilfstabelle Mannschaften'!$Z$29)","v":6},{"$f":"IF(J26<1,\"\",'Hilfstabelle Mannschaften'!$Z$34)","v":6},{"$f":"IF(K26<1,\"\",'Hilfstabelle Mannschaften'!$Z$39)","v":8},{"$f":"IF(L26<1,\"\",'Hilfstabelle Mannschaften'!$Z$44)","v":1},{"$f":"IF(M26<1,\"\",'Hilfstabelle Mannschaften'!$Z$49)","v":""},{"$f":"IF(N26<1,\"\",'Hilfstabelle Mannschaften'!$Z$54)","v":""},{"$f":"IF(O26<1,\"\",'Hilfstabelle Mannschaften'!$Z$59)","v":""},{"$f":"IF(P26<1,\"\",'Hilfstabelle Mannschaften'!$Z$64)","v":""},{"$f":"IF(Q26<1,\"\",'Hilfstabelle Mannschaften'!$Z$69)","v":""},{"$f":"IF(R26<1,\"\",'Hilfstabelle Mannschaften'!$Z$74)","v":""},{"$f":"IF(S26<1,\"\",'Hilfstabelle Mannschaften'!$Z$79)","v":""},{"$f":"IF(T26<1,\"\",'Hilfstabelle Mannschaften'!$Z$84)","v":""},{"$f":"IF(U26<1,\"\",'Hilfstabelle Mannschaften'!Z$89)","v":""}]
[null,{"$f":"_xlfn.XLOOKUP(D28,Hilfstabelle!$L$5:$L$18,Hilfstabelle!$M$5:$M$18)","v":"EAG 1"},null,{"$f":"+Hilfstabelle!L15","v":"Eppendorf AG 1"},{"$f":"SUM(H29:U29)","v":124},{"$f":"SUM(H28:U28)","v":26404},"Pins",{"$f":"VLOOKUP($B$28,'Hilfstabelle Mannschaften'!$AD$53:$AR$62,2,0)","v":1886},{"$f":"VLOOKUP($B$28,'Hilfstabelle Mannschaften'!$AD$53:$AR$62,2,0)","v":1886},{"$f":"VLOOKUP($B$28,'Hilfstabelle Mannschaften'!$AD$53:$AR$62,2,0)","v":1886},{"$f":"VLOOKUP($B$28,'Hilfstabelle Mannschaften'!$AD$53:$AR$62,2,0)","v":1886},{"$f":"VLOOKUP($B$28,'Hilfstabelle Mannschaften'!$AD$53:$AR$62,2,0)","v":1886},{"$f":"VLOOKUP($B$28,'Hilfstabelle Mannschaften'!$AD$53:$AR$62,2,0)","v":1886},{"$f":"VLOOKUP($B$28,'Hilfstabelle Mannschaften'!$AD$53:$AR$62,2,0)","v":1886},{"$f":"VLOOKUP($B$28,'Hilfstabelle Mannschaften'!$AD$53:$AR$62,2,0)","v":1886},{"$f":"VLOOKUP($B$28,'Hilfstabelle Mannschaften'!$AD$53:$AR$62,2,0)","v":1886},{"$f":"VLOOKUP($B$28,'Hilfstabelle Mannschaften'!$AD$53:$AR$62,2,0)","v":1886},{"$f":"VLOOKUP($B$28,'Hilfstabelle Mannschaften'!$AD$53:$AR$62,2,0)","v":1886},{"$f":"VLOOKUP($B$28,'Hilfstabelle Mannschaften'!$AD$53:$AR$62,2,0)","v":1886},{"$f":"VLOOKUP($B$28,'Hilfstabelle Mannschaften'!$AD$53:$AR$62,2,0)","v":1886},{"$f":"VLOOKUP($B$28,'Hilfstabelle Mannschaften'!$AD$53:$AR$62,2,0)","v":1886}]
[null,null,null,null,null,{"$f":"SUM(H29:U29)","v":124},"Punkte",{"$f":"IF(H28<1,\"\",'Hilfstabelle Mannschaften'!$AA$24)","v":0},{"$f":"IF(I28<1,\"\",'Hilfstabelle Mannschaften'!$AA$29)","v":0},{"$f":"IF(J28<1,\"\",'Hilfstabelle Mannschaften'!$AA$34)","v":10},{"$f":"IF(K28<1,\"\",'Hilfstabelle Mannschaften'!$AA$39)","v":6},{"$f":"IF(L28<1,\"\",'Hilfstabelle Mannschaften'!$AA$44)","v":9},{"$f":"IF(M28<1,\"\",'Hilfstabelle Mannschaften'!$AA$49)","v":11},{"$f":"IF(N28<1,\"\",'Hilfstabelle Mannschaften'!$AA$54)","v":11},{"$f":"IF(O28<1,\"\",'Hilfstabelle Mannschaften'!$AA$59)","v":11},{"$f":"IF(P28<1,\"\",'Hilfstabelle Mannschaften'!$AA$64)","v":11},{"$f":"IF(Q28<1,\"\",'Hilfstabelle Mannschaften'!$AA$69)","v":11},{"$f":"IF(R28<1,\"\",'Hilfstabelle Mannschaften'!$AA$74)","v":11},{"$f":"IF(S28<1,\"\",'Hilfstabelle Mannschaften'!$AA$79)","v":11},{"$f":"IF(T28<1,\"\",'Hilfstabelle Mannschaften'!$AA$84)","v":11},{"$f":"IF(U28<1,\"\",'Hilfstabelle Mannschaften'!AA$89)","v":11}]
[null,"=+'Spielbogen 1.'!F20",null,{"$f":"+#REF!","v":{"$error":"#REF!"}},null,{"$f":"SUM(H30:U30)","v":0},"Pins"]
[null,null,null,null,null,{"$f":"SUM(H31:U31)","v":0},"Punkte",{"$f":"IF(H30<1,\"\",'Hilfstabelle Mannschaften'!$AB$24)","v":""},{"$f":"IF(I30<1,\"\",'Hilfstabelle Mannschaften'!$AB$29)","v":""},{"$f":"IF(J30<1,\"\",'Hilfstabelle Mannschaften'!$AB$34)","v":""},{"$f":"IF(K30<1,\"\",'Hilfstabelle Mannschaften'!$AB$39)","v":""},{"$f":"IF(L30<1,\"\",'Hilfstabelle Mannschaften'!$AB$44)","v":""},{"$f":"IF(M30<1,\"\",'Hilfstabelle Mannschaften'!$AB$49)","v":""},{"$f":"IF(N30<1,\"\",'Hilfstabelle Mannschaften'!$AB$54)","v":""},{"$f":"IF(O30<1,\"\",'Hilfstabelle Mannschaften'!$AB$59)","v":""},{"$f":"IF(P30<1,\"\",'Hilfstabelle Mannschaften'!$AB$64)","v":""},{"$f":"IF(Q30<1,\"\",'Hilfstabelle Mannschaften'!$AB$69)","v":""},{"$f":"IF(R30<1,\"\",'Hilfstabelle Mannschaften'!$AB$74)","v":""},{"$f":"IF(S30<1,\"\",'Hilfstabelle Mannschaften'!$AB$79)","v":""},{"$f":"IF(T30<1,\"\",'Hilfstabelle Mannschaften'!$AB$84)","v":""},{"$f":"IF(U30<1,\"\",'Hilfstabelle Mannschaften'!AB$89)","v":""}]

{"sheet":"Hilfstabelle Spieler","index":7,"n_rows":29,"n_cols":61,"rows_kept":29,"cut":false,"hidden":true,"merged":[[0,58,0,59],[4,0,4,1],[1,34,5,34],[1,15,1,28],[1,39,5,39],[1,38,5,38],[1,37,5,37],[1,36,5,36],[1,35,5,35],[1,32,5,32],[1,33,5,33],[3,8,3,9],[3,10,3,11],[3,4,3,5],[3,6,3,7]]}
[null,null,null,null,null,null,null,null,null,null,null,null,null,null,null,null,null,null,null,null,null,null,null,null,null,null,null,null,null,null,null,null,null,null,null,null,null,null,null,null,null,null,null,"1. Ant.","2. Ant.","3. Ant.","4. Ant.","5. Ant.","6. Ant.","7. Ant.","8. Ant.","9. Ant.","10. Ant.","11. Ant.","12. Ant.","13. Ant.","14. Ant.",null,"Summe Pins sonstige",null,"Anzahl Spiele sonstige"]
[null,null,null,null,null,null,null,null,null,null,null,null,null,null,null,"1. Mannschaft",null,null,null,null,null,null,null,null,null,null,null,null,null,null,null,null,"Annegret Schmidt","Ilona Wetzel","Jörg Frahm","Kai Roßberg","Mario Jurk","Matthias Nolte","Michael Wetzel","Deniz Hagelstein",null,"Annegret Schmidt",{"$f":"+'Annegret S.'!$J$12","v":""},{"$f":"+'Annegret S.'!$J$13","v":413},{"$f":"+'Annegret S.'!$J$14","v":443},{"$f":"+'Annegret S.'!$J$15","v":""},{"$f":"+'Annegret S.'!$J$16","v":""},{"$f":"+'Annegret S.'!$J$17","v":""},{"$f":"+'Annegret S.'!$J$18","v":""},{"$f":"+'Annegret S.'!$J$19","v":""},{"$f":"+'Annegret S.'!$J$20","v":""},{"$f":"+'Annegret S.'!$J$21","v":""},{"$f":"+'Annegret S.'!$J$22","v":""},{"$f":"+'Annegret S.'!$J$23","v":""},{"$f":"+'Annegret S.'!$J$24","v":""},{"$f":"+'Annegret S.'!$J$25","v":""},null,null,"Annegret Schmidt",{"$f":"+'Annegret S.'!H7","v":26},{"$f":"+'Annegret S.'!G7","v":3535}]
[null,"Pass.-Nr.",null,null,null,null,null,null,null,null,null,null,null,null,null,"1. Ant.","2. Ant.","3. Ant.","4. Ant.","5. Ant.","6. Ant.","7. Ant.","8. Ant.","9. Ant.","10. Ant.","11. Ant.","12. Ant.","13. Ant.","14. Ant.",null,null,null,null,null,null,null,null,null,null,null,null,"Ilona Wetzel",{"$f":"+'Ilona W.'!$J$12","v":420},{"$f":"+'Ilona W.'!$J$13","v":""},{"$f":"+'Ilona W.'!$J$14","v":424},{"$f":"+'Ilona W.'!$J$15","v":""},{"$f":"+'Ilona W.'!$J$16","v":475},{"$f":"+'Ilona W.'!$J$17","v":""},{"$f":"+'Ilona W.'!$J$18","v":""},{"$f":"+'Ilona W.'!$J$19","v":""},{"$f":"+'Ilona W.'!$J$20","v":""},{"$f":"+'Ilona W.'!$J$21","v":""},{"$f":"+'Ilona W.'!$J$22","v":""},{"$f":"+'Ilona W.'!$J$23","v":""},{"$f":"+'Ilona W.'!$J$24","v":""},{"$f":"+'Ilona W.'!$J$25","v":""},null,null,"Deniz Hagelstein",{"$f":"+'Deniz H.'!H7","v":" "},{"$f":"+'Deniz H.'!G7","v":" "}]
[null,null,null,null,"Max Wert Einzel Ergebnis",null,"Max Wert 3er Ergebnis",null,"Max Wert 4er Ergebnis",null,"Max Wert 6er Ergebnis",null,null,null,"Deniz Hagelstein",{"$f":"+'Deniz H.'!$J12","v":""},{"$f":"+'Deniz H.'!$J13","v":""},{"$f":"+'Deniz H.'!$J14","v":""},{"$f":"+'Deniz H.'!$J15","v":485},{"$f":"+'Deniz H.'!$J16","v":""},{"$f":"+'Deniz H.'!$J17","v":""},{"$f":"+'Deniz H.'!$J18","v":""},{"$f":"+'Deniz H.'!$J19","v":""},{"$f":"+'Deniz H.'!$J20","v":""},{"$f":"+'Deniz H.'!$J21","v":""},{"$f":"+'Deniz H.'!$J22","v":""},{"$f":"+'Deniz H.'!$J23","v":""},{"$f":"+'Deniz H.'!$J24","v":""},{"$f":"+'Deniz H.'!$J25","v":""},null,null,null,null,null,null,null,null,null,null,null,null,"Jörg Frahm",{"$f":"+'Jörg F.'!$J$12","v":431},{"$f":"+'Jörg F.'!$J$13","v":496},{"$f":"+'Jörg F.'!$J$14","v":""},{"$f":"+'Jörg F.'!$J$15","v":""},{"$f":"+'Jörg F.'!$J$16","v":""},{"$f":"+'Jörg F.'!$J$17","v":""},{"$f":"+'Jörg F.'!$J$18","v":""},{"$f":"+'Jörg F.'!$J$19","v":""},{"$f":"+'Jörg F.'!$J$20","v":""},{"$f":"+'Jörg F.'!$J$21","v":""},{"$f":"+'Jörg F.'!$J$22","v":""},{"$f":"+'Jörg F.'!$J$23","v":""},{"$f":"+'Jörg F.'!$J$24","v":""},{"$f":"+'Jörg F.'!$J$25","v":""},null,null,"Frank Nijholt",{"$f":"+'Frank N.'!H7","v":" "},{"$f":"+'Frank N.'!G7","v":" "}]
["Mannschaft 1",null,null,null,{"$f":"+MAX('Michael W.'!J8,'Michael W.'!V8,'Michael W.'!S8)","v":220},"Michael Wetzel",{"$f":"+'Michael W.'!L8","v":524},"Michael Wetzel",{"$f":"+MAX('Michael W.'!$R$12:$R$20)","v":722},"Michael Wetzel",{"$f":"+MAX('Michael W.'!$S$12:$S$20)","v":1030},"Michael Wetzel",null,null,"Matthias Nolte",{"$f":"+'Matthias N.'!$J12","v":""},{"$f":"+'Matthias N.'!$J13","v":""},{"$f":"+'Matthias N.'!$J14","v":428},{"$f":"+'Matthias N.'!$J15","v":""},{"$f":"+'Matthias N.'!$J16","v":393},{"$f":"+'Matthias N.'!$J17","v":""},{"$f":"+'Matthias N.'!$J18","v":""},{"$f":"+'Matthias N.'!$J19","v":""},{"$f":"+'Matthias N.'!$J20","v":""},{"$f":"+'Matthias N.'!$J21","v":""},{"$f":"+'Matthias N.'!$J22","v":""},{"$f":"+'Matthias N.'!$J23","v":""},{"$f":"+'Matthias N.'!$J24","v":""},{"$f":"+'Matthias N.'!$J25","v":""},null,null,null,null,null,null,null,null,null,null,null,null,"Kai Roßberg",{"$f":"+'Kai R.'!$J$12","v":546},{"$f":"+'Kai R.'!$J$13","v":546},{"$f":"+'Kai R.'!$J$14","v":552},{"$f":"+'Kai R.'!$J$15","v":""},{"$f":"+'Kai R.'!$J$16","v":472},{"$f":"+'Kai R.'!$J$17","v":""},{"$f":"+'Kai R.'!$J$18","v":""},{"$f":"+'Kai R.'!$J$19","v":""},{"$f":"+'Kai R.'!$J$20","v":""},{"$f":"+'Kai R.'!$J$21","v":""},{"$f":"+'Kai R.'!$J$22","v":""},{"$f":"+'Kai R.'!$J$23","v":""},{"$f":"+'Kai R.'!$J$24","v":""},{"$f":"+'Kai R.'!$J$25","v":""},null,null,"Ilona Wetzel",{"$f":"+'Ilona W.'!H7","v":18},{"$f":"+'Ilona W.'!G7","v":2733}]
["Annegret Schmidt",19222,null,null,{"$f":"+MAX('Kai R.'!J8,'Kai R.'!V8,'Kai R.'!S8)","v":222},"Kai Roßberg",{"$f":"+'Kai R.'!L8","v":552},"Kai Roßberg",{"$f":"+MAX('Kai R.'!$R$12:$R$20)","v":0},"Kai Roßberg",{"$f":"+MAX('Kai R.'!$S$12:$S$20)","v":0},"Kai Roßberg",null,null,"Jörg Frahm",{"$f":"+'Jörg F.'!$J$12","v":431},{"$f":"+'Jörg F.'!$J$13","v":496},{"$f":"+'Jörg F.'!$J$14","v":""},{"$f":"+'Jörg F.'!$J$15","v":""},{"$f":"+'Jörg F.'!$J$16","v":""},{"$f":"+'Jörg F.'!$J$17","v":""},{"$f":"+'Jörg F.'!$J$18","v":""},{"$f":"+'Jörg F.'!$J$19","v":""},{"$f":"+'Jörg F.'!$J$20","v":""},{"$f":"+'Jörg F.'!$J$21","v":""},{"$f":"+'Jörg F.'!$J$22","v":""},{"$f":"+'Jörg F.'!$J$23","v":""},{"$f":"+'Jörg F.'!$J$24","v":""},{"$f":"+'Jörg F.'!$J$25","v":""},null,null,null,null,null,null,null,null,null,null,null,null,"Mario Jurk",{"$f":"+'Mario J.'!$J$12","v":""},{"$f":"+'Mario J.'!$J$13","v":""},{"$f":"+'Mario J.'!$J$14","v":""},{"$f":"+'Mario J.'!$J$15","v":628},{"$f":"+'Mario J.'!$J$16","v":539},{"$f":"+'Mario J.'!$J$17","v":""},{"$f":"+'Mario J.'!$J$18","v":""},{"$f":"+'Mario J.'!$J$19","v":""},{"$f":"+'Mario J.'!$J$20","v":""},{"$f":"+'Mario J.'!$J$21","v":""},{"$f":"+'Mario J.'!$J$22","v":""},{"$f":"+'Mario J.'!$J$23","v":""},{"$f":"+'Mario J.'!$J$24","v":""},{"$f":"+'Mario J.'!$J$25","v":""},null,null,"Jörg Frahm",{"$f":"+'Jörg F.'!H7","v":10},{"$f":"+'Jörg F.'!G7","v":1842}]
["Deniz Hagelstein",24775,null,null,{"$f":"+MAX('Mario J.'!J8,'Mario J.'!V8,'Mario J.'!S8)","v":224},"Mario Jurk",{"$f":"+'Mario J.'!L8","v":628},"Mario Jurk",{"$f":"+MAX('Mario J.'!$R$12:$R$20)","v":0},"Mario Jurk",{"$f":"+MAX('Mario J.'!$S$12:$S$20)","v":0},"Mario Jurk",null,null,"Michael Wetzel",{"$f":"+'Michael W.'!$J$12","v":524},{"$f":"+'Michael W.'!$J$13","v":""},{"$f":"+'Michael W.'!$J$14","v":""},{"$f":"+'Michael W.'!$J$15","v":488},{"$f":"+'Michael W.'!$J$16","v":""},{"$f":"+'Michael W.'!$J$17","v":""},{"$f":"+'Michael W.'!$J$18","v":""},{"$f":"+'Michael W.'!$J$19","v":""},{"$f":"+'Michael W.'!$J$20","v":""},{"$f":"+'Michael W.'!$J$21","v":""},{"$f":"+'Michael W.'!$J$22","v":""},{"$f":"+'Michael W.'!$J$23","v":""},{"$f":"+'Michael W.'!$J$24","v":""},{"$f":"+'Michael W.'!$J$25","v":""},null,null,"1. Antritt",{"$f":"+'Annegret S.'!$J$12","v":""},{"$f":"+'Ilona W.'!$J$12","v":420},{"$f":"+'Jörg F.'!$J$12","v":431},{"$f":"+'Kai R.'!$J$13","v":546},{"$f":"+'Mario J.'!$J$12","v":""},{"$f":"+'Matthias N.'!$J$12","v":""},{"$f":"+'Michael W.'!$J$12","v":524},{"$f":"+'Deniz H.'!$J$12","v":""},null,"Matthias Nolte",{"$f":"+'Matthias N.'!$J$12","v":""},{"$f":"+'Matthias N.'!$J$13","v":""},{"$f":"+'Matthias N.'!$J$14","v":428},{"$f":"+'Matthias N.'!$J$15","v":""},{"$f":"+'Matthias N.'!$J$16","v":393},{"$f":"+'Matthias N.'!$J$17","v":""},{"$f":"+'Matthias N.'!$J$18","v":""},{"$f":"+'Matthias N.'!$J$19","v":""},{"$f":"+'Matthias N.'!$J$20","v":""},{"$f":"+'Matthias N.'!$J$21","v":""},{"$f":"+'Matthias N.'!$J$22","v":""},{"$f":"+'Matthias N.'!$J$23","v":""},{"$f":"+'Matthias N.'!$J$24","v":""},{"$f":"+'Matthias N.'!$J$25","v":""},null,null,"Kai Roßberg",{"$f":"+'Kai R.'!H7","v":" "},{"$f":"+'Kai R.'!G7","v":" "}]
["Frank Nijholt",24774,null,null,{"$f":"+MAX('Jörg F.'!J8,'Jörg F.'!V8,'Jörg F.'!S8)","v":227},"Jörg Frahm",{"$f":"+'Jörg F.'!L8","v":496},"Jörg Frahm",{"$f":"+MAX('Jörg F.'!$R$12:$R$20)","v":761},"Jörg Frahm",{"$f":"+MAX('Jörg F.'!$S$12:$S$20)","v":1081},"Jörg Frahm",null,null,"Kai Roßberg",{"$f":"+'Kai R.'!$J$12","v":546},{"$f":"+'Kai R.'!$J$13","v":546},{"$f":"+'Kai R.'!$J$14","v":552},{"$f":"+'Kai R.'!$J$15","v":""},{"$f":"+'Kai R.'!$J$16","v":472},{"$f":"+'Kai R.'!$J$17","v":""},{"$f":"+'Kai R.'!$J$18","v":""},{"$f":"+'Kai R.'!$J$19","v":""},{"$f":"+'Kai R.'!$J$20","v":""},{"$f":"+'Kai R.'!$J$21","v":""},{"$f":"+'Kai R.'!$J$22","v":""},{"$f":"+'Kai R.'!$J$23","v":""},{"$f":"+'Kai R.'!$J$24","v":""},{"$f":"+'Kai R.'!$J$25","v":""},null,null,"2. Antritt",{"$f":"+'Annegret S.'!$J$13","v":413},{"$f":"+'Ilona W.'!$J$13","v":""},{"$f":"+'Jörg F.'!$J$13","v":496},{"$f":"+'Kai R.'!$J$14","v":552},{"$f":"+'Mario J.'!$J$13","v":""},{"$f":"+'Matthias N.'!$J$13","v":""},{"$f":"+'Michael W.'!$J$13","v":""},{"$f":"+'Deniz H.'!$J$13","v":""},null,"Michael Wetzel",{"$f":"+'Michael W.'!$J$12","v":524},{"$f":"+'Michael W.'!$J$13","v":""},{"$f":"+'Michael W.'!$J$14","v":""},{"$f":"+'Michael W.'!$J$15","v":488},{"$f":"+'Michael W.'!$J$16","v":""},{"$f":"+'Michael W.'!$J$17","v":""},{"$f":"+'Michael W.'!$J$18","v":""},{"$f":"+'Michael W.'!$J$19","v":""},{"$f":"+'Michael W.'!$J$20","v":""},{"$f":"+'Michael W.'!$J$21","v":""},{"$f":"+'Michael W.'!$J$22","v":""},{"$f":"+'Michael W.'!$J$23","v":""},{"$f":"+'Michael W.'!$J$24","v":""},{"$f":"+'Michael W.'!$J$25","v":""},null,null,"Mario Jurk",{"$f":"+'Mario J.'!H7","v":" "},{"$f":"+'Mario J.'!G7","v":" "}]
["Ilona Wetzel",22115,null,null,{"$f":"+MAX('Matthias N.'!$J$8,'Matthias N.'!$V$8,'Matthias N.'!$S$8)","v":168},"Matthias Nolte",{"$f":"+'Matthias N.'!$L$8","v":428},"Matthias Nolte",{"$f":"+MAX('Matthias N.'!$R$12:$R$20)","v":0},"Matthias Nolte",{"$f":"+MAX('Matthias N.'!$S$12:$S$20)","v":0},"Matthias Nolte",null,null,"Mario Jurk",{"$f":"+'Mario J.'!$J$12","v":""},{"$f":"+'Mario J.'!$J$13","v":""},{"$f":"+'Mario J.'!$J$14","v":""},{"$f":"+'Mario J.'!$J$15","v":628},{"$f":"+'Mario J.'!$J$16","v":539},{"$f":"+'Mario J.'!$J$17","v":""},{"$f":"+'Mario J.'!$J$18","v":""},{"$f":"+'Mario J.'!$J$19","v":""},{"$f":"+'Mario J.'!$J$20","v":""},{"$f":"+'Mario J.'!$J$21","v":""},{"$f":"+'Mario J.'!$J$22","v":""},{"$f":"+'Mario J.'!$J$23","v":""},{"$f":"+'Mario J.'!$J$24","v":""},{"$f":"+'Mario J.'!$J$25","v":""},null,null,"3. Antritt",{"$f":"+'Annegret S.'!$J$14","v":443},{"$f":"+'Ilona W.'!$J$14","v":424},{"$f":"+'Jörg F.'!$J$14","v":""},{"$f":"+'Kai R.'!$J$15","v":""},{"$f":"+'Mario J.'!$J$14","v":""},{"$f":"+'Matthias N.'!$J$14","v":428},{"$f":"+'Michael W.'!$J$14","v":""},{"$f":"+'Deniz H.'!$J$14","v":""},null,"Deniz Hagelstein",{"$f":"+'Deniz H.'!$J$12","v":""},{"$f":"+'Deniz H.'!$J$13","v":""},{"$f":"+'Deniz H.'!$J$14","v":""},{"$f":"+'Deniz H.'!$J$15","v":485},{"$f":"+'Deniz H.'!$J$16","v":""},{"$f":"+'Deniz H.'!$J$17","v":""},{"$f":"+'Deniz H.'!$J$18","v":""},{"$f":"+'Deniz H.'!$J$19","v":""},{"$f":"+'Deniz H.'!$J$20","v":""},{"$f":"+'Deniz H.'!$J$21","v":""},{"$f":"+'Deniz H.'!$J$22","v":""},{"$f":"+'Deniz H.'!$J$23","v":""},{"$f":"+'Deniz H.'!$J$24","v":""},{"$f":"+'Deniz H.'!$J$25","v":""},null,null,"Matthias Nolte",{"$f":"+'Matthias N.'!H7","v":" "},{"$f":"+'Matthias N.'!G7","v":" "}]
["Jörg Frahm",19221,null,null,{"$f":"+MAX('Deniz H.'!$J$8,'Deniz H.'!$V$8,'Deniz H.'!$S$8)","v":187},"Deniz Hagelstein",{"$f":"+'Deniz H.'!$L$8","v":485},"Deniz Hagelstein",{"$f":"+MAX('Deniz H.'!$R$12:$R$20)","v":0},"Deniz Hagelstein",{"$f":"+MAX('Deniz H.'!$S$12:$S$20)","v":0},"Deniz Hagelstein",null,null,"Ilona Wetzel",{"$f":"+'Ilona W.'!$J$12","v":420},{"$f":"+'Ilona W.'!$J$13","v":""},{"$f":"+'Ilona W.'!$J$14","v":424},{"$f":"+'Ilona W.'!$J$15","v":""},{"$f":"+'Ilona W.'!$J$16","v":475},{"$f":"+'Ilona W.'!$J$17","v":""},{"$f":"+'Ilona W.'!$J$18","v":""},{"$f":"+'Ilona W.'!$J$19","v":""},{"$f":"+'Ilona W.'!$J$20","v":""},{"$f":"+'Ilona W.'!$J$21","v":""},{"$f":"+'Ilona W.'!$J$22","v":""},{"$f":"+'Ilona W.'!$J$23","v":""},{"$f":"+'Ilona W.'!$J$24","v":""},{"$f":"+'Ilona W.'!$J$25","v":""},null,null,"4. Antritt",{"$f":"+'Annegret S.'!$J$15","v":""},{"$f":"+'Ilona W.'!$J$15","v":""},{"$f":"+'Jörg F.'!$J$15","v":""},{"$f":"+'Kai R.'!$J$16","v":472},{"$f":"+'Mario J.'!$J$15","v":628},{"$f":"+'Matthias N.'!$J$15","v":""},{"$f":"+'Michael W.'!$J$15","v":488},{"$f":"+'Deniz H.'!$J$15","v":485},null,null,null,null,null,null,null,null,null,null,null,null,null,null,null,null,null,null,"Michael Wetzel",{"$f":"+'Michael W.'!H7","v":10},{"$f":"+'Michael W.'!G7","v":1752}]
["Kai Roßberg",21889,null,null,{"$f":"+MAX('Frank N.'!$J$8,'Frank N.'!$V$8,'Frank N.'!$S$8)","v":170},"Frank Nijholt",{"$f":"+'Frank N.'!$L$8","v":500},"Frank Nijholt",{"$f":"+MAX('Frank N.'!$R$12:$R$20)","v":0},"Frank Nijholt",{"$f":"+MAX('Frank N.'!$S$12:$S$20)","v":0},"Frank Nijholt",null,null,"Annegret Schmidt",{"$f":"+'Annegret S.'!$J$12","v":""},{"$f":"+'Annegret S.'!$J$13","v":413},{"$f":"+'Annegret S.'!$J$14","v":443},{"$f":"+'Annegret S.'!$J$15","v":""},{"$f":"+'Annegret S.'!$J$16","v":""},{"$f":"+'Annegret S.'!$J$17","v":""},{"$f":"+'Annegret S.'!$J$18","v":""},{"$f":"+'Annegret S.'!$J$19","v":""},{"$f":"+'Annegret S.'!$J$20","v":""},{"$f":"+'Annegret S.'!$J$21","v":""},{"$f":"+'Annegret S.'!$J$22","v":""},{"$f":"+'Annegret S.'!$J$23","v":""},{"$f":"+'Annegret S.'!$J$24","v":""},{"$f":"+'Annegret S.'!$J$25","v":""},null,null,"5. Antritt",{"$f":"+'Annegret S.'!$J$16","v":""},{"$f":"+'Ilona W.'!$J$16","v":475},{"$f":"+'Jörg F.'!$J$16","v":""},{"$f":"+'Kai R.'!$J$17","v":""},{"$f":"+'Mario J.'!$J$16","v":539},{"$f":"+'Matthias N.'!$J$16","v":393},{"$f":"+'Michael W.'!$J$16","v":""},{"$f":"+'Deniz H.'!$J$17","v":""},null,null,null,null,null,null,null,null,null,null,null,null,null,null,null,null,null,null,"Gesamt",{"$f":"SUM(BH2:BH10)","v":64},{"$f":"SUM(BI2:BI10)","v":9862}]
["Mario Jurk",23302,null,null,null,null,{"$f":"+G10/3","v":161.66666666666666},null,{"$f":"+I10/4","v":0},null,{"$f":"+K10/6","v":0},null,null,null,"Frank Nijholt",{"$f":"+'Frank N.'!$J$12","v":""},{"$f":"+'Frank N.'!$J$13","v":500},{"$f":"+'Frank N.'!$J$14","v":""},{"$f":"+'Frank N.'!$J$15","v":431},{"$f":"+'Frank N.'!$J$16","v":""},{"$f":"+'Frank N.'!$J$17","v":""},{"$f":"+'Frank N.'!$J$18","v":""},{"$f":"+'Frank N.'!$J$19","v":""},{"$f":"+'Frank N.'!$J$20","v":""},{"$f":"+'Frank N.'!$J$21","v":""},{"$f":"+'Frank N.'!$J$22","v":""},{"$f":"+'Frank N.'!$J$23","v":""},{"$f":"+'Frank N.'!$J$24","v":""},{"$f":"+'Frank N.'!$J$25","v":""},null,null,"6. Antritt",{"$f":"+'Annegret S.'!$J$17","v":""},{"$f":"+'Ilona W.'!$J$17","v":""},{"$f":"+'Jörg F.'!$J$17","v":""},{"$f":"+'Kai R.'!$J$18","v":""},{"$f":"+'Mario J.'!$J$17","v":""},{"$f":"+'Matthias N.'!$J$17","v":""},{"$f":"+'Michael W.'!$J$17","v":""},{"$f":"+'Deniz H.'!$J$17","v":""}]
["Matthias Nolte",20137,null,null,{"$f":"MAX(E5:E11)","v":227},{"$f":"VLOOKUP(E13,E5:F10,2,0)","v":"Jörg Frahm"},{"$f":"MAX(G5:G11)","v":628},{"$f":"VLOOKUP(G13,G5:H10,2,0)","v":"Mario Jurk"},{"$f":"MAX(I5:I11)","v":761},{"$f":"VLOOKUP(I13,I5:J10,2,0)","v":"Jörg Frahm"},{"$f":"MAX(K5:K11)","v":1081},{"$f":"VLOOKUP(K13,K5:L10,2,0)","v":"Jörg Frahm"},null,null,null,null,null,null,null,null,null,null,null,null,null,null,null,null,null,null,null,"7. Antritt",{"$f":"+'Annegret S.'!$J$18","v":""},{"$f":"+'Ilona W.'!$J$18","v":""},{"$f":"+'Jörg F.'!$J$18","v":""},{"$f":"+'Kai R.'!$J$19","v":""},{"$f":"+'Mario J.'!$J$18","v":""},{"$f":"+'Matthias N.'!$J$18","v":""},{"$f":"+'Michael W.'!$J$18","v":""},{"$f":"+'Deniz H.'!$J$18","v":""}]
["Michael Wetzel",22113,null,null,null,null,{"$f":"+G13/3","v":209.33333333333334},null,{"$f":"+I13/4","v":190.25},null,{"$f":"+K13/6","v":180.16666666666666},null,null,null,null,null,null,null,null,null,null,null,null,null,null,null,null,null,null,null,null,"8. Antritt",{"$f":"+'Annegret S.'!$J$19","v":""},{"$f":"+'Ilona W.'!$J$19","v":""},{"$f":"+'Jörg F.'!$J$19","v":""},{"$f":"+'Kai R.'!$J$20","v":""},{"$f":"+'Mario J.'!$J$19","v":""},{"$f":"+'Matthias N.'!$J$19","v":""},{"$f":"+'Michael W.'!$J$19","v":""},{"$f":"+'Deniz H.'!$J$19","v":""}]
[null,null,null,null,{"$f":"+MAX('Annegret S.'!J8,'Annegret S.'!V8,'Annegret S.'!S8)","v":192},"Annegret Schmidt",{"$f":"+'Annegret S.'!L8","v":443},"Annegret Schmidt",{"$f":"+MAX('Annegret S.'!$R$12:$R$28)","v":627},"Annegret Schmidt",{"$f":"+MAX('Annegret S.'!$S$12:$S$20)","v":770},"Annegret Schmidt",null,null,null,null,null,null,null,null,null,null,null,null,null,null,null,null,null,null,null,"9. Antritt",{"$f":"+'Annegret S.'!$J$20","v":""},{"$f":"+'Ilona W.'!$J$20","v":""},{"$f":"+'Jörg F.'!$J$20","v":""},{"$f":"+'Kai R.'!$J$21","v":""},{"$f":"+'Mario J.'!$J$20","v":""},{"$f":"+'Matthias N.'!$J$20","v":""},{"$f":"+'Michael W.'!$J$20","v":""},{"$f":"+'Deniz H.'!$J$20","v":""}]
[null,null,null,null,{"$f":"+MAX('Ilona W.'!J8,'Ilona W.'!V8,'Ilona W.'!S8)","v":185},"Ilona Wetzel",{"$f":"+'Ilona W.'!L8","v":475},"Ilona Wetzel",{"$f":"+MAX('Ilona W.'!$R$12:$R$28)","v":646},"Ilona Wetzel",{"$f":"+MAX('Ilona W.'!$S$12:$S$20)","v":876},"Ilona Wetzel",null,null,null,null,null,null,null,null,null,null,null,null,null,null,null,null,null,null,null,"10. Antritt",{"$f":"+'Annegret S.'!$J$21","v":""},{"$f":"+'Ilona W.'!$J$21","v":""},{"$f":"+'Jörg F.'!$J$21","v":""},{"$f":"+'Kai R.'!$J$22","v":""},{"$f":"+'Mario J.'!$J$21","v":""},{"$f":"+'Matthias N.'!$J$21","v":""},{"$f":"+'Michael W.'!$J$21","v":""},{"$f":"+'Deniz H.'!$J$21","v":""}]
[null,null,null,null,null,null,null,null,null,null,null,null,null,null,null,null,null,null,null,null,null,null,null,null,null,null,null,null,null,null,null,"11. Antritt",{"$f":"+'Annegret S.'!$J$22","v":""},{"$f":"+'Ilona W.'!$J$22","v":""},{"$f":"+'Jörg F.'!$J$22","v":""},{"$f":"+'Kai R.'!$J$23","v":""},{"$f":"+'Mario J.'!$J$22","v":""},{"$f":"+'Matthias N.'!$J$22","v":""},{"$f":"+'Michael W.'!$J$22","v":""},{"$f":"+'Deniz H.'!$J$22","v":""}]
[null,null,null,null,{"$f":"MAX(E15:E16)","v":192},{"$f":"VLOOKUP(E18,E15:F16,2,0)","v":"Annegret Schmidt"},{"$f":"MAX(G15:G16)","v":475},{"$f":"VLOOKUP(G18,G15:H16,2,0)","v":"Ilona Wetzel"},{"$f":"MAX(I15:I16)","v":646},{"$f":"VLOOKUP(I18,I15:J16,2,0)","v":"Ilona Wetzel"},{"$f":"MAX(K15:K16)","v":876},{"$f":"VLOOKUP(K18,K15:L16,2,0)","v":"Ilona Wetzel"},null,null,null,null,null,null,null,null,null,null,null,null,null,null,null,null,null,null,null,"12. Antritt",{"$f":"+'Annegret S.'!$J$23","v":""},{"$f":"+'Ilona W.'!$J$23","v":""},{"$f":"+'Jörg F.'!$J$23","v":""},{"$f":"+'Kai R.'!$J$24","v":""},{"$f":"+'Mario J.'!$J$23","v":""},{"$f":"+'Matthias N.'!$J$23","v":""},{"$f":"+'Michael W.'!$J$23","v":""},{"$f":"+'Deniz H.'!$J$23","v":""}]
[null,null,null,null,null,null,{"$f":"+G18/3","v":158.33333333333334},null,{"$f":"+I18/4","v":161.5},null,{"$f":"+K18/6","v":146},null,null,null,null,null,null,null,null,null,null,null,null,null,null,null,null,null,null,null,null,"13. Antritt",{"$f":"+'Annegret S.'!$J$24","v":""},{"$f":"+'Ilona W.'!$J$24","v":""},{"$f":"+'Jörg F.'!$J$24","v":""},{"$f":"+'Kai R.'!$J$25","v":""},{"$f":"+'Mario J.'!$J$24","v":""},{"$f":"+'Matthias N.'!$J$24","v":""},{"$f":"+'Michael W.'!$J$24","v":""},{"$f":"+'Deniz H.'!$J$24","v":""}]
[null,null,null,null,null,null,null,null,null,null,null,null,null,null,null,null,null,null,null,null,null,null,null,null,null,null,null,null,null,null,null,"14. Antritt",{"$f":"+'Annegret S.'!$J$25","v":""},{"$f":"+'Ilona W.'!$J$25","v":""},{"$f":"+'Jörg F.'!$J$25","v":""},{"$f":"+'Kai R.'!$K$26","v":0},{"$f":"+'Mario J.'!$J$25","v":""},{"$f":"+'Matthias N.'!$J$25","v":""},{"$f":"+'Michael W.'!$J$25","v":""},{"$f":"+'Deniz H.'!$J$25","v":""}]
[]
[]
[]
[]
[null,null,null,null,"Zuletzt aktualisiert am:",{"$f":"NOW()","v":"2025-11-16T15:41:11.980"},">>>>>>>>>",{"$f":"'Hilfstabelle Spieler'!$E$25&\"  \"&TEXT('Hilfstabelle Spieler'!$F$25,\"TT.MM.JJJJ\")","v":"Zuletzt aktualisiert am:  16.11.2025"}]
[null,null,null,null,null,null,null,{"$f":"'Hilfstabelle Spieler'!$E$25&\"  \"&TEXT('Hilfstabelle Spieler'!$F$25,\"hh:mm:ss\")","v":"Zuletzt aktualisiert am:  15:41:12"}]
[]
[null,null,null,null,null,null,null,{"$f":"+H26","v":"Zuletzt aktualisiert am:  15:41:12"}]
[null,null,null,null,null,null,null,{"$f":"NOW()","v":45977.653610879628}]

{"sheet":"Annegret S.","index":8,"n_rows":29,"n_cols":23,"rows_kept":29,"cut":false,"hidden":false,"merged":[[26,12,26,16],[27,12,27,16],[28,12,28,16],[21,12,21,16],[22,12,22,16],[23,12,23,16],[24,12,24,16],[25,12,25,16],[1,6,1,18],[9,3,9,10],[7,3,7,5],[5,3,5,5],[6,3,6,5],[9,12,9,21],[4,16,4,21],[5,11,5,12],[6,11,6,12],[7,11,7,12],[6,16,6,17],[5,19,5,21],[7,16,7,17],[7,19,7,20],[6,19,6,20],[4,9,4,14],[32,14,32,16],[33,14,33,16],[34,14,34,16],[2,9,2,13],[4,4,4,5],[2,3,2,7],[5,16,5,18],[10,12,10,16],[11,12,11,16],[12,12,12,16],[13,12,13,16],[14,12,14,16],[15,12,15,16],[16,12,16,16],[17,12,17,16],[18,12,18,16],[19,12,19,16],[17,22,17,23],[18,22,18,23],[19,22,19,23],[12,22,12,23],[13,22,13,23],[14,22,14,23],[15,22,15,23],[16,22,16,23]]}
[null,"Start"]
[null,"Rangliste",null,null,null,null,{"$f":"+'Hilfstabelle Mannschaften'!H6&\" \"&+'Hilfstabelle Mannschaften'!I6","v":"PUNKTSPIELSAISON  2025/2026"}]
[null,null,null,{"$f":"+'Hilfstabelle Spieler'!A6","v":"Annegret Schmidt"}]
[]
[null,null,null,"Pass.-Nr.:",{"$f":"VLOOKUP(D3,'Hilfstabelle Spieler'!A6:B19,2,0)","v":19222},null,"Pins","Spiele","Schnitt","Ligaergebnisse",null,null,null,null,null,null,"Sonstige Antritte:"]
[null,null,null,"Ligaergebnisse:",null,null,{"$f":"IF(SUM(J12:J25)>1,SUM(J12:J25),\" \")","v":856},{"$f":"COUNT(G12:I25)","v":6},{"$f":"IF(SUM(G12:I25)>1,SUM(G6/H6),\" \")","v":142.66666666666666},"MAX.","MIN.","MAX.",null,"MIN.","Schnitt",null,"4.er Serie:",null,null,"6.er Serie:"]
[null,null,null,"Sonstige Antritte:",null,null,{"$f":"IF(SUM(R12:S28)>1,SUM(R12:S28),\" \")","v":3535},{"$f":"IF(SUM(R12:S28)>1,SUM(V12:V28),\" \")","v":26},{"$f":"IF(SUM(R12:S28)>1,G7/H7,\" \")","v":135.96153846153845},"ERG.","ERG.","3.ER",null,"3.ER","3.ER",null,"Höchstes 4.er Erg. :",null,{"$f":"MAX(R13:R18,R23:R28)","v":627},"Höchstes 6.er Erg. :",null,{"$f":"MAX(S12:S20)","v":770}]
[null,null,null,"GESAMTSCHNITT:",null,null,{"$f":"IF(SUM(G6:G7)>1,SUM(G6:G7),\" \")","v":4391},{"$f":"IF(SUM(H6:H7)>1,SUM(H6:H7),\" \")","v":32},{"$f":"IF(SUM(G8)>1,SUM(G8/H8),\" \")","v":137.21875},{"$f":"MAX(G12:I25)","v":162},{"$f":"IF(SUM(G12:I25)<1,\" \",MIN(G12:I25))","v":111},{"$f":"MAX(J12:J25)","v":443},null,{"$f":"IF(SUM(G12:J25)>1,MIN(J12:J25),\" \")","v":413},{"$f":"IF(J8>0,AVERAGE(J12:J25),\"\")","v":428},null,"Höchste Einzel-Erg. :",null,192,"Höchste Einzel-Erg. :",null,150]
[]
[null,null,null,"         Einzelspielergebnisse Liga",null,null,null,null,null,null,null,null,"Sonstige Antritte"]
[null,null,null," Datum","Antr.","Bahn","1. Spiel","2. Spiel","3. Spiel","3. er Serie","3. er Ø",null," Datum - Turnier",null,null,null,null,"4.er Erg.","6.er Erg.","Schnitt","Ges. Pins","Spiele"]
[null,null,null,{"$f":"+'Spielbogen 10er'!K5","v":"2025-09-09"},1,{"$f":"+'Spielbogen 10er'!J5","v":"OT"},null,null,null,{"$f":"IF(G12>1,+G12+H12+I12,\"\")","v":""},{"$f":"IF(G12>1,SUM(G12:I12)/3,\" \")","v":" "},null,{"$f":"+'Anmeldegruppen Turniere'!AB8&\" - \"&W12","v":"13. / 14. 09. 2025 - Eröffnungs Doppel"},null,null,null,null,null,770,{"$f":"IF(S12>1,+S12/V12,\"\")","v":128.33333333333334},{"$f":"IF(S12>1,SUM($R$12:S12),\" \")","v":770},{"$f":"IF(S12>0,6,0)","v":6},"Eröffnungs Doppel"]
[null,null,null,{"$f":"+'Spielbogen 10er'!K6","v":"2025-09-23"},2,{"$f":"+'Spielbogen 10er'!J6","v":"WB"},111,146,156,413,137.66666666666666,null,{"$f":"+'Anmeldegruppen Turniere'!AB11&\" - \"&W13","v":"27. / 28. 09. 2025 - 1. Antritt HH-Cup"},null,null,null,null,490,null,{"$f":"IF(R13>1,+R13/V13,\"\")","v":122.5},{"$f":"IF(R13>1,SUM($R$12:S13),\" \")","v":1260},{"$f":"IF(R13,4,0)","v":4},"1. Antritt HH-Cup"]
[null,null,null,{"$f":"+'Spielbogen 10er'!K7","v":"2025-10-07"},3,{"$f":"+'Spielbogen 10er'!J7","v":"OT"},141,140,162,443,147.66666666666666,null,{"$f":"+'Anmeldegruppen Turniere'!AB12&\" - \"&W14","v":"11. / 12. 10. 2025 - 2. Antritt HH-Cup"},null,null,null,null,582,null,{"$f":"IF(R14>1,+R14/V14,\"\")","v":145.5},{"$f":"IF(R14>1,SUM($R$12:S14),\" \")","v":1842},{"$f":"IF(R14,4,0)","v":4},"2. Antritt HH-Cup"]
[null,null,null,{"$f":"+'Spielbogen 10er'!K8","v":"2025-10-21"},4,{"$f":"+'Spielbogen 10er'!J8","v":"WB"},null,null,null,""," ",null,{"$f":"+'Hilfstabelle Mannschaften'!I11&\" - \"&W15","v":"15. / 16. 11. 2025 - Herbst-Mix"},null,null,null,null,555,null,{"$f":"IF(R15>1,+R15/V15,\"\")","v":138.75},{"$f":"IF(R15>1,SUM($R$12:S15),\" \")","v":2397},{"$f":"IF(R15,4,0)","v":4},"Herbst-Mix"]
[null,null,null,{"$f":"+'Spielbogen 10er'!K9","v":"2025-11-04"},5,{"$f":"+'Spielbogen 10er'!J9","v":"OT"},null,null,null,""," ",null,{"$f":"+'Anmeldegruppen Turniere'!AB22&\" - \"&W16","v":"17. / 18. 01. 2026 - 1. Antritt Einzel"},null,null,null,null,null,null,{"$f":"IF(S16>1,+S16/V16,\"\")","v":""},{"$f":"IF(S16>1,SUM($R$12:S16),\" \")","v":" "},{"$f":"IF(S16>0,6,0)","v":0},"1. Antritt Einzel"]
[null,null,null,{"$f":"+'Spielbogen 10er'!K10","v":"2025-11-18"},6,{"$f":"+'Spielbogen 10er'!J10","v":"WB"},null,null,null,""," ",null,{"$f":"+'Anmeldegruppen Turniere'!AB23&\" - \"&W17","v":"31. / 01. 02. 2026 - 2. Antritt Einzel"},null,null,null,null,null,null,{"$f":"IF(S17>1,+S17/V17,\"\")","v":""},{"$f":"IF(S17>1,SUM($R$12:S17),\" \")","v":" "},{"$f":"IF(S17>0,6,0)","v":0},"2. Antritt Einzel"]
[null,null,null,{"$f":"+'Spielbogen 10er'!K11","v":"2026-01-13"},7,{"$f":"+'Spielbogen 10er'!J11","v":"OT"},null,null,null,""," ",null,{"$f":"+'Hilfstabelle Mannschaften'!I12&\" - \"&W18","v":"21. / 22. 03. 2026 - Frühjahrs-Mix"},null,null,null,null,null,null,{"$f":"IF(R18>1,+R18/V18,\"\")","v":""},{"$f":"IF(R18>1,SUM($R$12:S18),\" \")","v":" "},{"$f":"IF(R18,4,0)","v":0},"Frühjahrs-Mix"]
[null,null,null,{"$f":"+'Spielbogen 10er'!K12","v":"2026-01-27"},8,{"$f":"+'Spielbogen 10er'!J12","v":"WB"},null,null,null,""," ",null,{"$f":"+'Anmeldegruppen Turniere'!AB30&\" - \"&W19","v":"25. / 26. 04. 2026 - 1. Antritt Doppel"},null,null,null,null,null,null,{"$f":"IF(S19>1,+S19/V19,\"\")","v":""},{"$f":"IF(S19>1,SUM($R$12:S19),\" \")","v":" "},{"$f":"IF(S19>0,6,0)","v":0},"1. Antritt Doppel"]
[null,null,null,{"$f":"+'Spielbogen 10er'!K13","v":"2026-02-10"},9,{"$f":"+'Spielbogen 10er'!J13","v":"OT"},null,null,null,"",{"$f":"IF(G20>1,SUM(G20:I20)/3,\" \")","v":" "},null,{"$f":"+'Anmeldegruppen Turniere'!AB31&\" - \"&W20","v":"09. / 10. 05. 2026 - 2. Antritt Doppel"},null,null,null,null,null,null,{"$f":"IF(S20>1,+S20/V20,\"\")","v":""},{"$f":"IF(S20>1,SUM($R$12:S20),\" \")","v":" "},{"$f":"IF(S20>0,6,0)","v":0},"2. Antritt Doppel"]
[null,null,null,{"$f":"+'Spielbogen 10er'!K14","v":"2026-02-24"},10,{"$f":"+'Spielbogen 10er'!J14","v":"WB"},null,null,null,"",{"$f":"IF(G21>1,SUM(G21:I21)/3,\" \")","v":" "}]
[null,null,null,{"$f":"+'Spielbogen 10er'!K15","v":"2026-03-10"},11,{"$f":"+'Spielbogen 10er'!J15","v":"OT"},null,null,null,""," ",null,"D U O"]
[null,null,null,{"$f":"+'Spielbogen 10er'!K16","v":"2026-03-24"},12,{"$f":"+'Spielbogen 10er'!J16","v":"WB"},null,null,null,""," ",null,"14.10.2025 - 1. Antritt - Otmarschen",null,null,null,null,627,null,{"$f":"IF(R23>1,+R23/V23,\"\")","v":156.75},null,{"$f":"IF(R23,4,0)","v":4}]
[null,null,null,{"$f":"+'Spielbogen 10er'!K17","v":"2026-04-07"},13,{"$f":"+'Spielbogen 10er'!J17","v":"OT"},null,null,null,""," ",null,"21.10.2025 - 2. Antritt - Otmarschen",null,null,null,null,511,null,{"$f":"IF(R24>1,+R24/V24,\"\")","v":127.75},null,{"$f":"IF(R24>0,4,0)","v":4}]
[null,null,null,{"$f":"+'Spielbogen 10er'!K18","v":"2026-04-21"},14,{"$f":"+'Spielbogen 10er'!J18","v":"WB"},null,null,null,{"$f":"IF(G25>1,+G25+H25+I25,\"\")","v":""},{"$f":"IF(G25>1,SUM(G25:I25)/3,\" \")","v":" "},null,"14.10.2025 - 3. Antritt",null,null,null,null,null,null,"",null,{"$f":"IF(R25>0,4,0)","v":0}]
[null,null,null,null,null,null,null,null,null,null,null,null,"14.10.2025 - 4. Antritt",null,null,null,null,null,null,"",null,0]
[null,null,null,null,null,null,null,null,null,null,null,null,"14.10.2025 - 5. Antritt",null,null,null,null,null,null,"",null,0]
[null,null,null,null,null,null,null,null,null,null,null,null,"14.10.2025 - 6. Antritt",null,null,null,null,null,null,"",null,0]
[null,null,null,null,null,null,null,null,null,null,null,null,"Gesamt DUO-Ergebnis",null,null,null,null,{"$f":"SUM(R23:R28)","v":1138},null,{"$f":"IF(R29>1,+R29/V29,\"\")","v":142.25},null,{"$f":"SUM(V23:V28)","v":8}]

{"sheet":"Ilona W.","index":9,"n_rows":31,"n_cols":23,"rows_kept":31,"cut":false,"hidden":false,"merged":[[26,12,26,16],[27,12,27,16],[28,12,28,16],[21,12,21,16],[22,12,22,16],[23,12,23,16],[24,12,24,16],[25,12,25,16],[1,6,1,18],[9,3,9,10],[7,3,7,5],[5,3,5,5],[6,3,6,5],[9,12,9,21],[4,16,4,21],[5,11,5,12],[6,11,6,12],[7,11,7,12],[6,16,6,17],[5,19,5,21],[7,16,7,17],[7,19,7,20],[6,19,6,20],[4,9,4,14],[32,14,32,16],[33,14,33,16],[34,14,34,16],[2,9,2,13],[4,4,4,5],[2,3,2,7],[5,16,5,18],[10,12,10,16],[11,12,11,16],[12,12,12,16],[13,12,13,16],[14,12,14,16],[15,12,15,16],[16,12,16,16],[17,12,17,16],[18,12,18,16],[19,12,19,16],[17,22,17,23],[18,22,18,23],[19,22,19,23],[12,22,12,23],[13,22,13,23],[14,22,14,23],[15,22,15,23],[16,22,16,23]]}
[null,"Start"]
[null,"Rangliste",null,null,null,null,{"$f":"+'Hilfstabelle Mannschaften'!H6&\" \"&+'Hilfstabelle Mannschaften'!I6","v":"PUNKTSPIELSAISON  2025/2026"}]
[null,null,null,{"$f":"+'Hilfstabelle Spieler'!A9","v":"Ilona Wetzel"}]
[]
[null,null,null,"Pass.-Nr.:",{"$f":"VLOOKUP(D3,'Hilfstabelle Spieler'!A6:B19,2,0)","v":22115},null,"Pins","Spiele","Schnitt","Ligaergebnisse",null,null,null,null,null,null,"Sonstige Antritte:"]
[null,null,null,"Ligaergebnisse:",null,null,{"$f":"IF(SUM(J12:J25)>1,SUM(J12:J25),\" \")","v":1319},{"$f":"COUNT(G12:I25)","v":9},{"$f":"IF(SUM(G12:I25)>1,SUM(G6/H6),\" \")","v":146.55555555555554},"MAX.","MIN.","MAX.",null,"MIN.","Schnitt",null,"4.er Serie:",null,null,"6.er Serie:"]
[null,null,null,"Sonstige Antritte:",null,null,{"$f":"IF(SUM(R12:S28)>1,SUM(R12:S28),\" \")","v":2733},{"$f":"IF(SUM(R12:S28)>1,SUM(V12:V28),\" \")","v":18},{"$f":"IF(SUM(R12:S28)>1,G7/H7,\" \")","v":151.83333333333334},"ERG.","ERG.","3.ER",null,"3.ER","3.ER",null,"Höchstes 4.er Erg. :",null,{"$f":"MAX(R13:R18,R23:R28)","v":646},"Höchstes 6.er Erg. :",null,{"$f":"MAX(S12:S20)","v":876}]
[null,null,null,"GESAMTSCHNITT:",null,null,{"$f":"IF(SUM(G6:G7)>1,SUM(G6:G7),\" \")","v":4052},{"$f":"IF(SUM(H6:H7)>1,SUM(H6:H7),\" \")","v":27},{"$f":"IF(SUM(G8)>1,SUM(G8/H8),\" \")","v":150.07407407407408},{"$f":"MAX(G12:I25)","v":185},{"$f":"IF(SUM(G12:I25)<1,\" \",MIN(G12:I25))","v":118},{"$f":"MAX(J12:J25)","v":475},null,{"$f":"IF(SUM(G12:J25)>1,MIN(J12:J25),\" \")","v":420},{"$f":"IF(J8>0,AVERAGE(J12:J25),\"\")","v":439.66666666666669},null,"Höchste Einzel-Erg. :",null,177,"Höchste Einzel-Erg. :",null,178]
[]
[null,null,null,"         Einzelspielergebnisse Liga",null,null,null,null,null,null,null,null,"Sonstige Antritte"]
[null,null,null," Datum","Antr.","Bahn","1. Spiel","2. Spiel","3. Spiel","3. er Serie","3. er Ø",null," Datum - Turnier",null,null,null,null,"4.er Erg.","6.er Erg.","Schnitt","Ges. Pins","Spiele"]
[null,null,null,{"$f":"+'Spielbogen 10er'!K5","v":"2025-09-09"},1,{"$f":"+'Spielbogen 10er'!J5","v":"OT"},128,130,162,{"$f":"IF(G12>1,+G12+H12+I12,\"\")","v":420},{"$f":"IF(G12>1,SUM(G12:I12)/3,\" \")","v":140},null,{"$f":"+'Anmeldegruppen Turniere'!AB8&\" - \"&W12","v":"13. / 14. 09. 2025 - Eröffnungs Doppel"},null,null,null,null,null,876,{"$f":"IF(S12>1,+S12/V12,\"\")","v":146},{"$f":"IF(S12>1,SUM($R$12:S12),\" \")","v":876},{"$f":"IF(S12>0,6,0)","v":6},"Eröffnungs Doppel"]
[null,null,null,{"$f":"+'Spielbogen 10er'!K6","v":"2025-09-23"},2,{"$f":"+'Spielbogen 10er'!J6","v":"WB"},null,null,null,""," ",null,{"$f":"+'Anmeldegruppen Turniere'!AB11&\" - \"&W13","v":"27. / 28. 09. 2025 - 1. Antritt HH-Cup"},null,null,null,null,null,null,{"$f":"IF(R13>1,+R13/V13,\"\")","v":""},{"$f":"IF(R13>1,SUM($R$12:S13),\" \")","v":" "},{"$f":"IF(R13,4,0)","v":0},"1. Antritt HH-Cup"]
[null,null,null,{"$f":"+'Spielbogen 10er'!K7","v":"2025-10-07"},3,{"$f":"+'Spielbogen 10er'!J7","v":"OT"},171,135,118,424,141.33333333333334,null,{"$f":"+'Anmeldegruppen Turniere'!AB12&\" - \"&W14","v":"11. / 12. 10. 2025 - 2. Antritt HH-Cup"},null,null,null,null,null,null,{"$f":"IF(R14>1,+R14/V14,\"\")","v":""},{"$f":"IF(R14>1,SUM($R$12:S14),\" \")","v":" "},{"$f":"IF(R14,4,0)","v":0},"2. Antritt HH-Cup"]
[null,null,null,{"$f":"+'Spielbogen 10er'!K8","v":"2025-10-21"},4,{"$f":"+'Spielbogen 10er'!J8","v":"WB"},null,null,null,""," ",null,{"$f":"+'Hilfstabelle Mannschaften'!I11&\" - \"&W15","v":"15. / 16. 11. 2025 - Herbst-Mix"},null,null,null,null,582,null,{"$f":"IF(R15>1,+R15/V15,\"\")","v":145.5},{"$f":"IF(R15>1,SUM($R$12:S15),\" \")","v":1458},{"$f":"IF(R15,4,0)","v":4},"Herbst-Mix"]
[null,null,null,{"$f":"+'Spielbogen 10er'!K9","v":"2025-11-04"},5,{"$f":"+'Spielbogen 10er'!J9","v":"OT"},132,185,158,475,158.33333333333334,null,{"$f":"+'Anmeldegruppen Turniere'!AB22&\" - \"&W16","v":"17. / 18. 01. 2026 - 1. Antritt Einzel"},null,null,null,null,null,null,{"$f":"IF(S16>1,+S16/V16,\"\")","v":""},{"$f":"IF(S16>1,SUM($R$12:S16),\" \")","v":" "},{"$f":"IF(S16>0,6,0)","v":0},"1. Antritt Einzel"]
[null,null,null,{"$f":"+'Spielbogen 10er'!K10","v":"2025-11-18"},6,{"$f":"+'Spielbogen 10er'!J10","v":"WB"},null,null,null,""," ",null,{"$f":"+'Anmeldegruppen Turniere'!AB23&\" - \"&W17","v":"31. / 01. 02. 2026 - 2. Antritt Einzel"},null,null,null,null,null,null,{"$f":"IF(S17>1,+S17/V17,\"\")","v":""},{"$f":"IF(S17>1,SUM($R$12:S17),\" \")","v":" "},{"$f":"IF(S17>0,6,0)","v":0},"2. Antritt Einzel"]
[null,null,null,{"$f":"+'Spielbogen 10er'!K11","v":"2026-01-13"},7,{"$f":"+'Spielbogen 10er'!J11","v":"OT"},null,null,null,""," ",null,{"$f":"+'Hilfstabelle Mannschaften'!I12&\" - \"&W18","v":"21. / 22. 03. 2026 - Frühjahrs-Mix"},null,null,null,null,null,null,{"$f":"IF(R18>1,+R18/V18,\"\")","v":""},{"$f":"IF(R18>1,SUM($R$12:S18),\" \")","v":" "},{"$f":"IF(R18,4,0)","v":0},"Frühjahrs-Mix"]
[null,null,null,{"$f":"+'Spielbogen 10er'!K12","v":"2026-01-27"},8,{"$f":"+'Spielbogen 10er'!J12","v":"WB"},null,null,null,""," ",null,{"$f":"+'Anmeldegruppen Turniere'!AB30&\" - \"&W19","v":"25. / 26. 04. 2026 - 1. Antritt Doppel"},null,null,null,null,null,null,{"$f":"IF(S19>1,+S19/V19,\"\")","v":""},{"$f":"IF(S19>1,SUM($R$12:S19),\" \")","v":" "},{"$f":"IF(S19>0,6,0)","v":0},"1. Antritt Doppel"]
[null,null,null,{"$f":"+'Spielbogen 10er'!K13","v":"2026-02-10"},9,{"$f":"+'Spielbogen 10er'!J13","v":"OT"},null,null,null,"",{"$f":"IF(G20>1,SUM(G20:I20)/3,\" \")","v":" "},null,{"$f":"+'Anmeldegruppen Turniere'!AB31&\" - \"&W20","v":"09. / 10. 05. 2026 - 2. Antritt Doppel"},null,null,null,null,null,null,{"$f":"IF(S20>1,+S20/V20,\"\")","v":""},{"$f":"IF(S20>1,SUM($R$12:S20),\" \")","v":" "},{"$f":"IF(S20>0,6,0)","v":0},"2. Antritt Doppel"]
[null,null,null,{"$f":"+'Spielbogen 10er'!K14","v":"2026-02-24"},10,{"$f":"+'Spielbogen 10er'!J14","v":"WB"},null,null,null,"",{"$f":"IF(G21>1,SUM(G21:I21)/3,\" \")","v":" "}]
[null,null,null,{"$f":"+'Spielbogen 10er'!K15","v":"2026-03-10"},11,{"$f":"+'Spielbogen 10er'!J15","v":"OT"},null,null,null,""," ",null,"D U O"]
[null,null,null,{"$f":"+'Spielbogen 10er'!K16","v":"2026-03-24"},12,{"$f":"+'Spielbogen 10er'!J16","v":"WB"},null,null,null,""," ",null,"14.10.2025 - 1. Antritt - Otmarschen",null,null,null,null,629,null,{"$f":"IF(R23>1,+R23/V23,\"\")","v":157.25},null,{"$f":"IF(R23,4,0)","v":4}]
[null,null,null,{"$f":"+'Spielbogen 10er'!K17","v":"2026-04-07"},13,{"$f":"+'Spielbogen 10er'!J17","v":"OT"},null,null,null,""," ",null,"14.10.2025 - 2. Antritt",null,null,null,null,646,null,{"$f":"IF(R24>1,+R24/V24,\"\")","v":161.5},null,{"$f":"IF(R24>0,4,0)","v":4}]
[null,null,null,{"$f":"+'Spielbogen 10er'!K18","v":"2026-04-21"},14,{"$f":"+'Spielbogen 10er'!J18","v":"WB"},null,null,null,{"$f":"IF(G25>1,+G25+H25+I25,\"\")","v":""},{"$f":"IF(G25>1,SUM(G25:I25)/3,\" \")","v":" "},null,"14.10.2025 - 3. Antritt",null,null,null,null,null,null,"",null,{"$f":"IF(R25>0,4,0)","v":0}]
[null,null,null,{"$f":"+\"Ausgeholfen in der 1. Mannschaft                                                     Anzahl Spiele:\"&\" \"&+COUNT(G27:I30)","v":"Ausgeholfen in der 1. Mannschaft                                                     Anzahl Spiele: 0"},null,null,null,null,null,null,null,null,"14.10.2025 - 4. Antritt",null,null,null,null,null,null,"",null,0]
[null,null,null,null,null,null,null,null,null,{"$f":"IF(G27>1,+G27+H27+I27,\"\")","v":""},null,null,"14.10.2025 - 5. Antritt",null,null,null,null,null,null,"",null,0]
[null,null,null,null,null,null,null,null,null,{"$f":"IF(G28>1,+G28+H28+I28,\"\")","v":""},{"$f":"IF(G28>1,SUM(G28:I28)/3,\" \")","v":" "},null,"14.10.2025 - 6. Antritt",null,null,null,null,null,null,"",null,0]
[null,null,null,null,null,null,null,null,null,{"$f":"IF(G29>1,+G29+H29+I29,\"\")","v":""},{"$f":"IF(G29>1,SUM(G29:I29)/3,\" \")","v":" "},null,"Gesamt DUO-Ergebnis",null,null,null,null,{"$f":"SUM(R23:R28)","v":1275},null,{"$f":"IF(R29>1,+R29/V29,\"\")","v":159.375},null,{"$f":"SUM(V23:V28)","v":8}]
[null,null,null,null,null,null,null,null,null,{"$f":"IF(G30>1,+G30+H30+I30,\"\")","v":""},{"$f":"IF(G30>1,SUM(G30:I30)/3,\" \")","v":" "}]
[null,null,null,null,null,null,null,null,null,{"$f":"IF(G31>1,+G31+H31+I31,\"\")","v":""},{"$f":"IF(G31>1,SUM(G31:I31)/3,\" \")","v":" "}]

{"sheet":"Michael W.","index":10,"n_rows":25,"n_cols":23,"rows_kept":25,"cut":false,"hidden":false,"merged":[[5,16,5,18],[15,12,15,16],[16,12,16,16],[17,12,17,16],[1,6,1,18],[6,16,6,17],[9,3,9,10],[7,3,7,5],[5,3,5,5],[6,3,6,5],[5,11,5,12],[4,9,4,14],[2,3,2,7],[22,14,22,16],[23,14,23,16],[24,14,24,16],[2,9,2,13],[4,4,4,5],[6,11,6,12],[7,11,7,12],[9,12,9,21],[4,16,4,21],[6,19,6,20],[5,19,5,21],[7,16,7,17],[7,19,7,20],[10,12,10,16],[11,12,11,16],[12,12,12,16],[18,12,18,16],[19,12,19,16],[12,22,12,23],[13,22,13,23],[14,22,14,23],[15,22,15,23],[16,22,16,23],[17,22,17,23],[18,22,18,23],[19,22,19,23],[13,12,13,16],[14,12,14,16]]}
[null,"Start"]
[null,"Rangliste",null,null,null,null,{"$f":"+'Hilfstabelle Mannschaften'!H6&\" \"&+'Hilfstabelle Mannschaften'!I6","v":"PUNKTSPIELSAISON  2025/2026"}]
[null,null,null,{"$f":"+'Hilfstabelle Spieler'!A14","v":"Michael Wetzel"}]
[]
[null,null,null,"Pass.-Nr.:",{"$f":"VLOOKUP(D3,'Hilfstabelle Spieler'!A6:B19,2,0)","v":22113},null,"Pins","Spiele","Schnitt","Ligaergebnisse",null,null,null,null,null,null,"Sonstige Antritte:"]
[null,null,null,"Ligaergebnisse:",null,null,{"$f":"IF(SUM(J12:J25)>1,SUM(J12:J25),\" \")","v":1012},{"$f":"COUNT(G12:I25)","v":6},{"$f":"IF(SUM(G12:I25)>1,SUM(G6/H6),\" \")","v":168.66666666666666},"MAX.","MIN.","MAX.",null,"MIN.","Schnitt",null,"4.er Serie:",null,null,"6.er Serie:"]
[null,null,null,"Sonstige Antritte:",null,null,{"$f":"IF(SUM(R12:S20)>1,SUM(R12:S20),\" \")","v":1752},{"$f":"IF(SUM(R12:S20)>1,SUM(V12:V20),\" \")","v":10},{"$f":"IF(SUM(R12:S20)>1,G7/H7,\" \")","v":175.2},"ERG.","ERG.","3.ER",null,"3.ER","3.ER",null,"Höchstes 4.er Erg. :",null,{"$f":"MAX(R13:R18)","v":722},"Höchstes 6.er Erg. :",null,{"$f":"MAX(S12:S20)","v":1030}]
[null,null,null,"GESAMTSCHNITT:",null,null,{"$f":"IF(SUM(G6:G7)>1,SUM(G6:G7),\" \")","v":2764},{"$f":"IF(SUM(H6:H7)>1,SUM(H6:H7),\" \")","v":16},{"$f":"IF(SUM(G8)>1,SUM(G8/H8),\" \")","v":172.75},{"$f":"MAX(G12:I25)","v":199},{"$f":"IF(SUM(G12:I25)<1,\" \",MIN(G12:I25))","v":148},{"$f":"MAX(J12:J25)","v":524},null,{"$f":"IF(SUM(G12:J25)>1,MIN(J12:J25),\" \")","v":488},{"$f":"IF(J8>0,AVERAGE(J12:J25),\"\")","v":506},null,"Höchste Einzel-Erg. :",null,220,"Höchste Einzel-Erg. :",null,203]
[]
[null,null,null,"         Einzelspielergebnisse Liga",null,null,null,null,null,null,null,null,"Sonstige Antritte"]
[null,null,null," Datum","Antr.","Bahn","1. Spiel","2. Spiel","3. Spiel","3. er Serie","3. er Ø",null," Datum - Turnier",null,null,null,null,"4.er Erg.","6.er Erg.","Schnitt","Ges. Pins","Spiele"]
[null,null,null,{"$f":"+'Spielbogen 10er'!K5","v":"2025-09-09"},1,{"$f":"+'Spielbogen 10er'!J5","v":"OT"},168,157,199,{"$f":"IF(G12>1,+G12+H12+I12,\"\")","v":524},{"$f":"IF(G12>1,SUM(G12:I12)/3,\" \")","v":174.66666666666666},null,{"$f":"+'Anmeldegruppen Turniere'!AB8&\" - \"&W12","v":"13. / 14. 09. 2025 - Eröffnungs Doppel"},null,null,null,null,null,1030,{"$f":"IF(S12>1,+S12/V12,\"\")","v":171.66666666666666},{"$f":"IF(S12>1,SUM($R$12:S12),\" \")","v":1030},{"$f":"IF(S12>0,6,0)","v":6},"Eröffnungs Doppel"]
[null,null,null,{"$f":"+'Spielbogen 10er'!K6","v":"2025-09-23"},2,{"$f":"+'Spielbogen 10er'!J6","v":"WB"},null,null,null,""," ",null,{"$f":"+'Anmeldegruppen Turniere'!AB11&\" - \"&W13","v":"27. / 28. 09. 2025 - 1. Antritt HH-Cup"},null,null,null,null,null,null,{"$f":"IF(R13>1,+R13/V13,\"\")","v":""},{"$f":"IF(R13>1,SUM($R$12:S13),\" \")","v":" "},{"$f":"IF(R13,4,0)","v":0},"1. Antritt HH-Cup"]
[null,null,null,{"$f":"+'Spielbogen 10er'!K7","v":"2025-10-07"},3,{"$f":"+'Spielbogen 10er'!J7","v":"OT"},null,null,null,""," ",null,{"$f":"+'Anmeldegruppen Turniere'!AB12&\" - \"&W14","v":"11. / 12. 10. 2025 - 2. Antritt HH-Cup"},null,null,null,null,null,null,{"$f":"IF(R14>1,+R14/V14,\"\")","v":""},{"$f":"IF(R14>1,SUM($R$12:S14),\" \")","v":" "},{"$f":"IF(R14,4,0)","v":0},"2. Antritt HH-Cup"]
[null,null,null,{"$f":"+'Spielbogen 10er'!K8","v":"2025-10-21"},4,{"$f":"+'Spielbogen 10er'!J8","v":"WB"},148,148,192,488,162.66666666666666,null,{"$f":"+'Hilfstabelle Mannschaften'!I11&\" - \"&W15","v":"15. / 16. 11. 2025 - Herbst-Mix"},null,null,null,null,722,null,{"$f":"IF(R15>1,+R15/V15,\"\")","v":180.5},{"$f":"IF(R15>1,SUM($R$12:S15),\" \")","v":1752},{"$f":"IF(R15,4,0)","v":4},"Herbst-Mix"]
[null,null,null,{"$f":"+'Spielbogen 10er'!K9","v":"2025-11-04"},5,{"$f":"+'Spielbogen 10er'!J9","v":"OT"},null,null,null,""," ",null,{"$f":"+'Anmeldegruppen Turniere'!AB22&\" - \"&W16","v":"17. / 18. 01. 2026 - 1. Antritt Einzel"},null,null,null,null,null,null,{"$f":"IF(S16>1,+S16/V16,\"\")","v":""},{"$f":"IF(S16>1,SUM($R$12:S16),\" \")","v":" "},{"$f":"IF(S16>0,6,0)","v":0},"1. Antritt Einzel"]
[null,null,null,{"$f":"+'Spielbogen 10er'!K10","v":"2025-11-18"},6,{"$f":"+'Spielbogen 10er'!J10","v":"WB"},null,null,null,""," ",null,{"$f":"+'Anmeldegruppen Turniere'!AB23&\" - \"&W17","v":"31. / 01. 02. 2026 - 2. Antritt Einzel"},null,null,null,null,null,null,{"$f":"IF(S17>1,+S17/V17,\"\")","v":""},{"$f":"IF(S17>1,SUM($R$12:S17),\" \")","v":" "},{"$f":"IF(S17>0,6,0)","v":0},"2. Antritt Einzel"]
[null,null,null,{"$f":"+'Spielbogen 10er'!K11","v":"2026-01-13"},7,{"$f":"+'Spielbogen 10er'!J11","v":"OT"},null,null,null,""," ",null,{"$f":"+'Hilfstabelle Mannschaften'!I12&\" - \"&W18","v":"21. / 22. 03. 2026 - Frühjahrs-Mix"},null,null,null,null,null,null,{"$f":"IF(R18>1,+R18/V18,\"\")","v":""},{"$f":"IF(R18>1,SUM($R$12:S18),\" \")","v":" "},{"$f":"IF(R18,4,0)","v":0},"Frühjahrs-Mix"]
[null,null,null,{"$f":"+'Spielbogen 10er'!K12","v":"2026-01-27"},8,{"$f":"+'Spielbogen 10er'!J12","v":"WB"},null,null,null,""," ",null,{"$f":"+'Anmeldegruppen Turniere'!AB30&\" - \"&W19","v":"25. / 26. 04. 2026 - 1. Antritt Doppel"},null,null,null,null,null,null,{"$f":"IF(S19>1,+S19/V19,\"\")","v":""},{"$f":"IF(S19>1,SUM($R$12:S19),\" \")","v":" "},{"$f":"IF(S19>0,6,0)","v":0},"1. Antritt Doppel"]
[null,null,null,{"$f":"+'Spielbogen 10er'!K13","v":"2026-02-10"},9,{"$f":"+'Spielbogen 10er'!J13","v":"OT"},null,null,null,"",{"$f":"IF(G20>1,SUM(G20:I20)/3,\" \")","v":" "},null,{"$f":"+'Anmeldegruppen Turniere'!AB31&\" - \"&W20","v":"09. / 10. 05. 2026 - 2. Antritt Doppel"},null,null,null,null,null,null,{"$f":"IF(S20>1,+S20/V20,\"\")","v":""},{"$f":"IF(S20>1,SUM($R$12:S20),\" \")","v":" "},{"$f":"IF(S20>0,6,0)","v":0},"2. Antritt Doppel"]
[null,null,null,{"$f":"+'Spielbogen 10er'!K14","v":"2026-02-24"},10,{"$f":"+'Spielbogen 10er'!J14","v":"WB"},null,null,null,"",{"$f":"IF(G21>1,SUM(G21:I21)/3,\" \")","v":" "}]
[null,null,null,{"$f":"+'Spielbogen 10er'!K15","v":"2026-03-10"},11,{"$f":"+'Spielbogen 10er'!J15","v":"OT"},null,null,null,""," "]
[null,null,null,{"$f":"+'Spielbogen 10er'!K16","v":"2026-03-24"},12,{"$f":"+'Spielbogen 10er'!J16","v":"WB"},null,null,null,""," "]
[null,null,null,{"$f":"+'Spielbogen 10er'!K17","v":"2026-04-07"},13,{"$f":"+'Spielbogen 10er'!J17","v":"OT"},null,null,null,""," "]
[null,null,null,{"$f":"+'Spielbogen 10er'!K18","v":"2026-04-21"},14,{"$f":"+'Spielbogen 10er'!J18","v":"WB"},null,null,null,{"$f":"IF(G25>1,+G25+H25+I25,\"\")","v":""},{"$f":"IF(G25>1,SUM(G25:I25)/3,\" \")","v":" "}]

{"sheet":"Mario J.","index":11,"n_rows":25,"n_cols":23,"rows_kept":25,"cut":false,"hidden":false,"merged":[[1,6,1,18],[9,3,9,10],[7,3,7,5],[5,3,5,5],[6,3,6,5],[9,12,9,21],[4,16,4,21],[5,11,5,12],[6,11,6,12],[7,11,7,12],[6,16,6,17],[5,19,5,21],[7,16,7,17],[7,19,7,20],[6,19,6,20],[4,9,4,14],[22,14,22,16],[23,14,23,16],[24,14,24,16],[2,9,2,13],[4,4,4,5],[2,3,2,7],[5,16,5,18],[10,12,10,16],[11,12,11,16],[12,12,12,16],[13,12,13,16],[14,12,14,16],[15,12,15,16],[16,12,16,16],[17,12,17,16],[18,12,18,16],[19,12,19,16],[17,22,17,23],[18,22,18,23],[19,22,19,23],[12,22,12,23],[13,22,13,23],[14,22,14,23],[15,22,15,23],[16,22,16,23]]}
[null,"Start"]
[null,"Rangliste",null,null,null,null,{"$f":"+'Hilfstabelle Mannschaften'!H6&\" \"&+'Hilfstabelle Mannschaften'!I6","v":"PUNKTSPIELSAISON  2025/2026"}]
[null,null,null,{"$f":"+'Hilfstabelle Spieler'!A12","v":"Mario Jurk"}]
[]
[null,null,null,"Pass.-Nr.:",{"$f":"VLOOKUP(D3,'Hilfstabelle Spieler'!A6:B19,2,0)","v":23302},null,"Pins","Spiele","Schnitt","Ligaergebnisse",null,null,null,null,null,null,"Sonstige Antritte:"]
[null,null,null,"Ligaergebnisse:",null,null,{"$f":"IF(SUM(J12:J25)>1,SUM(J12:J25),\" \")","v":1167},{"$f":"COUNT(G12:I25)","v":6},{"$f":"IF(SUM(G12:I25)>1,SUM(G6/H6),\" \")","v":194.5},"MAX.","MIN.","MAX.",null,"MIN.","Schnitt",null,"4.er Serie:",null,null,"6.er Serie:"]
[null,null,null,"Sonstige Antritte:",null,null,{"$f":"IF(SUM(R12:S20)>1,SUM(R12:S20),\" \")","v":" "},{"$f":"IF(SUM(R12:S20)>1,SUM(V12:V20),\" \")","v":" "},{"$f":"IF(SUM(R12:S20)>1,G7/H7,\" \")","v":" "},"ERG.","ERG.","3.ER",null,"3.ER","3.ER",null,"Höchstes 4.er Erg. :",null,{"$f":"MAX(R13:R18)","v":0},"Höchstes 6.er Erg. :"]
[null,null,null,"GESAMTSCHNITT:",null,null,{"$f":"IF(SUM(G6:G7)>1,SUM(G6:G7),\" \")","v":1167},{"$f":"IF(SUM(H6:H7)>1,SUM(H6:H7),\" \")","v":6},{"$f":"IF(SUM(G8)>1,SUM(G8/H8),\" \")","v":194.5},{"$f":"MAX(G12:I25)","v":224},{"$f":"IF(SUM(G12:I25)<1,\" \",MIN(G12:I25))","v":163},{"$f":"MAX(J12:J25)","v":628},null,{"$f":"IF(SUM(G12:J25)>1,MIN(J12:J25),\" \")","v":539},{"$f":"IF(J8>0,AVERAGE(J12:J25),\"\")","v":583.5},null,"Höchste Einzel-Erg. :",null,null,"Höchste Einzel-Erg. :"]
[]
[null,null,null,"         Einzelspielergebnisse Liga",null,null,null,null,null,null,null,null,"Sonstige Antritte"]
[null,null,null," Datum","Antr.","Bahn","1. Spiel","2. Spiel","3. Spiel","3. er Serie","3. er Ø",null," Datum - Turnier",null,null,null,null,"4.er Erg.","6.er Erg.","Schnitt","Ges. Pins","Spiele"]
[null,null,null,{"$f":"+'Spielbogen 10er'!K5","v":"2025-09-09"},1,{"$f":"+'Spielbogen 10er'!J5","v":"OT"},null,null,null,{"$f":"IF(G12>1,+G12+H12+I12,\"\")","v":""},{"$f":"IF(G12>1,SUM(G12:I12)/3,\" \")","v":" "},null,{"$f":"+'Anmeldegruppen Turniere'!AB8&\" - \"&W12","v":"13. / 14. 09. 2025 - Eröffnungs Doppel"},null,null,null,null,null,null,{"$f":"IF(S12>1,+S12/V12,\"\")","v":""},{"$f":"IF(S12>1,SUM($R$12:S12),\" \")","v":" "},{"$f":"IF(S12>0,6,0)","v":0},"Eröffnungs Doppel"]
[null,null,null,{"$f":"+'Spielbogen 10er'!K6","v":"2025-09-23"},2,{"$f":"+'Spielbogen 10er'!J6","v":"WB"},null,null,null,""," ",null,{"$f":"+'Anmeldegruppen Turniere'!AB11&\" - \"&W13","v":"27. / 28. 09. 2025 - 1. Antritt HH-Cup"},null,null,null,null,null,null,{"$f":"IF(R13>1,+R13/V13,\"\")","v":""},{"$f":"IF(R13>1,SUM($R$12:S13),\" \")","v":" "},{"$f":"IF(R13,4,0)","v":0},"1. Antritt HH-Cup"]
[null,null,null,{"$f":"+'Spielbogen 10er'!K7","v":"2025-10-07"},3,{"$f":"+'Spielbogen 10er'!J7","v":"OT"},null,null,null,""," ",null,{"$f":"+'Anmeldegruppen Turniere'!AB12&\" - \"&W14","v":"11. / 12. 10. 2025 - 2. Antritt HH-Cup"},null,null,null,null,null,null,{"$f":"IF(R14>1,+R14/V14,\"\")","v":""},{"$f":"IF(R14>1,SUM($R$12:S14),\" \")","v":" "},{"$f":"IF(R14,4,0)","v":0},"2. Antritt HH-Cup"]
[null,null,null,{"$f":"+'Spielbogen 10er'!K8","v":"2025-10-21"},4,{"$f":"+'Spielbogen 10er'!J8","v":"WB"},214,190,224,628,209.33333333333334,null,{"$f":"+'Hilfstabelle Mannschaften'!I11&\" - \"&W15","v":"15. / 16. 11. 2025 - Herbst-Mix"},null,null,null,null,null,null,{"$f":"IF(R15>1,+R15/V15,\"\")","v":""},{"$f":"IF(R15>1,SUM($R$12:S15),\" \")","v":" "},{"$f":"IF(R15,4,0)","v":0},"Herbst-Mix"]
[null,null,null,{"$f":"+'Spielbogen 10er'!K9","v":"2025-11-04"},5,{"$f":"+'Spielbogen 10er'!J9","v":"OT"},188,163,188,539,179.66666666666666,null,{"$f":"+'Anmeldegruppen Turniere'!AB22&\" - \"&W16","v":"17. / 18. 01. 2026 - 1. Antritt Einzel"},null,null,null,null,null,null,{"$f":"IF(S16>1,+S16/V16,\"\")","v":""},{"$f":"IF(S16>1,SUM($R$12:S16),\" \")","v":" "},{"$f":"IF(S16>0,6,0)","v":0},"1. Antritt Einzel"]
[null,null,null,{"$f":"+'Spielbogen 10er'!K10","v":"2025-11-18"},6,{"$f":"+'Spielbogen 10er'!J10","v":"WB"},null,null,null,""," ",null,{"$f":"+'Anmeldegruppen Turniere'!AB23&\" - \"&W17","v":"31. / 01. 02. 2026 - 2. Antritt Einzel"},null,null,null,null,null,null,{"$f":"IF(S17>1,+S17/V17,\"\")","v":""},{"$f":"IF(S17>1,SUM($R$12:S17),\" \")","v":" "},{"$f":"IF(S17>0,6,0)","v":0},"2. Antritt Einzel"]
[null,null,null,{"$f":"+'Spielbogen 10er'!K11","v":"2026-01-13"},7,{"$f":"+'Spielbogen 10er'!J11","v":"OT"},null,null,null,""," ",null,{"$f":"+'Hilfstabelle Mannschaften'!I12&\" - \"&W18","v":"21. / 22. 03. 2026 - Frühjahrs-Mix"},null,null,null,null,null,null,{"$f":"IF(R18>1,+R18/V18,\"\")","v":""},{"$f":"IF(R18>1,SUM($R$12:S18),\" \")","v":" "},{"$f":"IF(R18,4,0)","v":0},"Frühjahrs-Mix"]
[null,null,null,{"$f":"+'Spielbogen 10er'!K12","v":"2026-01-27"},8,{"$f":"+'Spielbogen 10er'!J12","v":"WB"},null,null,null,""," ",null,{"$f":"+'Anmeldegruppen Turniere'!AB30&\" - \"&W19","v":"25. / 26. 04. 2026 - 1. Antritt Doppel"},null,null,null,null,null,null,{"$f":"IF(S19>1,+S19/V19,\"\")","v":""},{"$f":"IF(S19>1,SUM($R$12:S19),\" \")","v":" "},{"$f":"IF(S19>0,6,0)","v":0},"1. Antritt Doppel"]
[null,null,null,{"$f":"+'Spielbogen 10er'!K13","v":"2026-02-10"},9,{"$f":"+'Spielbogen 10er'!J13","v":"OT"},null,null,null,"",{"$f":"IF(G20>1,SUM(G20:I20)/3,\" \")","v":" "},null,{"$f":"+'Anmeldegruppen Turniere'!AB31&\" - \"&W20","v":"09. / 10. 05. 2026 - 2. Antritt Doppel"},null,null,null,null,null,null,{"$f":"IF(S20>1,+S20/V20,\"\")","v":""},{"$f":"IF(S20>1,SUM($R$12:S20),\" \")","v":" "},{"$f":"IF(S20>0,6,0)","v":0},"2. Antritt Doppel"]
[null,null,null,{"$f":"+'Spielbogen 10er'!K14","v":"2026-02-24"},10,{"$f":"+'Spielbogen 10er'!J14","v":"WB"},null,null,null,"",{"$f":"IF(G21>1,SUM(G21:I21)/3,\" \")","v":" "}]
[null,null,null,{"$f":"+'Spielbogen 10er'!K15","v":"2026-03-10"},11,{"$f":"+'Spielbogen 10er'!J15","v":"OT"},null,null,null,""," "]
[null,null,null,{"$f":"+'Spielbogen 10er'!K16","v":"2026-03-24"},12,{"$f":"+'Spielbogen 10er'!J16","v":"WB"},null,null,null,""," "]
[null,null,null,{"$f":"+'Spielbogen 10er'!K17","v":"2026-04-07"},13,{"$f":"+'Spielbogen 10er'!J17","v":"OT"},null,null,null,""," "]
[null,null,null,{"$f":"+'Spielbogen 10er'!K18","v":"2026-04-21"},14,{"$f":"+'Spielbogen 10er'!J18","v":"WB"},null,null,null,""," "]

{"sheet":"Kai R.","index":12,"n_rows":25,"n_cols":23,"rows_kept":25,"cut":false,"hidden":false,"merged":[[1,6,1,18],[9,3,9,10],[7,3,7,5],[5,3,5,5],[6,3,6,5],[9,12,9,21],[4,16,4,21],[5,11,5,12],[6,11,6,12],[7,11,7,12],[6,16,6,17],[5,19,5,21],[7,16,7,17],[7,19,7,20],[6,19,6,20],[4,9,4,14],[22,14,22,16],[23,14,23,16],[24,14,24,16],[2,9,2,13],[4,4,4,5],[2,3,2,7],[5,16,5,18],[10,12,10,16],[11,12,11,16],[12,12,12,16],[13,12,13,16],[14,12,14,16],[15,12,15,16],[16,12,16,16],[17,12,17,16],[18,12,18,16],[19,12,19,16],[17,22,17,23],[18,22,18,23],[19,22,19,23],[12,22,12,23],[13,22,13,23],[14,22,14,23],[15,22,15,23],[16,22,16,23]]}
[null,"Start"]
[null,"Rangliste",null,null,null,null,{"$f":"+'Hilfstabelle Mannschaften'!H6&\" \"&+'Hilfstabelle Mannschaften'!I6","v":"PUNKTSPIELSAISON  2025/2026"}]
[null,null,null,{"$f":"+'Hilfstabelle Spieler'!A11","v":"Kai Roßberg"}]
[]
[null,null,null,"Pass.-Nr.:",{"$f":"VLOOKUP(D3,'Hilfstabelle Spieler'!A6:B19,2,0)","v":21889},null,"Pins","Spiele","Schnitt","Ligaergebnisse",null,null,null,null,null,null,"Sonstige Antritte:"]
[null,null,null,"Ligaergebnisse:",null,null,{"$f":"IF(SUM(J12:J25)>1,SUM(J12:J25),\" \")","v":2116},{"$f":"COUNT(G12:I25)","v":12},{"$f":"IF(SUM(G12:I25)>1,SUM(G6/H6),\" \")","v":176.33333333333334},"MAX.","MIN.","MAX.",null,"MIN.","Schnitt",null,"4.er Serie:",null,null,"6.er Serie:"]
[null,null,null,"Sonstige Antritte:",null,null,{"$f":"IF(SUM(R12:S20)>1,SUM(R12:S20),\" \")","v":" "},{"$f":"IF(SUM(R12:S20)>1,SUM(V12:V20),\" \")","v":" "},{"$f":"IF(SUM(R12:S20)>1,G7/H7,\" \")","v":" "},"ERG.","ERG.","3.ER",null,"3.ER","3.ER",null,"Höchstes 4.er Erg. :",null,{"$f":"MAX(R13:R18)","v":0},"Höchstes 6.er Erg. :"]
[null,null,null,"GESAMTSCHNITT:",null,null,{"$f":"IF(SUM(G6:G7)>1,SUM(G6:G7),\" \")","v":2116},{"$f":"IF(SUM(H6:H7)>1,SUM(H6:H7),\" \")","v":12},{"$f":"IF(SUM(G8)>1,SUM(G8/H8),\" \")","v":176.33333333333334},{"$f":"MAX(G12:I25)","v":222},{"$f":"IF(SUM(G12:I25)<1,\" \",MIN(G12:I25))","v":144},{"$f":"MAX(J12:J25)","v":552},null,{"$f":"IF(SUM(G12:J25)>1,MIN(J12:J25),\" \")","v":472},{"$f":"IF(J8>0,AVERAGE(J12:J25),\"\")","v":529},null,"Höchste Einzel-Erg. :",null,null,"Höchste Einzel-Erg. :"]
[]
[null,null,null,"         Einzelspielergebnisse Liga",null,null,null,null,null,null,null,null,"Sonstige Antritte"]
[null,null,null," Datum","Antr.","Bahn","1. Spiel","2. Spiel","3. Spiel","3. er Serie","3. er Ø",null," Datum - Turnier",null,null,null,null,"4.er Erg.","6.er Erg.","Schnitt","Ges. Pins","Spiele"]
[null,null,null,{"$f":"+'Spielbogen 10er'!K5","v":"2025-09-09"},1,{"$f":"+'Spielbogen 10er'!J5","v":"OT"},208,153,185,{"$f":"IF(G12>1,+G12+H12+I12,\"\")","v":546},{"$f":"IF(G12>1,SUM(G12:I12)/3,\" \")","v":182},null,{"$f":"+'Anmeldegruppen Turniere'!AB8&\" - \"&W12","v":"13. / 14. 09. 2025 - Eröffnungs Doppel"},null,null,null,null,null,null,{"$f":"IF(S12>1,+S12/V12,\"\")","v":""},{"$f":"IF(S12>1,SUM($R$12:S12),\" \")","v":" "},{"$f":"IF(S12>0,6,0)","v":0},"Eröffnungs Doppel"]
[null,null,null,{"$f":"+'Spielbogen 10er'!K6","v":"2025-09-23"},2,{"$f":"+'Spielbogen 10er'!J6","v":"WB"},190,202,154,546,182,null,{"$f":"+'Anmeldegruppen Turniere'!AB11&\" - \"&W13","v":"27. / 28. 09. 2025 - 1. Antritt HH-Cup"},null,null,null,null,null,null,{"$f":"IF(R13>1,+R13/V13,\"\")","v":""},{"$f":"IF(R13>1,SUM($R$12:S13),\" \")","v":" "},{"$f":"IF(R13,4,0)","v":0},"1. Antritt HH-Cup"]
[null,null,null,{"$f":"+'Spielbogen 10er'!K7","v":"2025-10-07"},3,{"$f":"+'Spielbogen 10er'!J7","v":"OT"},165,165,222,552,184,null,{"$f":"+'Anmeldegruppen Turniere'!AB12&\" - \"&W14","v":"11. / 12. 10. 2025 - 2. Antritt HH-Cup"},null,null,null,null,null,null,{"$f":"IF(R14>1,+R14/V14,\"\")","v":""},{"$f":"IF(R14>1,SUM($R$12:S14),\" \")","v":" "},{"$f":"IF(R14,4,0)","v":0},"2. Antritt HH-Cup"]
[null,null,null,{"$f":"+'Spielbogen 10er'!K8","v":"2025-10-21"},4,{"$f":"+'Spielbogen 10er'!J8","v":"WB"},null,null,null,""," ",null,{"$f":"+'Hilfstabelle Mannschaften'!I11&\" - \"&W15","v":"15. / 16. 11. 2025 - Herbst-Mix"},null,null,null,null,null,null,{"$f":"IF(R15>1,+R15/V15,\"\")","v":""},{"$f":"IF(R15>1,SUM($R$12:S15),\" \")","v":" "},{"$f":"IF(R15,4,0)","v":0},"Herbst-Mix"]
[null,null,null,{"$f":"+'Spielbogen 10er'!K9","v":"2025-11-04"},5,{"$f":"+'Spielbogen 10er'!J9","v":"OT"},159,144,169,472,157.33333333333334,null,{"$f":"+'Anmeldegruppen Turniere'!AB22&\" - \"&W16","v":"17. / 18. 01. 2026 - 1. Antritt Einzel"},null,null,null,null,null,null,{"$f":"IF(S16>1,+S16/V16,\"\")","v":""},{"$f":"IF(S16>1,SUM($R$12:S16),\" \")","v":" "},{"$f":"IF(S16>0,6,0)","v":0},"1. Antritt Einzel"]
[null,null,null,{"$f":"+'Spielbogen 10er'!K10","v":"2025-11-18"},6,{"$f":"+'Spielbogen 10er'!J10","v":"WB"},null,null,null,""," ",null,{"$f":"+'Anmeldegruppen Turniere'!AB23&\" - \"&W17","v":"31. / 01. 02. 2026 - 2. Antritt Einzel"},null,null,null,null,null,null,{"$f":"IF(S17>1,+S17/V17,\"\")","v":""},{"$f":"IF(S17>1,SUM($R$12:S17),\" \")","v":" "},{"$f":"IF(S17>0,6,0)","v":0},"2. Antritt Einzel"]
[null,null,null,{"$f":"+'Spielbogen 10er'!K11","v":"2026-01-13"},7,{"$f":"+'Spielbogen 10er'!J11","v":"OT"},null,null,null,""," ",null,{"$f":"+'Hilfstabelle Mannschaften'!I12&\" - \"&W18","v":"21. / 22. 03. 2026 - Frühjahrs-Mix"},null,null,null,null,null,null,{"$f":"IF(R18>1,+R18/V18,\"\")","v":""},{"$f":"IF(R18>1,SUM($R$12:S18),\" \")","v":" "},{"$f":"IF(R18,4,0)","v":0},"Frühjahrs-Mix"]
[null,null,null,{"$f":"+'Spielbogen 10er'!K12","v":"2026-01-27"},8,{"$f":"+'Spielbogen 10er'!J12","v":"WB"},null,null,null,""," ",null,{"$f":"+'Anmeldegruppen Turniere'!AB30&\" - \"&W19","v":"25. / 26. 04. 2026 - 1. Antritt Doppel"},null,null,null,null,null,null,{"$f":"IF(S19>1,+S19/V19,\"\")","v":""},{"$f":"IF(S19>1,SUM($R$12:S19),\" \")","v":" "},{"$f":"IF(S19>0,6,0)","v":0},"1. Antritt Doppel"]
[null,null,null,{"$f":"+'Spielbogen 10er'!K13","v":"2026-02-10"},9,{"$f":"+'Spielbogen 10er'!J13","v":"OT"},null,null,null,"",{"$f":"IF(G20>1,SUM(G20:I20)/3,\" \")","v":" "},null,{"$f":"+'Anmeldegruppen Turniere'!AB31&\" - \"&W20","v":"09. / 10. 05. 2026 - 2. Antritt Doppel"},null,null,null,null,null,null,{"$f":"IF(S20>1,+S20/V20,\"\")","v":""},{"$f":"IF(S20>1,SUM($R$12:S20),\" \")","v":" "},{"$f":"IF(S20>0,6,0)","v":0},"2. Antritt Doppel"]
[null,null,null,{"$f":"+'Spielbogen 10er'!K14","v":"2026-02-24"},10,{"$f":"+'Spielbogen 10er'!J14","v":"WB"},null,null,null,"",{"$f":"IF(G21>1,SUM(G21:I21)/3,\" \")","v":" "}]
[null,null,null,{"$f":"+'Spielbogen 10er'!K15","v":"2026-03-10"},11,{"$f":"+'Spielbogen 10er'!J15","v":"OT"},null,null,null,""," "]
[null,null,null,{"$f":"+'Spielbogen 10er'!K16","v":"2026-03-24"},12,{"$f":"+'Spielbogen 10er'!J16","v":"WB"},null,null,null,""," "]
[null,null,null,{"$f":"+'Spielbogen 10er'!K17","v":"2026-04-07"},13,{"$f":"+'Spielbogen 10er'!J17","v":"OT"},null,null,null,""," "]
[null,null,null,{"$f":"+'Spielbogen 10er'!K18","v":"2026-04-21"},14,{"$f":"+'Spielbogen 10er'!J18","v":"WB"},null,null,null,{"$f":"IF(G25>1,+G25+H25+I25,\"\")","v":""},{"$f":"IF(G25>1,SUM(G25:I25)/3,\" \")","v":" "}]

{"sheet":"Frank N.","index":13,"n_rows":25,"n_cols":23,"rows_kept":25,"cut":false,"hidden":false,"merged":[[1,6,1,18],[9,3,9,10],[7,3,7,5],[5,3,5,5],[6,3,6,5],[9,12,9,21],[4,16,4,21],[5,11,5,12],[6,11,6,12],[7,11,7,12],[6,16,6,17],[5,19,5,21],[7,16,7,17],[7,19,7,20],[6,19,6,20],[4,9,4,14],[22,14,22,16],[23,14,23,16],[24,14,24,16],[2,9,2,13],[4,4,4,5],[2,3,2,7],[5,16,5,18],[10,12,10,16],[11,12,11,16],[12,12,12,16],[13,12,13,16],[14,12,14,16],[15,12,15,16],[16,12,16,16],[17,12,17,16],[18,12,18,16],[19,12,19,16],[17,22,17,23],[18,22,18,23],[19,22,19,23],[12,22,12,23],[13,22,13,23],[14,22,14,23],[15,22,15,23],[16,22,16,23]]}
[null,"Start"]
[null,"Rangliste",null,null,null,null,{"$f":"+'Hilfstabelle Mannschaften'!H6&\" \"&+'Hilfstabelle Mannschaften'!I6","v":"PUNKTSPIELSAISON  2025/2026"}]
[null,null,null,{"$f":"+'Hilfstabelle Spieler'!A8","v":"Frank Nijholt"}]
[]
[null,null,null,"Pass.-Nr.:",{"$f":"VLOOKUP(D3,'Hilfstabelle Spieler'!A6:B19,2,0)","v":24774},null,"Pins","Spiele","Schnitt","Ligaergebnisse",null,null,null,null,null,null,"Sonstige Antritte:"]
[null,null,null,"Ligaergebnisse:",null,null,{"$f":"IF(SUM(J12:J25)>1,SUM(J12:J25),\" \")","v":931},{"$f":"COUNT(G12:I25)","v":6},{"$f":"IF(SUM(G12:I25)>1,SUM(G6/H6),\" \")","v":155.16666666666666},"MAX.","MIN.","MAX.",null,"MIN.","Schnitt",null,"4.er Serie:",null,null,"6.er Serie:"]
[null,null,null,"Sonstige Antritte:",null,null,{"$f":"IF(SUM(R12:S20)>1,SUM(R12:S20),\" \")","v":" "},{"$f":"IF(SUM(R12:S20)>1,SUM(V12:V20),\" \")","v":" "},{"$f":"IF(SUM(R12:S20)>1,G7/H7,\" \")","v":" "},"ERG.","ERG.","3.ER",null,"3.ER","3.ER",null,"Höchstes 4.er Erg. :",null,{"$f":"MAX(R13:R18)","v":0},"Höchstes 6.er Erg. :"]
[null,null,null,"GESAMTSCHNITT:",null,null,{"$f":"IF(SUM(G6:G7)>1,SUM(G6:G7),\" \")","v":931},{"$f":"IF(SUM(H6:H7)>1,SUM(H6:H7),\" \")","v":6},{"$f":"IF(SUM(G8)>1,SUM(G8/H8),\" \")","v":155.16666666666666},{"$f":"MAX(G12:I25)","v":170},{"$f":"IF(SUM(G12:I25)<1,\" \",MIN(G12:I25))","v":129},{"$f":"MAX(J12:J25)","v":500},null,{"$f":"IF(SUM(G12:J25)>1,MIN(J12:J25),\" \")","v":431},{"$f":"IF(J8>0,AVERAGE(J12:J25),\"\")","v":465.5},null,"Höchste Einzel-Erg. :",null,null,"Höchste Einzel-Erg. :"]
[]
[null,null,null,"         Einzelspielergebnisse Liga",null,null,null,null,null,null,null,null,"Sonstige Antritte"]
[null,null,null," Datum","Antr.","Bahn","1. Spiel","2. Spiel","3. Spiel","3. er Serie","3. er Ø",null," Datum - Turnier",null,null,null,null,"4.er Erg.","6.er Erg.","Schnitt","Ges. Pins","Spiele"]
[null,null,null,{"$f":"+'Spielbogen 10er'!K5","v":"2025-09-09"},1,{"$f":"+'Spielbogen 10er'!J5","v":"OT"},null,null,null,{"$f":"IF(G12>1,+G12+H12+I12,\"\")","v":""},{"$f":"IF(G12>1,SUM(G12:I12)/3,\" \")","v":" "},null,{"$f":"+'Anmeldegruppen Turniere'!AB8&\" - \"&W12","v":"13. / 14. 09. 2025 - Eröffnungs Doppel"},null,null,null,null,null,null,{"$f":"IF(S12>1,+S12/V12,\"\")","v":""},{"$f":"IF(S12>1,SUM($R$12:S12),\" \")","v":" "},{"$f":"IF(S12>0,6,0)","v":0},"Eröffnungs Doppel"]
[null,null,null,{"$f":"+'Spielbogen 10er'!K6","v":"2025-09-23"},2,{"$f":"+'Spielbogen 10er'!J6","v":"WB"},165,165,170,500,166.66666666666666,null,{"$f":"+'Anmeldegruppen Turniere'!AB11&\" - \"&W13","v":"27. / 28. 09. 2025 - 1. Antritt HH-Cup"},null,null,null,null,null,null,{"$f":"IF(R13>1,+R13/V13,\"\")","v":""},{"$f":"IF(R13>1,SUM($R$12:S13),\" \")","v":" "},{"$f":"IF(R13,4,0)","v":0},"1. Antritt HH-Cup"]
[null,null,null,{"$f":"+'Spielbogen 10er'!K7","v":"2025-10-07"},3,{"$f":"+'Spielbogen 10er'!J7","v":"OT"},null,null,null,""," ",null,{"$f":"+'Anmeldegruppen Turniere'!AB12&\" - \"&W14","v":"11. / 12. 10. 2025 - 2. Antritt HH-Cup"},null,null,null,null,null,null,{"$f":"IF(R14>1,+R14/V14,\"\")","v":""},{"$f":"IF(R14>1,SUM($R$12:S14),\" \")","v":" "},{"$f":"IF(R14,4,0)","v":0},"2. Antritt HH-Cup"]
[null,null,null,{"$f":"+'Spielbogen 10er'!K8","v":"2025-10-21"},4,{"$f":"+'Spielbogen 10er'!J8","v":"WB"},167,135,129,431,143.66666666666666,null,{"$f":"+'Hilfstabelle Mannschaften'!I11&\" - \"&W15","v":"15. / 16. 11. 2025 - Herbst-Mix"},null,null,null,null,null,null,{"$f":"IF(R15>1,+R15/V15,\"\")","v":""},{"$f":"IF(R15>1,SUM($R$12:S15),\" \")","v":" "},{"$f":"IF(R15,4,0)","v":0},"Herbst-Mix"]
[null,null,null,{"$f":"+'Spielbogen 10er'!K9","v":"2025-11-04"},5,{"$f":"+'Spielbogen 10er'!J9","v":"OT"},null,null,null,""," ",null,{"$f":"+'Anmeldegruppen Turniere'!AB22&\" - \"&W16","v":"17. / 18. 01. 2026 - 1. Antritt Einzel"},null,null,null,null,null,null,{"$f":"IF(S16>1,+S16/V16,\"\")","v":""},{"$f":"IF(S16>1,SUM($R$12:S16),\" \")","v":" "},{"$f":"IF(S16>0,6,0)","v":0},"1. Antritt Einzel"]
[null,null,null,{"$f":"+'Spielbogen 10er'!K10","v":"2025-11-18"},6,{"$f":"+'Spielbogen 10er'!J10","v":"WB"},null,null,null,""," ",null,{"$f":"+'Anmeldegruppen Turniere'!AB23&\" - \"&W17","v":"31. / 01. 02. 2026 - 2. Antritt Einzel"},null,null,null,null,null,null,{"$f":"IF(S17>1,+S17/V17,\"\")","v":""},{"$f":"IF(S17>1,SUM($R$12:S17),\" \")","v":" "},{"$f":"IF(S17>0,6,0)","v":0},"2. Antritt Einzel"]
[null,null,null,{"$f":"+'Spielbogen 10er'!K11","v":"2026-01-13"},7,{"$f":"+'Spielbogen 10er'!J11","v":"OT"},null,null,null,""," ",null,{"$f":"+'Hilfstabelle Mannschaften'!I12&\" - \"&W18","v":"21. / 22. 03. 2026 - Frühjahrs-Mix"},null,null,null,null,null,null,{"$f":"IF(R18>1,+R18/V18,\"\")","v":""},{"$f":"IF(R18>1,SUM($R$12:S18),\" \")","v":" "},{"$f":"IF(R18,4,0)","v":0},"Frühjahrs-Mix"]
[null,null,null,{"$f":"+'Spielbogen 10er'!K12","v":"2026-01-27"},8,{"$f":"+'Spielbogen 10er'!J12","v":"WB"},null,null,null,""," ",null,{"$f":"+'Anmeldegruppen Turniere'!AB30&\" - \"&W19","v":"25. / 26. 04. 2026 - 1. Antritt Doppel"},null,null,null,null,null,null,{"$f":"IF(S19>1,+S19/V19,\"\")","v":""},{"$f":"IF(S19>1,SUM($R$12:S19),\" \")","v":" "},{"$f":"IF(S19>0,6,0)","v":0},"1. Antritt Doppel"]
[null,null,null,{"$f":"+'Spielbogen 10er'!K13","v":"2026-02-10"},9,{"$f":"+'Spielbogen 10er'!J13","v":"OT"},null,null,null,"",{"$f":"IF(G20>1,SUM(G20:I20)/3,\" \")","v":" "},null,{"$f":"+'Anmeldegruppen Turniere'!AB31&\" - \"&W20","v":"09. / 10. 05. 2026 - 2. Antritt Doppel"},null,null,null,null,null,null,{"$f":"IF(S20>1,+S20/V20,\"\")","v":""},{"$f":"IF(S20>1,SUM($R$12:S20),\" \")","v":" "},{"$f":"IF(S20>0,6,0)","v":0},"2. Antritt Doppel"]
[null,null,null,{"$f":"+'Spielbogen 10er'!K14","v":"2026-02-24"},10,{"$f":"+'Spielbogen 10er'!J14","v":"WB"},null,null,null,"",{"$f":"IF(G21>1,SUM(G21:I21)/3,\" \")","v":" "}]
[null,null,null,{"$f":"+'Spielbogen 10er'!K15","v":"2026-03-10"},11,{"$f":"+'Spielbogen 10er'!J15","v":"OT"},null,null,null,""," "]
[null,null,null,{"$f":"+'Spielbogen 10er'!K16","v":"2026-03-24"},12,{"$f":"+'Spielbogen 10er'!J16","v":"WB"},null,null,null,""," "]
[null,null,null,{"$f":"+'Spielbogen 10er'!K17","v":"2026-04-07"},13,{"$f":"+'Spielbogen 10er'!J17","v":"OT"},null,null,null,""," "]
[null,null,null,{"$f":"+'Spielbogen 10er'!K18","v":"2026-04-21"},14,{"$f":"+'Spielbogen 10er'!J18","v":"WB"},null,null,null,{"$f":"IF(G25>1,+G25+H25+I25,\"\")","v":""},{"$f":"IF(G25>1,SUM(G25:I25)/3,\" \")","v":" "}]

{"sheet":"Jörg F.","index":14,"n_rows":31,"n_cols":23,"rows_kept":31,"cut":false,"hidden":false,"merged":[[1,6,1,18],[9,3,9,10],[7,3,7,5],[5,3,5,5],[6,3,6,5],[9,12,9,21],[4,16,4,21],[5,11,5,12],[6,11,6,12],[7,11,7,12],[6,16,6,17],[5,19,5,21],[7,16,7,17],[7,19,7,20],[6,19,6,20],[4,9,4,14],[22,14,22,16],[23,14,23,16],[24,14,24,16],[2,9,2,13],[4,4,4,5],[2,3,2,7],[5,16,5,18],[10,12,10,16],[11,12,11,16],[12,12,12,16],[13,12,13,16],[14,12,14,16],[15,12,15,16],[16,12,16,16],[17,12,17,16],[18,12,18,16],[19,12,19,16],[17,22,17,23],[18,22,18,23],[19,22,19,23],[12,22,12,23],[13,22,13,23],[14,22,14,23],[15,22,15,23],[16,22,16,23]]}
[null,"Start"]
[null,"Rangliste",null,null,null,null,{"$f":"+'Hilfstabelle Mannschaften'!H6&\" \"&+'Hilfstabelle Mannschaften'!I6","v":"PUNKTSPIELSAISON  2025/2026"}]
[null,null,null,{"$f":"+'Hilfstabelle Spieler'!A10","v":"Jörg Frahm"}]
[]
[null,null,null,"Pass.-Nr.:",{"$f":"VLOOKUP(D3,'Hilfstabelle Spieler'!A6:B19,2,0)","v":19221},null,"Pins","Spiele","Schnitt","Ligaergebnisse",null,null,null,null,null,null,"Sonstige Antritte:"]
[null,null,null,"Ligaergebnisse:",null,null,{"$f":"IF(SUM(J12:J25)>1,SUM(J12:J25),\" \")","v":927},{"$f":"COUNT(G12:I25)","v":6},{"$f":"IF(SUM(G12:I25)>1,SUM(G6/H6),\" \")","v":154.5},"MAX.","MIN.","MAX.",null,"MIN.","Schnitt",null,"4.er Serie:",null,null,"6.er Serie:"]
[null,null,null,"Sonstige Antritte:",null,null,{"$f":"IF(SUM(R12:S20)>1,SUM(R12:S20),\" \")","v":1842},{"$f":"IF(SUM(R12:S20)>1,SUM(V12:V20),\" \")","v":10},{"$f":"IF(SUM(R12:S20)>1,G7/H7,\" \")","v":184.2},"ERG.","ERG.","3.ER",null,"3.ER","3.ER",null,"Höchstes 4.er Erg. :",null,{"$f":"MAX(R13:R18)","v":761},"Höchstes 6.er Erg. :",null,{"$f":"MAX(S12:S20)","v":1081}]
[null,null,null,"GESAMTSCHNITT:",null,null,{"$f":"IF(SUM(G6:G7)>1,SUM(G6:G7),\" \")","v":2769},{"$f":"IF(SUM(H6:H7)>1,SUM(H6:H7),\" \")","v":16},{"$f":"IF(SUM(G8)>1,SUM(G8/H8),\" \")","v":173.0625},{"$f":"MAX(G12:I25)","v":181},{"$f":"IF(SUM(G12:I25)<1,\" \",MIN(G12:I25))","v":129},{"$f":"MAX(J12:J25)","v":496},null,{"$f":"IF(SUM(G12:J25)>1,MIN(J12:J25),\" \")","v":431},{"$f":"IF(J8>0,AVERAGE(J12:J25),\"\")","v":463.5},null,"Höchste Einzel-Erg. :",null,227,"Höchste Einzel-Erg. :",null,216]
[]
[null,null,null,"         Einzelspielergebnisse Liga",null,null,null,null,null,null,null,null,"Sonstige Antritte"]
[null,null,null," Datum","Antr.","Bahn","1. Spiel","2. Spiel","3. Spiel","3. er Serie","3. er Ø",null," Datum - Turnier",null,null,null,null,"4.er Erg.","6.er Erg.","Schnitt","Ges. Pins","Spiele"]
[null,null,null,{"$f":"+'Spielbogen 10er'!K5","v":"2025-09-09"},1,{"$f":"+'Spielbogen 10er'!J5","v":"OT"},129,142,160,{"$f":"IF(G12>1,+G12+H12+I12,\"\")","v":431},{"$f":"IF(G12>1,SUM(G12:I12)/3,\" \")","v":143.66666666666666},null,{"$f":"+'Anmeldegruppen Turniere'!AB8&\" - \"&W12","v":"13. / 14. 09. 2025 - Eröffnungs Doppel"},null,null,null,null,null,1081,{"$f":"IF(S12>1,+S12/V12,\"\")","v":180.16666666666666},{"$f":"IF(S12>1,SUM($R$12:S12),\" \")","v":1081},{"$f":"IF(S12>0,6,0)","v":6},"Eröffnungs Doppel"]
[null,null,null,{"$f":"+'Spielbogen 10er'!K6","v":"2025-09-23"},2,{"$f":"+'Spielbogen 10er'!J6","v":"WB"},148,181,167,496,165.33333333333334,null,{"$f":"+'Anmeldegruppen Turniere'!AB11&\" - \"&W13","v":"27. / 28. 09. 2025 - 1. Antritt HH-Cup"},null,null,null,null,null,null,{"$f":"IF(R13>1,+R13/V13,\"\")","v":""},{"$f":"IF(R13>1,SUM($R$12:S13),\" \")","v":" "},{"$f":"IF(R13,4,0)","v":0},"1. Antritt HH-Cup"]
[null,null,null,{"$f":"+'Spielbogen 10er'!K7","v":"2025-10-07"},3,{"$f":"+'Spielbogen 10er'!J7","v":"OT"},null,null,null,""," ",null,{"$f":"+'Anmeldegruppen Turniere'!AB12&\" - \"&W14","v":"11. / 12. 10. 2025 - 2. Antritt HH-Cup"},null,null,null,null,null,null,{"$f":"IF(R14>1,+R14/V14,\"\")","v":""},{"$f":"IF(R14>1,SUM($R$12:S14),\" \")","v":" "},{"$f":"IF(R14,4,0)","v":0},"2. Antritt HH-Cup"]
[null,null,null,{"$f":"+'Spielbogen 10er'!K8","v":"2025-10-21"},4,{"$f":"+'Spielbogen 10er'!J8","v":"WB"},null,null,null,""," ",null,{"$f":"+'Hilfstabelle Mannschaften'!I11&\" - \"&W15","v":"15. / 16. 11. 2025 - Herbst-Mix"},null,null,null,null,761,null,{"$f":"IF(R15>1,+R15/V15,\"\")","v":190.25},{"$f":"IF(R15>1,SUM($R$12:S15),\" \")","v":1842},{"$f":"IF(R15,4,0)","v":4},"Herbst-Mix"]
[null,null,null,{"$f":"+'Spielbogen 10er'!K9","v":"2025-11-04"},5,{"$f":"+'Spielbogen 10er'!J9","v":"OT"},null,null,null,""," ",null,{"$f":"+'Anmeldegruppen Turniere'!AB22&\" - \"&W16","v":"17. / 18. 01. 2026 - 1. Antritt Einzel"},null,null,null,null,null,null,{"$f":"IF(S16>1,+S16/V16,\"\")","v":""},{"$f":"IF(S16>1,SUM($R$12:S16),\" \")","v":" "},{"$f":"IF(S16>0,6,0)","v":0},"1. Antritt Einzel"]
[null,null,null,{"$f":"+'Spielbogen 10er'!K10","v":"2025-11-18"},6,{"$f":"+'Spielbogen 10er'!J10","v":"WB"},null,null,null,""," ",null,{"$f":"+'Anmeldegruppen Turniere'!AB23&\" - \"&W17","v":"31. / 01. 02. 2026 - 2. Antritt Einzel"},null,null,null,null,null,null,{"$f":"IF(S17>1,+S17/V17,\"\")","v":""},{"$f":"IF(S17>1,SUM($R$12:S17),\" \")","v":" "},{"$f":"IF(S17>0,6,0)","v":0},"2. Antritt Einzel"]
[null,null,null,{"$f":"+'Spielbogen 10er'!K11","v":"2026-01-13"},7,{"$f":"+'Spielbogen 10er'!J11","v":"OT"},null,null,null,""," ",null,{"$f":"+'Hilfstabelle Mannschaften'!I12&\" - \"&W18","v":"21. / 22. 03. 2026 - Frühjahrs-Mix"},null,null,null,null,null,null,{"$f":"IF(R18>1,+R18/V18,\"\")","v":""},{"$f":"IF(R18>1,SUM($R$12:S18),\" \")","v":" "},{"$f":"IF(R18,4,0)","v":0},"Frühjahrs-Mix"]
[null,null,null,{"$f":"+'Spielbogen 10er'!K12","v":"2026-01-27"},8,{"$f":"+'Spielbogen 10er'!J12","v":"WB"},null,null,null,""," ",null,{"$f":"+'Anmeldegruppen Turniere'!AB30&\" - \"&W19","v":"25. / 26. 04. 2026 - 1. Antritt Doppel"},null,null,null,null,null,null,{"$f":"IF(S19>1,+S19/V19,\"\")","v":""},{"$f":"IF(S19>1,SUM($R$12:S19),\" \")","v":" "},{"$f":"IF(S19>0,6,0)","v":0},"1. Antritt Doppel"]
[null,null,null,{"$f":"+'Spielbogen 10er'!K13","v":"2026-02-10"},9,{"$f":"+'Spielbogen 10er'!J13","v":"OT"},null,null,null,"",{"$f":"IF(G20>1,SUM(G20:I20)/3,\" \")","v":" "},null,{"$f":"+'Anmeldegruppen Turniere'!AB31&\" - \"&W20","v":"09. / 10. 05. 2026 - 2. Antritt Doppel"},null,null,null,null,null,null,{"$f":"IF(S20>1,+S20/V20,\"\")","v":""},{"$f":"IF(S20>1,SUM($R$12:S20),\" \")","v":" "},{"$f":"IF(S20>0,6,0)","v":0},"2. Antritt Doppel"]
[null,null,null,{"$f":"+'Spielbogen 10er'!K14","v":"2026-02-24"},10,{"$f":"+'Spielbogen 10er'!J14","v":"WB"},null,null,null,"",{"$f":"IF(G21>1,SUM(G21:I21)/3,\" \")","v":" "}]
[null,null,null,{"$f":"+'Spielbogen 10er'!K15","v":"2026-03-10"},11,{"$f":"+'Spielbogen 10er'!J15","v":"OT"},null,null,null,""," "]
[null,null,null,{"$f":"+'Spielbogen 10er'!K16","v":"2026-03-24"},12,{"$f":"+'Spielbogen 10er'!J16","v":"WB"},null,null,null,""," "]
[null,null,null,{"$f":"+'Spielbogen 10er'!K17","v":"2026-04-07"},13,{"$f":"+'Spielbogen 10er'!J17","v":"OT"},null,null,null,""," "]
[null,null,null,{"$f":"+'Spielbogen 10er'!K18","v":"2026-04-21"},14,{"$f":"+'Spielbogen 10er'!J18","v":"WB"},null,null,null,{"$f":"IF(G25>1,+G25+H25+I25,\"\")","v":""},{"$f":"IF(G25>1,SUM(G25:I25)/3,\" \")","v":" "}]
[null,null,null,{"$f":"+\"Ausgeholfen in der 1. Mannschaft                                                     Anzahl Spiele:\"&\" \"&+COUNT(G27:I30)","v":"Ausgeholfen in der 1. Mannschaft                                                     Anzahl Spiele: 0"}]
[null,null,null,null,null,null,null,null,null,{"$f":"IF(G27>1,+G27+H27+I27,\"\")","v":""},{"$f":"IF(G27>1,SUM(G27:I27)/3,\" \")","v":" "}]
[null,null,null,null,null,null,null,null,null,{"$f":"IF(G28>1,+G28+H28+I28,\"\")","v":""},{"$f":"IF(G28>1,SUM(G28:I28)/3,\" \")","v":" "}]
[null,null,null,null,null,null,null,null,null,{"$f":"IF(G29>1,+G29+H29+I29,\"\")","v":""},{"$f":"IF(G29>1,SUM(G29:I29)/3,\" \")","v":" "}]
[null,null,null,null,null,null,null,null,null,{"$f":"IF(G30>1,+G30+H30+I30,\"\")","v":""},{"$f":"IF(G30>1,SUM(G30:I30)/3,\" \")","v":" "}]
[null,null,null,null,null,null,null,null,null,{"$f":"IF(G31>1,+G31+H31+I31,\"\")","v":""},{"$f":"IF(G31>1,SUM(G31:I31)/3,\" \")","v":" "}]

{"sheet":"Matthias N.","index":15,"n_rows":31,"n_cols":23,"rows_kept":31,"cut":false,"hidden":false,"merged":[[1,6,1,18],[6,19,6,20],[5,11,5,12],[6,11,6,12],[6,16,6,17],[4,9,4,14],[5,16,5,18],[5,19,5,21],[4,16,4,21],[2,3,2,7],[2,9,2,13],[4,4,4,5],[11,12,11,16],[12,12,12,16],[7,19,7,20],[5,3,5,5],[6,3,6,5],[7,3,7,5],[7,11,7,12],[7,16,7,17],[9,3,9,10],[10,12,10,16],[9,12,9,21],[22,14,22,16],[23,14,23,16],[24,14,24,16],[13,12,13,16],[14,12,14,16],[15,12,15,16],[16,12,16,16],[17,12,17,16],[18,12,18,16],[19,12,19,16],[17,22,17,23],[18,22,18,23],[19,22,19,23],[12,22,12,23],[13,22,13,23],[14,22,14,23],[15,22,15,23],[16,22,16,23]]}
[null,"Start"]
[null,"Rangliste",null,null,null,null,{"$f":"+'Hilfstabelle Mannschaften'!H6&\" \"&+'Hilfstabelle Mannschaften'!I6","v":"PUNKTSPIELSAISON  2025/2026"}]
[null,null,null,{"$f":"+'Hilfstabelle Spieler'!A13","v":"Matthias Nolte"}]
[]
[null,null,null,"Pass.-Nr.:",{"$f":"VLOOKUP(D3,'Hilfstabelle Spieler'!A6:B19,2,0)","v":20137},null,"Pins","Spiele","Schnitt","Ligaergebnisse",null,null,null,null,null,null,"Sonstige Antritte:"]
[null,null,null,"Ligaergebnisse:",null,null,{"$f":"IF(SUM(J12:J25)>1,SUM(J12:J25),\" \")","v":821},{"$f":"COUNT(G12:I25)","v":6},{"$f":"IF(SUM(G12:I25)>1,SUM(G6/H6),\" \")","v":136.83333333333334},"MAX.","MIN.","MAX.",null,"MIN.","Schnitt",null,"4.er Serie:",null,null,"6.er Serie:"]
[null,null,null,"Sonstige Antritte:",null,null,{"$f":"IF(SUM(R12:S20)>1,SUM(R12:S20),\" \")","v":" "},{"$f":"IF(SUM(R12:S20)>1,SUM(V12:V20),\" \")","v":" "},{"$f":"IF(SUM(R12:S20)>1,G7/H7,\" \")","v":" "},"ERG.","ERG.","3.ER",null,"3.ER","3.ER",null,"Höchstes 4.er Erg. :",null,{"$f":"MAX(R13:R18)","v":0},"Höchstes 6.er Erg. :"]
[null,null,null,"GESAMTSCHNITT:",null,null,{"$f":"IF(SUM(G6:G7)>1,SUM(G6:G7),\" \")","v":821},{"$f":"IF(SUM(H6:H7)>1,SUM(H6:H7),\" \")","v":6},{"$f":"IF(SUM(G8)>1,SUM(G8/H8),\" \")","v":136.83333333333334},{"$f":"MAX(G12:I25)","v":168},{"$f":"IF(SUM(G12:I25)<1,\" \",MIN(G12:I25))","v":112},{"$f":"MAX(J12:J25)","v":428},null,{"$f":"IF(SUM(G12:J25)>1,MIN(J12:J25),\" \")","v":393},{"$f":"IF(J8>0,AVERAGE(J12:J25),\"\")","v":410.5},null,"Höchste Einzel-Erg. :",null,null,"Höchste Einzel-Erg. :"]
[]
[null,null,null,"         Einzelspielergebnisse Liga",null,null,null,null,null,null,null,null,"Sonstige Antritte"]
[null,null,null," Datum","Antr.","Bahn","1. Spiel","2. Spiel","3. Spiel","3. er Serie","3. er Ø",null," Datum - Turnier",null,null,null,null,"4.er Erg.","6.er Erg.","Schnitt","Ges. Pins","Spiele"]
[null,null,null,{"$f":"+'Spielbogen 10er'!K5","v":"2025-09-09"},1,{"$f":"+'Spielbogen 10er'!J5","v":"OT"},null,null,null,{"$f":"IF(G12>1,+G12+H12+I12,\"\")","v":""},{"$f":"IF(G12>1,SUM(G12:I12)/3,\" \")","v":" "},null,{"$f":"+'Anmeldegruppen Turniere'!AB8&\" - \"&W12","v":"13. / 14. 09. 2025 - Eröffnungs Doppel"},null,null,null,null,null,null,{"$f":"IF(S12>1,+S12/V12,\"\")","v":""},{"$f":"IF(S12>1,SUM($R$12:S12),\" \")","v":" "},{"$f":"IF(S12>0,6,0)","v":0},"Eröffnungs Doppel"]
[null,null,null,{"$f":"+'Spielbogen 10er'!K6","v":"2025-09-23"},2,{"$f":"+'Spielbogen 10er'!J6","v":"WB"},null,null,null,""," ",null,{"$f":"+'Anmeldegruppen Turniere'!AB11&\" - \"&W13","v":"27. / 28. 09. 2025 - 1. Antritt HH-Cup"},null,null,null,null,null,null,{"$f":"IF(R13>1,+R13/V13,\"\")","v":""},{"$f":"IF(R13>1,SUM($R$12:S13),\" \")","v":" "},{"$f":"IF(R13,4,0)","v":0},"1. Antritt HH-Cup"]
[null,null,null,{"$f":"+'Spielbogen 10er'!K7","v":"2025-10-07"},3,{"$f":"+'Spielbogen 10er'!J7","v":"OT"},133,168,127,428,142.66666666666666,null,{"$f":"+'Anmeldegruppen Turniere'!AB12&\" - \"&W14","v":"11. / 12. 10. 2025 - 2. Antritt HH-Cup"},null,null,null,null,null,null,{"$f":"IF(R14>1,+R14/V14,\"\")","v":""},{"$f":"IF(R14>1,SUM($R$12:S14),\" \")","v":" "},{"$f":"IF(R14,4,0)","v":0},"2. Antritt HH-Cup"]
[null,null,null,{"$f":"+'Spielbogen 10er'!K8","v":"2025-10-21"},4,{"$f":"+'Spielbogen 10er'!J8","v":"WB"},null,null,null,""," ",null,{"$f":"+'Hilfstabelle Mannschaften'!I11&\" - \"&W15","v":"15. / 16. 11. 2025 - Herbst-Mix"},null,null,null,null,null,null,{"$f":"IF(R15>1,+R15/V15,\"\")","v":""},{"$f":"IF(R15>1,SUM($R$12:S15),\" \")","v":" "},{"$f":"IF(R15,4,0)","v":0},"Herbst-Mix"]
[null,null,null,{"$f":"+'Spielbogen 10er'!K9","v":"2025-11-04"},5,{"$f":"+'Spielbogen 10er'!J9","v":"OT"},112,141,140,393,131,null,{"$f":"+'Anmeldegruppen Turniere'!AB22&\" - \"&W16","v":"17. / 18. 01. 2026 - 1. Antritt Einzel"},null,null,null,null,null,null,{"$f":"IF(S16>1,+S16/V16,\"\")","v":""},{"$f":"IF(S16>1,SUM($R$12:S16),\" \")","v":" "},{"$f":"IF(S16>0,6,0)","v":0},"1. Antritt Einzel"]
[null,null,null,{"$f":"+'Spielbogen 10er'!K10","v":"2025-11-18"},6,{"$f":"+'Spielbogen 10er'!J10","v":"WB"},null,null,null,""," ",null,{"$f":"+'Anmeldegruppen Turniere'!AB23&\" - \"&W17","v":"31. / 01. 02. 2026 - 2. Antritt Einzel"},null,null,null,null,null,null,{"$f":"IF(S17>1,+S17/V17,\"\")","v":""},{"$f":"IF(S17>1,SUM($R$12:S17),\" \")","v":" "},{"$f":"IF(S17>0,6,0)","v":0},"2. Antritt Einzel"]
[null,null,null,{"$f":"+'Spielbogen 10er'!K11","v":"2026-01-13"},7,{"$f":"+'Spielbogen 10er'!J11","v":"OT"},null,null,null,""," ",null,{"$f":"+'Hilfstabelle Mannschaften'!I12&\" - \"&W18","v":"21. / 22. 03. 2026 - Frühjahrs-Mix"},null,null,null,null,null,null,{"$f":"IF(R18>1,+R18/V18,\"\")","v":""},{"$f":"IF(R18>1,SUM($R$12:S18),\" \")","v":" "},{"$f":"IF(R18,4,0)","v":0},"Frühjahrs-Mix"]
[null,null,null,{"$f":"+'Spielbogen 10er'!K12","v":"2026-01-27"},8,{"$f":"+'Spielbogen 10er'!J12","v":"WB"},null,null,null,""," ",null,{"$f":"+'Anmeldegruppen Turniere'!AB30&\" - \"&W19","v":"25. / 26. 04. 2026 - 1. Antritt Doppel"},null,null,null,null,null,null,{"$f":"IF(S19>1,+S19/V19,\"\")","v":""},{"$f":"IF(S19>1,SUM($R$12:S19),\" \")","v":" "},{"$f":"IF(S19>0,6,0)","v":0},"1. Antritt Doppel"]
[null,null,null,{"$f":"+'Spielbogen 10er'!K13","v":"2026-02-10"},9,{"$f":"+'Spielbogen 10er'!J13","v":"OT"},null,null,null,"",{"$f":"IF(G20>1,SUM(G20:I20)/3,\" \")","v":" "},null,{"$f":"+'Anmeldegruppen Turniere'!AB31&\" - \"&W20","v":"09. / 10. 05. 2026 - 2. Antritt Doppel"},null,null,null,null,null,null,{"$f":"IF(S20>1,+S20/V20,\"\")","v":""},{"$f":"IF(S20>1,SUM($R$12:S20),\" \")","v":" "},{"$f":"IF(S20>0,6,0)","v":0},"2. Antritt Doppel"]
[null,null,null,{"$f":"+'Spielbogen 10er'!K14","v":"2026-02-24"},10,{"$f":"+'Spielbogen 10er'!J14","v":"WB"},null,null,null,"",{"$f":"IF(G21>1,SUM(G21:I21)/3,\" \")","v":" "}]
[null,null,null,{"$f":"+'Spielbogen 10er'!K15","v":"2026-03-10"},11,{"$f":"+'Spielbogen 10er'!J15","v":"OT"},null,null,null,""," "]
[null,null,null,{"$f":"+'Spielbogen 10er'!K16","v":"2026-03-24"},12,{"$f":"+'Spielbogen 10er'!J16","v":"WB"},null,null,null,""," "]
[null,null,null,{"$f":"+'Spielbogen 10er'!K17","v":"2026-04-07"},13,{"$f":"+'Spielbogen 10er'!J17","v":"OT"},null,null,null,""," "]
[null,null,null,{"$f":"+'Spielbogen 10er'!K18","v":"2026-04-21"},14,{"$f":"+'Spielbogen 10er'!J18","v":"WB"},null,null,null,{"$f":"IF(G25>1,+G25+H25+I25,\"\")","v":""},{"$f":"IF(G25>1,SUM(G25:I25)/3,\" \")","v":" "}]
[null,null,null,{"$f":"+\"Ausgeholfen in der 2 Mannschaft                                                     Anzahl Spiele:\"&\" \"&+COUNT(G27:I30)","v":"Ausgeholfen in der 2 Mannschaft                                                     Anzahl Spiele: 0"}]
[null,null,null,null,null,null,null,null,null,{"$f":"IF(G27>1,+G27+H27+I27,\"\")","v":""},{"$f":"IF(G27>1,SUM(G27:I27)/3,\" \")","v":" "}]
[null,null,null,null,null,null,null,null,null,{"$f":"IF(G28>1,+G28+H28+I28,\"\")","v":""},{"$f":"IF(G28>1,SUM(G28:I28)/3,\" \")","v":" "}]
[null,null,null,null,null,null,null,null,null,{"$f":"IF(G29>1,+G29+H29+I29,\"\")","v":""},{"$f":"IF(G29>1,SUM(G29:I29)/3,\" \")","v":" "}]
[null,null,null,null,null,null,null,null,null,{"$f":"IF(G30>1,+G30+H30+I30,\"\")","v":""},{"$f":"IF(G30>1,SUM(G30:I30)/3,\" \")","v":" "}]
[null,null,null,null,null,null,null,null,null,{"$f":"IF(G31>1,+G31+H31+I31,\"\")","v":""},{"$f":"IF(G31>1,SUM(G31:I31)/3,\" \")","v":" "}]

{"sheet":"Deniz H.","index":16,"n_rows":31,"n_cols":23,"rows_kept":31,"cut":false,"hidden":false,"merged":[[5,3,5,5],[5,11,5,12],[5,16,5,18],[5,19,5,21],[1,6,1,18],[4,9,4,14],[4,16,4,21],[2,3,2,7],[2,9,2,13],[4,4,4,5],[9,3,9,10],[9,12,9,21],[6,3,6,5],[6,11,6,12],[6,16,6,17],[6,19,6,20],[7,3,7,5],[7,11,7,12],[7,16,7,17],[7,19,7,20],[22,14,22,16],[23,14,23,16],[24,14,24,16],[13,12,13,16],[14,12,14,16],[15,12,15,16],[16,12,16,16],[17,12,17,16],[18,12,18,16],[19,12,19,16],[10,12,10,16],[17,22,17,23],[18,22,18,23],[19,22,19,23],[11,12,11,16],[12,12,12,16],[12,22,12,23],[13,22,13,23],[14,22,14,23],[15,22,15,23],[16,22,16,23]]}
[null,"Start"]
[null,"Rangliste",null,null,null,null,{"$f":"+'Hilfstabelle Mannschaften'!H6&\" \"&+'Hilfstabelle Mannschaften'!I6","v":"PUNKTSPIELSAISON  2025/2026"}]
[null,null,null,{"$f":"+'Hilfstabelle Spieler'!A7","v":"Deniz Hagelstein"}]
[]
[null,null,null,"Pass.-Nr.:",{"$f":"VLOOKUP(D3,'Hilfstabelle Spieler'!A6:B19,2,0)","v":24775},null,"Pins","Spiele","Schnitt","Ligaergebnisse",null,null,null,null,null,null,"Sonstige Antritte:"]
[null,null,null,"Ligaergebnisse:",null,null,{"$f":"IF(SUM(J12:J25)>1,SUM(J12:J25),\" \")","v":485},{"$f":"COUNT(G12:I25)","v":3},{"$f":"IF(SUM(G12:I25)>1,SUM(G6/H6),\" \")","v":161.66666666666666},"MAX.","MIN.","MAX.",null,"MIN.","Schnitt",null,"4.er Serie:",null,null,"6.er Serie"]
[null,null,null,"Sonstige Antritte:",null,null,{"$f":"IF(SUM(R12:S20)>1,SUM(R12:S20),\" \")","v":" "},{"$f":"IF(SUM(R12:S20)>1,SUM(V12:V20),\" \")","v":" "},{"$f":"IF(SUM(R12:S20)>1,G7/H7,\" \")","v":" "},"ERG.","ERG.","3.ER",null,"3.ER","3.ER",null,"Höchstes 4.er Erg. :",null,{"$f":"MAX(R13:R18)","v":0},"Höchstes 6.er Erg. :"]
[null,null,null,"GESAMTSCHNITT:",null,null,{"$f":"IF(SUM(G6:G7)>1,SUM(G6:G7),\" \")","v":485},{"$f":"IF(SUM(H6:H7)>1,SUM(H6:H7),\" \")","v":3},{"$f":"IF(SUM(G8)>1,SUM(G8/H8),\" \")","v":161.66666666666666},{"$f":"MAX(G12:I25)","v":187},{"$f":"IF(SUM(G12:I25)<1,\" \",MIN(G12:I25))","v":135},{"$f":"MAX(J12:J25)","v":485},null,{"$f":"IF(SUM(G12:J25)>1,MIN(J12:J25),\" \")","v":485},{"$f":"IF(J8>0,AVERAGE(J12:J25),\"\")","v":485},null,"Höchste Einzel-Erg. :",null,null,"Höchste Einzel-Erg. :"]
[]
[null,null,null,"         Einzelspielergebnisse Liga",null,null,null,null,null,null,null,null,"Sonstige Antritte"]
[null,null,null," Datum","Antr.","Bahn","1. Spiel","2. Spiel","3. Spiel","3. er Serie","3. er Ø",null," Datum - Turnier",null,null,null,null,"4.er Erg.","6.er Erg.","Schnitt","Ges. Pins","Spiele"]
[null,null,null,{"$f":"+'Spielbogen 10er'!K5","v":"2025-09-09"},1,{"$f":"+'Spielbogen 10er'!J5","v":"OT"},null,null,null,{"$f":"IF(G12>1,+G12+H12+I12,\"\")","v":""},{"$f":"IF(G12>1,SUM(G12:I12)/3,\" \")","v":" "},null,{"$f":"+'Anmeldegruppen Turniere'!AB8&\" - \"&W12","v":"13. / 14. 09. 2025 - Eröffnungs Doppel"},null,null,null,null,null,null,{"$f":"IF(S12>1,+S12/V12,\"\")","v":""},{"$f":"IF(S12>1,SUM($R$12:S12),\" \")","v":" "},{"$f":"IF(S12>0,6,0)","v":0},"Eröffnungs Doppel"]
[null,null,null,{"$f":"+'Spielbogen 10er'!K6","v":"2025-09-23"},2,{"$f":"+'Spielbogen 10er'!J6","v":"WB"},null,null,null,""," ",null,{"$f":"+'Anmeldegruppen Turniere'!AB11&\" - \"&W13","v":"27. / 28. 09. 2025 - 1. Antritt HH-Cup"},null,null,null,null,null,null,{"$f":"IF(R13>1,+R13/V13,\"\")","v":""},{"$f":"IF(R13>1,SUM($R$12:S13),\" \")","v":" "},{"$f":"IF(R13,4,0)","v":0},"1. Antritt HH-Cup"]
[null,null,null,{"$f":"+'Spielbogen 10er'!K7","v":"2025-10-07"},3,{"$f":"+'Spielbogen 10er'!J7","v":"OT"},null,null,null,""," ",null,{"$f":"+'Anmeldegruppen Turniere'!AB12&\" - \"&W14","v":"11. / 12. 10. 2025 - 2. Antritt HH-Cup"},null,null,null,null,null,null,{"$f":"IF(R14>1,+R14/V14,\"\")","v":""},{"$f":"IF(R14>1,SUM($R$12:S14),\" \")","v":" "},{"$f":"IF(R14,4,0)","v":0},"2. Antritt HH-Cup"]
[null,null,null,{"$f":"+'Spielbogen 10er'!K8","v":"2025-10-21"},4,{"$f":"+'Spielbogen 10er'!J8","v":"WB"},187,163,135,485,161.66666666666666,null,{"$f":"+'Hilfstabelle Mannschaften'!I11&\" - \"&W15","v":"15. / 16. 11. 2025 - Herbst-Mix"},null,null,null,null,null,null,{"$f":"IF(R15>1,+R15/V15,\"\")","v":""},{"$f":"IF(R15>1,SUM($R$12:S15),\" \")","v":" "},{"$f":"IF(R15,4,0)","v":0},"Herbst-Mix"]
[null,null,null,{"$f":"+'Spielbogen 10er'!K9","v":"2025-11-04"},5,{"$f":"+'Spielbogen 10er'!J9","v":"OT"},null,null,null,""," ",null,{"$f":"+'Anmeldegruppen Turniere'!AB22&\" - \"&W16","v":"17. / 18. 01. 2026 - 1. Antritt Einzel"},null,null,null,null,null,null,{"$f":"IF(S16>1,+S16/V16,\"\")","v":""},{"$f":"IF(S16>1,SUM($R$12:S16),\" \")","v":" "},{"$f":"IF(S16>0,6,0)","v":0},"1. Antritt Einzel"]
[null,null,null,{"$f":"+'Spielbogen 10er'!K10","v":"2025-11-18"},6,{"$f":"+'Spielbogen 10er'!J10","v":"WB"},null,null,null,""," ",null,{"$f":"+'Anmeldegruppen Turniere'!AB23&\" - \"&W17","v":"31. / 01. 02. 2026 - 2. Antritt Einzel"},null,null,null,null,null,null,{"$f":"IF(S17>1,+S17/V17,\"\")","v":""},{"$f":"IF(S17>1,SUM($R$12:S17),\" \")","v":" "},{"$f":"IF(S17>0,6,0)","v":0},"2. Antritt Einzel"]
[null,null,null,{"$f":"+'Spielbogen 10er'!K11","v":"2026-01-13"},7,{"$f":"+'Spielbogen 10er'!J11","v":"OT"},null,null,null,""," ",null,{"$f":"+'Hilfstabelle Mannschaften'!I12&\" - \"&W18","v":"21. / 22. 03. 2026 - Frühjahrs-Mix"},null,null,null,null,null,null,{"$f":"IF(R18>1,+R18/V18,\"\")","v":""},{"$f":"IF(R18>1,SUM($R$12:S18),\" \")","v":" "},{"$f":"IF(R18,4,0)","v":0},"Frühjahrs-Mix"]
[null,null,null,{"$f":"+'Spielbogen 10er'!K12","v":"2026-01-27"},8,{"$f":"+'Spielbogen 10er'!J12","v":"WB"},null,null,null,""," ",null,{"$f":"+'Anmeldegruppen Turniere'!AB30&\" - \"&W19","v":"25. / 26. 04. 2026 - 1. Antritt Doppel"},null,null,null,null,null,null,{"$f":"IF(S19>1,+S19/V19,\"\")","v":""},{"$f":"IF(S19>1,SUM($R$12:S19),\" \")","v":" "},{"$f":"IF(S19>0,6,0)","v":0},"1. Antritt Doppel"]
[null,null,null,{"$f":"+'Spielbogen 10er'!K13","v":"2026-02-10"},9,{"$f":"+'Spielbogen 10er'!J13","v":"OT"},null,null,null,"",{"$f":"IF(G20>1,SUM(G20:I20)/3,\" \")","v":" "},null,{"$f":"+'Anmeldegruppen Turniere'!AB31&\" - \"&W20","v":"09. / 10. 05. 2026 - 2. Antritt Doppel"},null,null,null,null,null,null,{"$f":"IF(S20>1,+S20/V20,\"\")","v":""},{"$f":"IF(S20>1,SUM($R$12:S20),\" \")","v":" "},{"$f":"IF(S20>0,6,0)","v":0},"2. Antritt Doppel"]
[null,null,null,{"$f":"+'Spielbogen 10er'!K14","v":"2026-02-24"},10,{"$f":"+'Spielbogen 10er'!J14","v":"WB"},null,null,null,"",{"$f":"IF(G21>1,SUM(G21:I21)/3,\" \")","v":" "}]
[null,null,null,{"$f":"+'Spielbogen 10er'!K15","v":"2026-03-10"},11,{"$f":"+'Spielbogen 10er'!J15","v":"OT"},null,null,null,""," "]
[null,null,null,{"$f":"+'Spielbogen 10er'!K16","v":"2026-03-24"},12,{"$f":"+'Spielbogen 10er'!J16","v":"WB"},null,null,null,""," "]
[null,null,null,{"$f":"+'Spielbogen 10er'!K17","v":"2026-04-07"},13,{"$f":"+'Spielbogen 10er'!J17","v":"OT"},null,null,null,""," "]
[null,null,null,{"$f":"+'Spielbogen 10er'!K18","v":"2026-04-21"},14,{"$f":"+'Spielbogen 10er'!J18","v":"WB"},null,null,null,{"$f":"IF(G25>1,+G25+H25+I25,\"\")","v":""},{"$f":"IF(G25>1,SUM(G25:I25)/3,\" \")","v":" "}]
[null,null,null,{"$f":"+\"Ausgeholfen in der 2 Mannschaft                                                     Anzahl Spiele:\"&\" \"&+COUNT(G27:I30)","v":"Ausgeholfen in der 2 Mannschaft                                                     Anzahl Spiele: 0"}]
[null,null,null,null,null,null,null,null,null,{"$f":"IF(G27>1,+G27+H27+I27,\"\")","v":""},{"$f":"IF(G27>1,SUM(G27:I27)/3,\" \")","v":" "}]
[null,null,null,null,null,null,null,null,null,{"$f":"IF(G28>1,+G28+H28+I28,\"\")","v":""},{"$f":"IF(G28>1,SUM(G28:I28)/3,\" \")","v":" "}]
[null,null,null,null,null,null,null,null,null,{"$f":"IF(G29>1,+G29+H29+I29,\"\")","v":""},{"$f":"IF(G29>1,SUM(G29:I29)/3,\" \")","v":" "}]
[null,null,null,null,null,null,null,null,null,{"$f":"IF(G30>1,+G30+H30+I30,\"\")","v":""},{"$f":"IF(G30>1,SUM(G30:I30)/3,\" \")","v":" "}]
[null,null,null,null,null,null,null,null,null,{"$f":"IF(G31>1,+G31+H31+I31,\"\")","v":""},{"$f":"IF(G31>1,SUM(G31:I31)/3,\" \")","v":" "}]

{"sheet":"Spielbogen 7er","index":17,"n_rows":49,"n_cols":19,"rows_kept":49,"cut":false,"hidden":true,"merged":[[33,12,33,13],[33,14,33,15],[33,16,33,17],[33,18,33,19],[31,6,31,7],[31,8,31,9],[31,10,31,11],[31,12,31,13],[31,14,31,15],[31,16,31,17],[31,18,31,19],[33,6,33,7],[33,8,33,9],[33,10,33,11],[35,18,35,19],[37,6,37,7],[37,8,37,9],[37,10,37,11],[37,12,37,13],[37,14,37,15],[37,16,37,17],[37,18,37,19],[35,6,35,7],[35,8,35,9],[35,10,35,11],[35,12,35,13],[35,14,35,15],[35,16,35,17],[43,18,43,19],[45,6,45,7],[45,8,45,9],[45,10,45,11],[45,12,45,13],[45,14,45,15],[45,16,45,17],[45,18,45,19],[43,6,43,7],[43,8,43,9],[43,10,43,11],[43,12,43,13],[43,14,43,15],[43,16,43,17],[39,18,39,19],[41,6,41,7],[41,8,41,9],[41,10,41,11],[41,12,41,13],[41,14,41,15],[41,16,41,17],[41,18,41,19],[39,6,39,7],[39,8,39,9],[39,10,39,11],[39,12,39,13],[39,14,39,15],[39,16,39,17],[29,18,29,19],[29,6,29,7],[29,8,29,9],[29,10,29,11],[29,12,29,13],[29,14,29,15],[29,16,29,17],[25,18,25,19],[27,6,27,7],[27,8,27,9],[27,10,27,11],[27,12,27,13],[27,14,27,15],[27,16,27,17],[27,18,27,19],[25,6,25,7],[25,8,25,9],[25,10,25,11],[25,12,25,13],[25,14,25,15],[25,16,25,17],[23,16,23,17],[23,18,23,19],[21,6,21,7],[21,16,21,17],[21,18,21,19],[21,14,21,15],[21,12,21,13],[21,10,21,11],[21,8,21,9],[45,2,45,5],[46,3,46,5],[47,2,47,5],[4,2,5,3],[4,5,5,5],[39,2,39,5],[40,3,40,5],[41,2,41,5],[42,3,42,5],[43,2,43,5],[44,3,44,5],[33,2,33,5],[34,3,34,5],[35,2,35,5],[36,3,36,5],[37,2,37,5],[38,3,38,5],[27,2,27,5],[28,3,28,5],[29,2,29,5],[30,3,30,5],[31,2,31,5],[32,3,32,5],[21,2,21,5],[22,3,22,5],[23,2,23,5],[24,3,24,5],[25,2,25,5],[26,3,26,5],[16,13,16,14],[18,3,18,5],[19,2,19,5],[20,3,20,5],[23,6,23,7],[23,8,23,9],[23,10,23,11],[23,12,23,13],[23,14,23,15],[14,3,14,7],[14,13,14,14],[15,3,15,7],[15,13,15,14],[12,3,12,7],[12,13,12,14],[13,3,13,7],[13,13,13,14],[10,3,10,7],[10,13,10,14],[11,3,11,7],[11,13,11,14],[8,13,8,14],[9,3,9,7],[9,13,9,14],[6,13,6,14],[7,13,7,14],[4,13,4,14],[5,13,5,14],[0,2,0,19],[1,2,1,9],[1,12,1,19],[2,12,2,14],[3,13,3,14]]}
["Start",null,"Betriebssportverband Hamburg e.V."]
["Rangliste",null," -  Sparte Bowling  -",null,null,null,null,null,null,null,null,null,"-  Spielsystembogen  -"]
[null,null,null,null,null,null,null,null,null,null," "," ","Antritt    Bahn",null,null,"Datum",null,"Ausrichter"]
[null,null,null,null,null,null,null,null,null,null,null,null,"1.","OT",null,"2024-09-12",null,1,{"$f":"I10","v":"PAN 1"}]
[null,null,"Klasse",null,null,{"$f":"+'Hilfstabelle Mannschaften'!I4","v":"B2"},null,null,null,null,null,null,"2.","OT",null,"2024-09-26",null,2,{"$f":"I11","v":"DAT 2"}]
[null,null,null,null,null,null,null,null,null,null," ",null,"3.","WB",null,"2024-10-10",null,3,{"$f":"I12","v":"STI 3"}]
[null,null,null,null,null,null,null,null,null,null,null,null,"4.","OT",null,"2024-10-24",null,4,"SGS 1"]
[null,null,null,null,null,null,null,null,null," ",null,null,"5.","WB",null,"2024-11-07",null,5,"JUS 2"]
[null,null,null,"BSG",null,null,null,null,"Kurzf.",null,null,null,"6.","WB",null,"2025-01-16",null,6,"P2 2"]
[null,null,1,"Panasonic 1",null,null,null,null,"PAN 1",null,null,null,"7.","OT",null,"2025-01-30",null,7,"KS 2"]
[null,null,2,"Dataport 2",null,null,null,null,"DAT 2",null,null,null,"8.","WB",null,"2025-02-13",null,1,{"$f":"I10","v":"PAN 1"}]
[null,null,3,"Still 3",null,null,null,null,"STI 3",null,null,null,"9.","OT",null,"2025-02-27",null,2,{"$f":"I11","v":"DAT 2"}]
[null,null,4,"SG Stern Hamburg 1",null,null,null,null,"SGS 1",null,null,null,"10.","WB",null,"2025-03-13",null,3,"STI 3"]
[null,null,5,"Justitzbehörde 2",null,null,null,null,"JUS 2",null,null,null,"11.","OT",null,"2025-03-27",null,4,"SGS 1"]
[null,null,6,"Postamt 2",null,null,null,null,"P2 2",null,null,null,"12.","WB",null,"2025-04-10",null,5,"JUS 2"]
[null,null,7,"Körber Sports 2",null,null,null,null,"KS 2",null,null,null,"13.","OT",null,"2025-04-24",null,6,"P2 2"]
[null,null,null,null,null,null,null,null,null,null,null,null,"14.","WB",null,"2025-05-08",null,7,{"$f":"I16","v":"KS 2"}]
[null,null,null,null,null,null,null,null,null,null,null,null,null," "]
[null,null,"Antritt","Halle"]
[null,null,"Datum"]
[null,null,"1 . A.","OT",null,null,7,null,6,null,4,null,5,null,3,null,1,null,2]
[null,null,"2024-09-12",null,null,null,{"$f":"VLOOKUP(G21,$C$10:$J$17,7,0)","v":"KS 2"},null,{"$f":"VLOOKUP(I21,$C$10:$J$17,7,0)","v":"P2 2"},null,{"$f":"VLOOKUP(K21,$C$10:$J$17,7,0)","v":"SGS 1"},null,{"$f":"VLOOKUP(M21,$C$10:$J$17,7,0)","v":"JUS 2"},null,{"$f":"VLOOKUP(O21,$C$10:$J$17,7,0)","v":"STI 3"},null,{"$f":"VLOOKUP(Q21,$C$10:$J$17,7,0)","v":"PAN 1"},null,{"$f":"VLOOKUP(S21,$C$10:$J$17,7,0)","v":"DAT 2"}]
[null,null,"2 . A.","OT",null,null,3,null,4,null,2,null,1,null,5,null,6,null,7]
[null,null,"2024-09-26",null,null,null,{"$f":"VLOOKUP(G23,$C$10:$J$17,7,0)","v":"STI 3"},null,{"$f":"VLOOKUP(I23,$C$10:$J$17,7,0)","v":"SGS 1"},null,{"$f":"VLOOKUP(K23,$C$10:$J$17,7,0)","v":"DAT 2"},null,{"$f":"VLOOKUP(M23,$C$10:$J$17,7,0)","v":"PAN 1"},null,{"$f":"VLOOKUP(O23,$C$10:$J$17,7,0)","v":"JUS 2"},null,{"$f":"VLOOKUP(Q23,$C$10:$J$17,7,0)","v":"P2 2"},null,{"$f":"VLOOKUP(S23,$C$10:$J$17,7,0)","v":"KS 2"}]
[null,null,"3 . A.","WB",null,null,5,null,7,null,3,null,2,null,1,null,4,null,6]
[null,null,"2024-10-10",null,null,null,{"$f":"VLOOKUP(G25,$C$10:$J$17,7,0)","v":"JUS 2"},null,{"$f":"VLOOKUP(I25,$C$10:$J$17,7,0)","v":"KS 2"},null,{"$f":"VLOOKUP(K25,$C$10:$J$17,7,0)","v":"STI 3"},null,{"$f":"VLOOKUP(M25,$C$10:$J$17,7,0)","v":"DAT 2"},null,{"$f":"VLOOKUP(O25,$C$10:$J$17,7,0)","v":"PAN 1"},null,{"$f":"VLOOKUP(Q25,$C$10:$J$17,7,0)","v":"SGS 1"},null,{"$f":"VLOOKUP(S25,$C$10:$J$17,7,0)","v":"P2 2"}]
[null,null,"4 . A.","OT",null,null,4,null,2,null,6,null,1,null,7,null,3,null,5]
[null,null," 24.10.24",null,null,null,{"$f":"VLOOKUP(G27,$C$10:$J$17,7,0)","v":"SGS 1"},null,{"$f":"VLOOKUP(I27,$C$10:$J$17,7,0)","v":"DAT 2"},null,{"$f":"VLOOKUP(K27,$C$10:$J$17,7,0)","v":"P2 2"},null,{"$f":"VLOOKUP(M27,$C$10:$J$17,7,0)","v":"PAN 1"},null,{"$f":"VLOOKUP(O27,$C$10:$J$17,7,0)","v":"KS 2"},null,{"$f":"VLOOKUP(Q27,$C$10:$J$17,7,0)","v":"STI 3"},null,{"$f":"VLOOKUP(S27,$C$10:$J$17,7,0)","v":"JUS 2"}]
[null,null,"5 . A.","WB",null,null,1,null,5,null,2,null,7,null,4,null,6,null,3]
[null,null,"2024-11-07",null,null,null,{"$f":"VLOOKUP(G29,$C$10:$J$17,7,0)","v":"PAN 1"},null,{"$f":"VLOOKUP(I29,$C$10:$J$17,7,0)","v":"JUS 2"},null,{"$f":"VLOOKUP(K29,$C$10:$J$17,7,0)","v":"DAT 2"},null,{"$f":"VLOOKUP(M29,$C$10:$J$17,7,0)","v":"KS 2"},null,{"$f":"VLOOKUP(O29,$C$10:$J$17,7,0)","v":"SGS 1"},null,{"$f":"VLOOKUP(Q29,$C$10:$J$17,7,0)","v":"P2 2"},null,{"$f":"VLOOKUP(S29,$C$10:$J$17,7,0)","v":"STI 3"}]
[null,null,"6 . A.","WB",null,null,6,null,3,null,7,null,4,null,2,null,5,null,1]
[null,null,"2025-01-16",null,null,null,{"$f":"VLOOKUP(G31,$C$10:$J$17,7,0)","v":"P2 2"},null,{"$f":"VLOOKUP(I31,$C$10:$J$17,7,0)","v":"STI 3"},null,{"$f":"VLOOKUP(K31,$C$10:$J$17,7,0)","v":"KS 2"},null,{"$f":"VLOOKUP(M31,$C$10:$J$17,7,0)","v":"SGS 1"},null,{"$f":"VLOOKUP(O31,$C$10:$J$17,7,0)","v":"DAT 2"},null,{"$f":"VLOOKUP(Q31,$C$10:$J$17,7,0)","v":"JUS 2"},null,{"$f":"VLOOKUP(S31,$C$10:$J$17,7,0)","v":"PAN 1"}]
[null,null,"7 . A.","OT",null,null,7,null,1,null,5,null,3,null,6,null,2,null,4]
[null,null,"2025-01-30",null,null,null,{"$f":"VLOOKUP(G33,$C$10:$J$17,7,0)","v":"KS 2"},null,{"$f":"VLOOKUP(I33,$C$10:$J$17,7,0)","v":"PAN 1"},null,{"$f":"VLOOKUP(K33,$C$10:$J$17,7,0)","v":"JUS 2"},null,{"$f":"VLOOKUP(M33,$C$10:$J$17,7,0)","v":"STI 3"},null,{"$f":"VLOOKUP(O33,$C$10:$J$17,7,0)","v":"P2 2"},null,{"$f":"VLOOKUP(Q33,$C$10:$J$17,7,0)","v":"DAT 2"},null,{"$f":"VLOOKUP(S33,$C$10:$J$17,7,0)","v":"SGS 1"}]
[null,null,"8 . A.","WB",null,null,5,null,2,null,1,null,4,null,3,null,7,null,6]
[null,null,"2025-02-13",null,null,null,{"$f":"VLOOKUP(G35,$C$10:$J$17,7,0)","v":"JUS 2"},null,{"$f":"VLOOKUP(I35,$C$10:$J$17,7,0)","v":"DAT 2"},null,{"$f":"VLOOKUP(K35,$C$10:$J$17,7,0)","v":"PAN 1"},null,{"$f":"VLOOKUP(M35,$C$10:$J$17,7,0)","v":"SGS 1"},null,{"$f":"VLOOKUP(O35,$C$10:$J$17,7,0)","v":"STI 3"},null,{"$f":"VLOOKUP(Q35,$C$10:$J$17,7,0)","v":"KS 2"},null,{"$f":"VLOOKUP(S35,$C$10:$J$17,7,0)","v":"P2 2"}]
[null,null,"9 . A.","OT",null,null,2,null,4,null,3,null,6,null,7,null,1,null,5]
[null,null,"2025-02-27",null,null,null,{"$f":"VLOOKUP(G37,$C$10:$J$17,7,0)","v":"DAT 2"},null,{"$f":"VLOOKUP(I37,$C$10:$J$17,7,0)","v":"SGS 1"},null,{"$f":"VLOOKUP(K37,$C$10:$J$17,7,0)","v":"STI 3"},null,{"$f":"VLOOKUP(M37,$C$10:$J$17,7,0)","v":"P2 2"},null,{"$f":"VLOOKUP(O37,$C$10:$J$17,7,0)","v":"KS 2"},null,{"$f":"VLOOKUP(Q37,$C$10:$J$17,7,0)","v":"PAN 1"},null,{"$f":"VLOOKUP(S37,$C$10:$J$17,7,0)","v":"JUS 2"}]
[null,null,"10 . A.","WB",null,null,3,null,1,null,5,null,7,null,6,null,4,null,2]
[null,null,"2025-03-13",null,null,null,{"$f":"VLOOKUP(G39,$C$10:$J$17,7,0)","v":"STI 3"},null,{"$f":"VLOOKUP(I39,$C$10:$J$17,7,0)","v":"PAN 1"},null,{"$f":"VLOOKUP(K39,$C$10:$J$17,7,0)","v":"JUS 2"},null,{"$f":"VLOOKUP(M39,$C$10:$J$17,7,0)","v":"KS 2"},null,{"$f":"VLOOKUP(O39,$C$10:$J$17,7,0)","v":"P2 2"},null,{"$f":"VLOOKUP(Q39,$C$10:$J$17,7,0)","v":"SGS 1"},null,{"$f":"VLOOKUP(S39,$C$10:$J$17,7,0)","v":"DAT 2"}]
[null,null,"11 . A.","OT",null,null,6,null,5,null,4,null,3,null,1,null,2,null,7]
[null,null,"2025-03-27",null,null,null,{"$f":"VLOOKUP(G41,$C$10:$J$17,7,0)","v":"P2 2"},null,{"$f":"VLOOKUP(I41,$C$10:$J$17,7,0)","v":"JUS 2"},null,{"$f":"VLOOKUP(K41,$C$10:$J$17,7,0)","v":"SGS 1"},null,{"$f":"VLOOKUP(M41,$C$10:$J$17,7,0)","v":"STI 3"},null,{"$f":"VLOOKUP(O41,$C$10:$J$17,7,0)","v":"PAN 1"},null,{"$f":"VLOOKUP(Q41,$C$10:$J$17,7,0)","v":"DAT 2"},null,{"$f":"VLOOKUP(S41,$C$10:$J$17,7,0)","v":"KS 2"}]
[null,null,"12 . A.","WB",null,null,2,null,3,null,7,null,6,null,4,null,5,null,1]
[null,null,"2025-04-10",null,null,null,{"$f":"VLOOKUP(G43,$C$10:$J$17,7,0)","v":"DAT 2"},null,{"$f":"VLOOKUP(I43,$C$10:$J$17,7,0)","v":"STI 3"},null,{"$f":"VLOOKUP(K43,$C$10:$J$17,7,0)","v":"KS 2"},null,{"$f":"VLOOKUP(M43,$C$10:$J$17,7,0)","v":"P2 2"},null,{"$f":"VLOOKUP(O43,$C$10:$J$17,7,0)","v":"SGS 1"},null,{"$f":"VLOOKUP(Q43,$C$10:$J$17,7,0)","v":"JUS 2"},null,{"$f":"VLOOKUP(S43,$C$10:$J$17,7,0)","v":"PAN 1"}]
[null,null,"13 . A.","OT",null,null,1,null,6,null,3,null,5,null,2,null,7,null,4]
[null,null,"2025-04-24",null,null,null,{"$f":"VLOOKUP(G45,$C$10:$J$17,7,0)","v":"PAN 1"},null,{"$f":"VLOOKUP(I45,$C$10:$J$17,7,0)","v":"P2 2"},null,{"$f":"VLOOKUP(K45,$C$10:$J$17,7,0)","v":"STI 3"},null,{"$f":"VLOOKUP(M45,$C$10:$J$17,7,0)","v":"JUS 2"},null,{"$f":"VLOOKUP(O45,$C$10:$J$17,7,0)","v":"DAT 2"},null,{"$f":"VLOOKUP(Q45,$C$10:$J$17,7,0)","v":"KS 2"},null,{"$f":"VLOOKUP(S45,$C$10:$J$17,7,0)","v":"SGS 1"}]
[null,null,"14 . A.","WB",null,null,"6 .",null,"7 .",null,"3 .",null,"4 .",null,"1 .",null,"2 .",null,"5 ."]
[null,null,"2025-05-08",null,null,null,null,null,null,null," ",null,null,null," "]
[null,null,"Stand Mai 2015"]

{"sheet":"Hilfstabelle Mannschaften","index":18,"n_rows":91,"n_cols":79,"rows_kept":91,"cut":false,"hidden":true,"merged":[[57,66,59,77],[57,78,59,89],[60,66,64,77],[60,78,64,89],[65,66,67,77],[65,78,67,89],[44,66,48,77],[49,66,51,77],[44,78,48,89],[49,78,51,89],[52,66,56,77],[52,78,56,89],[68,78,72,89],[73,78,75,89],[68,66,72,77],[76,66,80,77],[81,53,82,63],[81,66,83,77],[81,78,83,89],[76,78,80,89],[73,66,75,77],[77,53,80,63],[44,53,48,63],[49,53,50,63],[57,48,58,50],[57,53,58,63],[53,53,56,63],[53,48,56,50],[61,53,64,63],[65,53,66,63],[69,48,72,50],[73,48,74,50],[69,53,72,63],[73,53,74,63],[61,48,64,50],[65,48,66,50],[87,16,87,27],[42,16,42,27],[47,16,47,27],[52,16,52,27],[57,16,57,27],[62,16,62,27],[67,16,67,27],[72,16,72,27],[77,16,77,27],[1,46,1,48],[0,7,0,9],[1,1,1,5],[1,7,1,8],[82,16,82,27],[37,16,37,27],[0,16,0,27],[22,16,22,27],[27,16,27,27],[32,16,32,27],[44,48,48,50],[49,48,50,50],[81,48,82,50],[77,48,80,50],[5,7,8,7],[0,2,0,3]]}
[null,null,"Spielbogen",null,null,null,null,null,null,null,null,null,null,null,null,null,{"$f":"\"1. Mannschaft \"&$I$4","v":"1. Mannschaft B2"}]
[null,"1. Mannschaft Ausrichter",null,null,null,null,null,"Mannschaftsklassen",null,null,null,"Übersicht aller Mannschaften / Pins",null,null,null,null,null,null,null,null,null,null,"7er","8er","9er","10er","11er","12er"]
[null,"Antritt","Datum","Bahn","BSG","BSG-Kurzf.",null,"Mannschaft","Klasse",null,null,"1. Mannschaft","Pins",null,null,null,{"$f":"+Hilfstabelle!$AA$9","v":"EAG 1"},{"$f":"+Hilfstabelle!$AB$9","v":"ESV 2"},{"$f":"+Hilfstabelle!$AC$9","v":"AXA 1"},{"$f":"+Hilfstabelle!$AD$9","v":"ERG 3"},{"$f":"+Hilfstabelle!$AE$9","v":"DAT 2"},{"$f":"+Hilfstabelle!$AF$9","v":"PAN 1"},{"$f":"+Hilfstabelle!$AG$9","v":"GEN 3"},{"$f":"+Hilfstabelle!$AH$9","v":"FAH 3"},{"$f":"+Hilfstabelle!$AI$9","v":"HAS 5"},{"$f":"+Hilfstabelle!$AJ$9","v":"BWV 5"},{"$f":"+Hilfstabelle!$AK$9","v":"EAG 1"}]
[null,{"$f":"+'Spielbogen 7er'!$M$4","v":"1."},{"$f":"+'Spielbogen 10er'!$K$5","v":"2025-09-09"},{"$f":"+'Spielbogen 10er'!$J$5","v":"OT"},{"$f":"+'Spielbogen 10er'!$D$9","v":"Eppendorf AG 1"},{"$f":"+'Spielbogen 10er'!$M$5","v":"EAG 1"},null,"1. Mannschaft","B2",null,null,{"$f":"+$E$4","v":"Eppendorf AG 1"},{"$f":"+'Übersicht der Klasse B4'!$F$8","v":8859},null,null,"1. Antritt",{"$f":"+'Übersicht der Klasse B4'!$H$8","v":1886},{"$f":"+'Übersicht der Klasse B4'!$H$10","v":1512},{"$f":"+'Übersicht der Klasse B4'!$H$12","v":1599},{"$f":"+'Übersicht der Klasse B4'!$H$14","v":1547},{"$f":"+'Übersicht der Klasse B4'!$H$16","v":1817},{"$f":"+'Übersicht der Klasse B4'!$H$18","v":1921},{"$f":"+'Übersicht der Klasse B4'!$H$20","v":1734},{"$f":"+'Übersicht der Klasse B4'!$H$22","v":1951},{"$f":"+'Übersicht der Klasse B4'!$H$24","v":1756},{"$f":"+'Übersicht der Klasse B4'!$H$26","v":1827},{"$f":"+'Übersicht der Klasse B4'!$H$28","v":1886},{"$f":"+'Übersicht der Klasse B4'!$H$30","v":0}]
[null,{"$f":"+'Spielbogen 7er'!$M$5","v":"2."},{"$f":"+'Spielbogen 10er'!$K$6","v":"2025-09-23"},{"$f":"+'Spielbogen 10er'!$J$6","v":"WB"},{"$f":"+'Spielbogen 10er'!$D$10","v":"Energie Sportvereinigung 2"},{"$f":"+'Spielbogen 10er'!$M$6","v":"ESV 2"},null,null,null,null,null,{"$f":"+$E$5","v":"Energie Sportvereinigung 2"},{"$f":"+'Übersicht der Klasse B4'!$F$10","v":7877},null,null,"2. Antritt",{"$f":"+'Übersicht der Klasse B4'!$I$8","v":1744},{"$f":"+'Übersicht der Klasse B4'!$I$10","v":1687},{"$f":"+'Übersicht der Klasse B4'!$I$12","v":2044},{"$f":"+'Übersicht der Klasse B4'!$I$14","v":1586},{"$f":"+'Übersicht der Klasse B4'!$I$16","v":1967},{"$f":"+'Übersicht der Klasse B4'!$I$18","v":1955},{"$f":"+'Übersicht der Klasse B4'!$I$20","v":1646},{"$f":"+'Übersicht der Klasse B4'!$I$22","v":1438},{"$f":"+'Übersicht der Klasse B4'!$I$24","v":1854},{"$f":"+'Übersicht der Klasse B4'!$I$26","v":1835},{"$f":"+'Übersicht der Klasse B4'!$I$28","v":1886},{"$f":"+'Übersicht der Klasse B4'!$I$30","v":0}]
[null,{"$f":"+'Spielbogen 7er'!$M$6","v":"3."},{"$f":"+'Spielbogen 10er'!$K$7","v":"2025-10-07"},{"$f":"+'Spielbogen 10er'!$J$7","v":"OT"},{"$f":"+'Spielbogen 10er'!$D$11","v":"AXA 1"},{"$f":"+'Spielbogen 10er'!$M$7","v":"AXA 1"},null,"PUNKTSPIELSAISON ","2025/2026",null,null,{"$f":"+$E$6","v":"AXA 1"},{"$f":"+'Übersicht der Klasse B4'!$F$12","v":9487},null,null,"3. Antritt",{"$f":"+'Übersicht der Klasse B4'!$J$8","v":1556},{"$f":"+'Übersicht der Klasse B4'!$J$10","v":1438},{"$f":"+'Übersicht der Klasse B4'!$J$12","v":1865},{"$f":"+'Übersicht der Klasse B4'!$J$14","v":1696},{"$f":"+'Übersicht der Klasse B4'!$J$16","v":1661},{"$f":"+'Übersicht der Klasse B4'!$J$18","v":1847},{"$f":"+'Übersicht der Klasse B4'!$J$20","v":1758},{"$f":"+'Übersicht der Klasse B4'!$J$22","v":1588},{"$f":"+'Übersicht der Klasse B4'!$J$24","v":1928},{"$f":"+'Übersicht der Klasse B4'!$J$26","v":1746},{"$f":"+'Übersicht der Klasse B4'!$J$28","v":1886},{"$f":"+'Übersicht der Klasse B4'!$J$30","v":0}]
[null,{"$f":"+'Spielbogen 7er'!$M$7","v":"4."},{"$f":"+'Spielbogen 10er'!$K$8","v":"2025-10-21"},{"$f":"+'Spielbogen 10er'!$J$8","v":"WB"},{"$f":"+'Spielbogen 10er'!$D$12","v":"ERGO Sports 3"},{"$f":"+'Spielbogen 10er'!$M$8","v":"ERG 3"},null,null,"24/25",null,null,{"$f":"+$E$7","v":"ERGO Sports 3"},{"$f":"+'Übersicht der Klasse B4'!$F$14","v":8054},null,null,"4. Antritt",{"$f":"+'Übersicht der Klasse B4'!$K$8","v":2006},{"$f":"+'Übersicht der Klasse B4'!$K$10","v":1569},{"$f":"+'Übersicht der Klasse B4'!$K$12","v":2034},{"$f":"+'Übersicht der Klasse B4'!$K$14","v":1656},{"$f":"+'Übersicht der Klasse B4'!$K$16","v":2005},{"$f":"+'Übersicht der Klasse B4'!$K$18","v":2032},{"$f":"+'Übersicht der Klasse B4'!$K$20","v":1845},{"$f":"+'Übersicht der Klasse B4'!$K$22","v":1671},{"$f":"+'Übersicht der Klasse B4'!$K$24","v":1792},{"$f":"+'Übersicht der Klasse B4'!$K$26","v":2024},{"$f":"+'Übersicht der Klasse B4'!$K$28","v":1886},{"$f":"+'Übersicht der Klasse B4'!$K$30","v":0}]
[null,{"$f":"+'Spielbogen 7er'!$M$8","v":"5."},{"$f":"+'Spielbogen 10er'!$K$9","v":"2025-11-04"},{"$f":"+'Spielbogen 10er'!$J$9","v":"OT"},{"$f":"+'Spielbogen 10er'!$D$13","v":"Dataport 2"},{"$f":"+'Spielbogen 10er'!$M$9","v":"DAT 2"},null,null,{"$f":"+I6","v":"2025/2026"},null,null,{"$f":"+$E$8","v":"Dataport 2"},{"$f":"+'Übersicht der Klasse B4'!$F$16","v":9425},null,null,"5. Antritt",{"$f":"+'Übersicht der Klasse B4'!$L$8","v":1667},{"$f":"+'Übersicht der Klasse B4'!$L$10","v":1671},{"$f":"+'Übersicht der Klasse B4'!$L$12","v":1945},{"$f":"+'Übersicht der Klasse B4'!$L$14","v":1569},{"$f":"+'Übersicht der Klasse B4'!$L$16","v":1975},{"$f":"+'Übersicht der Klasse B4'!$L$18","v":1879},{"$f":"+'Übersicht der Klasse B4'!$L$20","v":1789},{"$f":"+'Übersicht der Klasse B4'!$L$22","v":1575},{"$f":"+'Übersicht der Klasse B4'!$L$24","v":1770},{"$f":"+'Übersicht der Klasse B4'!$L$26","v":1295},{"$f":"+'Übersicht der Klasse B4'!$L$28","v":1886},{"$f":"+'Übersicht der Klasse B4'!$L$30","v":0}]
[null,{"$f":"+'Spielbogen 7er'!$M$9","v":"6."},{"$f":"+'Spielbogen 10er'!$K$10","v":"2025-11-18"},{"$f":"+'Spielbogen 10er'!$J$10","v":"WB"},{"$f":"+'Spielbogen 10er'!$D$14","v":"Panasonic 1"},{"$f":"+'Spielbogen 10er'!$M$10","v":"PAN 1"},null,null,"2024/2025",null,null,{"$f":"+$E$9","v":"Panasonic 1"},{"$f":"+'Übersicht der Klasse B4'!$F$18","v":9634},null,null,"6. Antritt",{"$f":"+'Übersicht der Klasse B4'!$M$8","v":0},{"$f":"+'Übersicht der Klasse B4'!$M$10","v":0},{"$f":"+'Übersicht der Klasse B4'!$M$12","v":0},{"$f":"+'Übersicht der Klasse B4'!$M$14","v":0},{"$f":"+'Übersicht der Klasse B4'!$M$16","v":0},{"$f":"+'Übersicht der Klasse B4'!$M$18","v":0},{"$f":"+'Übersicht der Klasse B4'!$M$20","v":0},{"$f":"+'Übersicht der Klasse B4'!$M$22","v":0},{"$f":"+'Übersicht der Klasse B4'!$M$24","v":0},{"$f":"+'Übersicht der Klasse B4'!$M$26","v":0},{"$f":"+'Übersicht der Klasse B4'!$M$28","v":1886},{"$f":"+'Übersicht der Klasse B4'!$M$30","v":0}]
[null,{"$f":"+'Spielbogen 7er'!$M$10","v":"7."},{"$f":"+'Spielbogen 10er'!$K$11","v":"2026-01-13"},{"$f":"+'Spielbogen 10er'!$J$11","v":"OT"},{"$f":"+'Spielbogen 10er'!$D$15","v":"Generali 3"},{"$f":"+'Spielbogen 10er'!$M$11","v":"GEN 3"},null,null,null,null,null,{"$f":"+$E$10","v":"Generali 3"},{"$f":"+'Übersicht der Klasse B4'!$F$20","v":8772},null,null,"7. Antritt",{"$f":"+'Übersicht der Klasse B4'!$N$8","v":0},{"$f":"+'Übersicht der Klasse B4'!$N$10","v":0},{"$f":"+'Übersicht der Klasse B4'!$N$12","v":0},{"$f":"+'Übersicht der Klasse B4'!$N$14","v":0},{"$f":"+'Übersicht der Klasse B4'!$N$16","v":0},{"$f":"+'Übersicht der Klasse B4'!$N$18","v":0},{"$f":"+'Übersicht der Klasse B4'!$N$20","v":0},{"$f":"+'Übersicht der Klasse B4'!$N$22","v":0},{"$f":"+'Übersicht der Klasse B4'!$N$24","v":0},{"$f":"+'Übersicht der Klasse B4'!$N$26","v":0},{"$f":"+'Übersicht der Klasse B4'!$N$28","v":1886},{"$f":"+'Übersicht der Klasse B4'!$N$30","v":0}]
[null,{"$f":"+'Spielbogen 7er'!$M$11","v":"8."},{"$f":"+'Spielbogen 10er'!$K$12","v":"2026-01-27"},{"$f":"+'Spielbogen 10er'!$J$12","v":"WB"},{"$f":"+'Spielbogen 10er'!$D$16","v":"Finanzamt 3"},{"$f":"+'Spielbogen 10er'!$M$12","v":"FAH 3"},null,"Herbst-Mix","15. / 16. 11. 2025",null,null,{"$f":"+$E$11","v":"Finanzamt 3"},{"$f":"+'Übersicht der Klasse B4'!$F$22","v":8223},null,null,"8. Antritt",{"$f":"+'Übersicht der Klasse B4'!$O$8","v":0},{"$f":"+'Übersicht der Klasse B4'!$O$10","v":0},{"$f":"+'Übersicht der Klasse B4'!$O$12","v":0},{"$f":"+'Übersicht der Klasse B4'!$O$14","v":0},{"$f":"+'Übersicht der Klasse B4'!$O$16","v":0},{"$f":"+'Übersicht der Klasse B4'!$O$18","v":0},{"$f":"+'Übersicht der Klasse B4'!$O$20","v":0},{"$f":"+'Übersicht der Klasse B4'!$O$22","v":0},{"$f":"+'Übersicht der Klasse B4'!$O$24","v":0},{"$f":"+'Übersicht der Klasse B4'!$O$26","v":0},{"$f":"+'Übersicht der Klasse B4'!$O$28","v":1886},{"$f":"+'Übersicht der Klasse B4'!$O$30","v":0}]
[null,{"$f":"+'Spielbogen 7er'!$M$12","v":"9."},{"$f":"+'Spielbogen 10er'!$K$13","v":"2026-02-10"},{"$f":"+'Spielbogen 10er'!$J$13","v":"OT"},{"$f":"+'Spielbogen 10er'!$D$17","v":"HASPA 5"},{"$f":"+'Spielbogen 10er'!$M$13","v":"HAS 5"},null,"Frühjahrs-Mix","21. / 22. 03. 2026",null,null,{"$f":"+$E$12","v":"HASPA 5"},{"$f":"+'Übersicht der Klasse B4'!$F$24","v":9100},null,null,"9. Antritt",{"$f":"+'Übersicht der Klasse B4'!$P$8","v":0},{"$f":"+'Übersicht der Klasse B4'!$P$10","v":0},{"$f":"+'Übersicht der Klasse B4'!$P$12","v":0},{"$f":"+'Übersicht der Klasse B4'!$P$14","v":0},{"$f":"+'Übersicht der Klasse B4'!$P$16","v":0},{"$f":"+'Übersicht der Klasse B4'!$P$18","v":0},{"$f":"+'Übersicht der Klasse B4'!$P$20","v":0},{"$f":"+'Übersicht der Klasse B4'!$P$22","v":0},{"$f":"+'Übersicht der Klasse B4'!$P$24","v":0},{"$f":"+'Übersicht der Klasse B4'!$P$26","v":0},{"$f":"+'Übersicht der Klasse B4'!$P$28","v":1886},{"$f":"+'Übersicht der Klasse B4'!$P$30","v":0}]
[null,{"$f":"+'Spielbogen 7er'!$M$13","v":"10."},{"$f":"+'Spielbogen 10er'!$K$14","v":"2026-02-24"},{"$f":"+'Spielbogen 10er'!$J$14","v":"WB"},{"$f":"+'Spielbogen 10er'!$D$18","v":"BWVL 5"},{"$f":"+'Spielbogen 10er'!$M$14","v":"BWV 5"},null,null,null,null,null,{"$f":"+$E$13","v":"BWVL 5"},{"$f":"+'Übersicht der Klasse B4'!$F$26","v":8727},null,null,"10. Antritt",{"$f":"+'Übersicht der Klasse B4'!$Q$8","v":0},{"$f":"+'Übersicht der Klasse B4'!$Q$10","v":0},{"$f":"+'Übersicht der Klasse B4'!$Q$12","v":0},{"$f":"+'Übersicht der Klasse B4'!$Q$14","v":0},{"$f":"+'Übersicht der Klasse B4'!$Q$16","v":0},{"$f":"+'Übersicht der Klasse B4'!$Q$18","v":0},{"$f":"+'Übersicht der Klasse B4'!$Q$20","v":0},{"$f":"+'Übersicht der Klasse B4'!$Q$22","v":0},{"$f":"+'Übersicht der Klasse B4'!$Q$24","v":0},{"$f":"+'Übersicht der Klasse B4'!$Q$26","v":0},{"$f":"+'Übersicht der Klasse B4'!$Q$28","v":1886},{"$f":"+'Übersicht der Klasse B4'!$Q$30","v":0}]
[null,{"$f":"+'Spielbogen 7er'!$M$14","v":"11."},{"$f":"+'Spielbogen 10er'!$K$15","v":"2026-03-10"},{"$f":"+'Spielbogen 10er'!$J$15","v":"OT"},{"$f":"+$E$4","v":"Eppendorf AG 1"},{"$f":"+$F$4","v":"EAG 1"},null,null,null,null,null,{"$f":"+$E$14","v":"Eppendorf AG 1"},{"$f":"+'Übersicht der Klasse B4'!$F$28","v":26404},null,null,"11. Antritt",{"$f":"+'Übersicht der Klasse B4'!$R$8","v":0},{"$f":"+'Übersicht der Klasse B4'!$R$10","v":0},{"$f":"+'Übersicht der Klasse B4'!$R$12","v":0},{"$f":"+'Übersicht der Klasse B4'!$R$14","v":0},{"$f":"+'Übersicht der Klasse B4'!$R$16","v":0},{"$f":"+'Übersicht der Klasse B4'!$R$18","v":0},{"$f":"+'Übersicht der Klasse B4'!$R$20","v":0},{"$f":"+'Übersicht der Klasse B4'!$R$22","v":0},{"$f":"+'Übersicht der Klasse B4'!$R$24","v":0},{"$f":"+'Übersicht der Klasse B4'!$R$26","v":0},{"$f":"+'Übersicht der Klasse B4'!$R$28","v":1886},{"$f":"+'Übersicht der Klasse B4'!$R$30","v":0}]
[null,{"$f":"+'Spielbogen 7er'!$M$15","v":"12."},{"$f":"+'Spielbogen 10er'!$K$16","v":"2026-03-24"},{"$f":"+'Spielbogen 10er'!$J$16","v":"WB"},{"$f":"+$E$5","v":"Energie Sportvereinigung 2"},{"$f":"+$F$5","v":"ESV 2"},null,null,null,null,null,null,null,null,null,"12. Antritt",{"$f":"+'Übersicht der Klasse B4'!$S$8","v":0},{"$f":"+'Übersicht der Klasse B4'!$S$10","v":0},{"$f":"+'Übersicht der Klasse B4'!$S$12","v":0},{"$f":"+'Übersicht der Klasse B4'!$S$14","v":0},{"$f":"+'Übersicht der Klasse B4'!$S$16","v":0},{"$f":"+'Übersicht der Klasse B4'!$S$18","v":0},{"$f":"+'Übersicht der Klasse B4'!$S$20","v":0},{"$f":"+'Übersicht der Klasse B4'!$S$22","v":0},{"$f":"+'Übersicht der Klasse B4'!$S$24","v":0},{"$f":"+'Übersicht der Klasse B4'!$S$26","v":0},{"$f":"+'Übersicht der Klasse B4'!$S$28","v":1886},{"$f":"+'Übersicht der Klasse B4'!$S$30","v":0}]
[null,{"$f":"+'Spielbogen 7er'!$M$16","v":"13."},{"$f":"+'Spielbogen 10er'!$K$17","v":"2026-04-07"},{"$f":"+'Spielbogen 10er'!$J$17","v":"OT"},{"$f":"+$E$6","v":"AXA 1"},{"$f":"+$F$6","v":"AXA 1"},null,null,null,null,null,null,null,null,null,"13. Antritt",{"$f":"+'Übersicht der Klasse B4'!$T$8","v":0},{"$f":"+'Übersicht der Klasse B4'!$T$10","v":0},{"$f":"+'Übersicht der Klasse B4'!$T$12","v":0},{"$f":"+'Übersicht der Klasse B4'!$T$14","v":0},{"$f":"+'Übersicht der Klasse B4'!$T$16","v":0},{"$f":"+'Übersicht der Klasse B4'!$T$18","v":0},{"$f":"+'Übersicht der Klasse B4'!$T$20","v":0},{"$f":"+'Übersicht der Klasse B4'!$T$22","v":0},{"$f":"+'Übersicht der Klasse B4'!$T$24","v":0},{"$f":"+'Übersicht der Klasse B4'!$T$26","v":0},{"$f":"+'Übersicht der Klasse B4'!$T$28","v":1886},{"$f":"+'Übersicht der Klasse B4'!$T$30","v":0}]
[null,{"$f":"+'Spielbogen 7er'!$M$17","v":"14."},{"$f":"+'Spielbogen 10er'!$K$18","v":"2026-04-21"},{"$f":"+'Spielbogen 10er'!$J$18","v":"WB"},{"$f":"+$E$7","v":"ERGO Sports 3"},{"$f":"+$F$7","v":"ERG 3"},null,null,null,null,null,"Übersicht aller Mannschaften / Punkte",null,null,null,"14. Antritt",{"$f":"+'Übersicht der Klasse B4'!$U$8","v":0},{"$f":"+'Übersicht der Klasse B4'!$U$10","v":0},{"$f":"+'Übersicht der Klasse B4'!$U$12","v":0},{"$f":"+'Übersicht der Klasse B4'!$U$14","v":0},{"$f":"+'Übersicht der Klasse B4'!$U$16","v":0},{"$f":"+'Übersicht der Klasse B4'!$U$18","v":0},{"$f":"+'Übersicht der Klasse B4'!$U$20","v":0},{"$f":"+'Übersicht der Klasse B4'!$U$22","v":0},{"$f":"+'Übersicht der Klasse B4'!$U$24","v":0},{"$f":"+'Übersicht der Klasse B4'!$U$26","v":0},{"$f":"+'Übersicht der Klasse B4'!$U$28","v":1886},{"$f":"+'Übersicht der Klasse B4'!$U$30","v":0}]
[null,null,null,null,null,null,null,null,null,null,null,"1. Mannschaft","Punkte",null,null,"Gesamt Pins:",{"$f":"SUM($Q$4:$Q$17)","v":8859},{"$f":"SUM($R$4:$R$17)","v":7877},{"$f":"SUM($S$4:$S$17)","v":9487},{"$f":"SUM($T$4:$T$17)","v":8054},{"$f":"SUM($U$4:$U$17)","v":9425},{"$f":"SUM($V$4:$V$17)","v":9634},{"$f":"SUM($W$4:$W$17)","v":8772},{"$f":"SUM($X$4:$X$17)","v":8223},{"$f":"SUM($Y$4:$Y$17)","v":9100},{"$f":"SUM($Z$4:$Z$17)","v":8727},{"$f":"SUM($AA$4:$AA$17)","v":26404},{"$f":"SUM($AB$4:$AB$17)","v":0}]
[null,null,null,null,null,null,null,null,null,null,null,{"$f":"+$E$4","v":"Eppendorf AG 1"},{"$f":"+'Übersicht der Klasse B4'!$E$8","v":26}]
[null,null,null,null,null,null,null,null,null,null,null,{"$f":"+$E$5","v":"Energie Sportvereinigung 2"},{"$f":"+'Übersicht der Klasse B4'!$E$10","v":12},null,null,null,null,null,null,null,null,null,null,null,null,null,null,null,null,null,"1. Antritt","2. Antritt","3. Antritt","4. Antritt","5. Antritt","6. Antritt","7. Antritt","8. Antritt","9. Antritt","10. Antritt","11. Antritt","12. Antritt","13. Antritt","14. Antritt","Gesamt Pins:"]
[null,null,null,null,null,null,null,null,null,null,null,{"$f":"+$E$6","v":"AXA 1"},{"$f":"+'Übersicht der Klasse B4'!$E$12","v":41},null,null,"Gesamt Punkte:",{"$f":"+'Übersicht der Klasse B4'!$E$8","v":26},{"$f":"+'Übersicht der Klasse B4'!$E$10","v":12},{"$f":"+'Übersicht der Klasse B4'!$E$12","v":41},{"$f":"+'Übersicht der Klasse B4'!$E$14","v":13},{"$f":"+'Übersicht der Klasse B4'!$E$16","v":35},{"$f":"+'Übersicht der Klasse B4'!$E$18","v":42},{"$f":"+'Übersicht der Klasse B4'!$E$20","v":26},{"$f":"+'Übersicht der Klasse B4'!$E$22","v":20},{"$f":"+'Übersicht der Klasse B4'!$E$24","v":32},{"$f":"+'Übersicht der Klasse B4'!$E$26","v":28},{"$f":"+'Übersicht der Klasse B4'!$E$28","v":124},{"$f":"+'Übersicht der Klasse B4'!$F$31","v":0},null,{"$f":"+'Spielbogen 10er'!G9","v":"EAG 1"},{"$f":"+'Übersicht der Klasse B4'!$H$8","v":1886},{"$f":"+'Übersicht der Klasse B4'!$I$8","v":1744},{"$f":"+'Übersicht der Klasse B4'!$J$8","v":1556},{"$f":"+'Übersicht der Klasse B4'!$K$8","v":2006},{"$f":"+'Übersicht der Klasse B4'!$L$8","v":1667},{"$f":"+'Übersicht der Klasse B4'!$M$8","v":0},{"$f":"+'Übersicht der Klasse B4'!$N$8","v":0},{"$f":"+'Übersicht der Klasse B4'!$O$8","v":0},{"$f":"+'Übersicht der Klasse B4'!$P$8","v":0},{"$f":"+'Übersicht der Klasse B4'!$Q$8","v":0},{"$f":"+'Übersicht der Klasse B4'!$R$8","v":0},{"$f":"+'Übersicht der Klasse B4'!$S$8","v":0},{"$f":"+'Übersicht der Klasse B4'!$T$8","v":0},{"$f":"+'Übersicht der Klasse B4'!$U$8","v":0},{"$f":"SUM($AE$21:$AR$21)","v":8859}]
[null,null,null,null,null,null,null,null,null,null,null,{"$f":"+$E$7","v":"ERGO Sports 3"},{"$f":"+'Übersicht der Klasse B4'!$E$14","v":13},null,null,null,null,null,null,null,null,null,null,null,null,null,null,null,null,{"$f":"+'Spielbogen 10er'!G10","v":"ESV 2"},{"$f":"+'Übersicht der Klasse B4'!$H$10","v":1512},{"$f":"+'Übersicht der Klasse B4'!$I$10","v":1687},{"$f":"+'Übersicht der Klasse B4'!$J$10","v":1438},{"$f":"+'Übersicht der Klasse B4'!$K$10","v":1569},{"$f":"+'Übersicht der Klasse B4'!$L$10","v":1671},{"$f":"+'Übersicht der Klasse B4'!$M$10","v":0},{"$f":"+'Übersicht der Klasse B4'!$N$10","v":0},{"$f":"+'Übersicht der Klasse B4'!$O$10","v":0},{"$f":"+'Übersicht der Klasse B4'!$P$10","v":0},{"$f":"+'Übersicht der Klasse B4'!$Q$10","v":0},{"$f":"+'Übersicht der Klasse B4'!$R$10","v":0},{"$f":"+'Übersicht der Klasse B4'!$S$10","v":0},{"$f":"+'Übersicht der Klasse B4'!$T$10","v":0},{"$f":"+'Übersicht der Klasse B4'!$U$10","v":0},{"$f":"SUM($AE$22:$AR$22)","v":7877}]
[null,null,null,null,null,null,null,null,null,null,null,{"$f":"+$E$8","v":"Dataport 2"},{"$f":"+'Übersicht der Klasse B4'!$E$16","v":35},null,null,null,"1. Antritt",null,null,null,null,null,null,null,null,null,null,null,null,{"$f":"+'Spielbogen 10er'!G11","v":"AXA 1"},{"$f":"+'Übersicht der Klasse B4'!$H$12","v":1599},{"$f":"+'Übersicht der Klasse B4'!$I$12","v":2044},{"$f":"+'Übersicht der Klasse B4'!$J$12","v":1865},{"$f":"+'Übersicht der Klasse B4'!$K$12","v":2034},{"$f":"+'Übersicht der Klasse B4'!$L$12","v":1945},{"$f":"+'Übersicht der Klasse B4'!$M$12","v":0},{"$f":"+'Übersicht der Klasse B4'!$N$12","v":0},{"$f":"+'Übersicht der Klasse B4'!$O$12","v":0},{"$f":"+'Übersicht der Klasse B4'!$P$12","v":0},{"$f":"+'Übersicht der Klasse B4'!$Q$12","v":0},{"$f":"+'Übersicht der Klasse B4'!$R$12","v":0},{"$f":"+'Übersicht der Klasse B4'!$S$12","v":0},{"$f":"+'Übersicht der Klasse B4'!$T$12","v":0},{"$f":"+'Übersicht der Klasse B4'!$U$12","v":0},{"$f":"SUM($AE$23:$AR$23)","v":9487}]
[null,null,null,null,null,null,null,null,null,null,null,{"$f":"+$E$9","v":"Panasonic 1"},{"$f":"+'Übersicht der Klasse B4'!$E$18","v":42},null,null,null,{"$f":"IF($Q$26=\"1\",+$Q$25+0.5,+$Q$25)","v":8},{"$f":"IF($R$26=\"1\",+$R$25+0.5,+$R$25)","v":1},{"$f":"IF($S$26=\"1\",+$S$25+0.5,+$S$25)","v":3},{"$f":"IF($T$26=\"1\",+$T$25+0.5,+$T$25)","v":2},{"$f":"IF($U$26=\"1\",+$U$25+0.5,+$U$25)","v":6},{"$f":"IF($V$26=\"1\",+$V$25+0.5,+$V$25)","v":9},{"$f":"IF($W$26=\"1\",+$W$25+0.5,+$W$25)","v":4},{"$f":"IF($X$26=\"1\",+$X$25+0.5,+$X$25)","v":10},{"$f":"IF($Y$26=\"1\",+$Y$25+0.5,+$Y$25)","v":5},{"$f":"IF($Z$26=\"1\",+$Z$25+0.5,+$Z$25)","v":7},null,null,null,{"$f":"+'Spielbogen 10er'!G12","v":"ERG 3"},{"$f":"+'Übersicht der Klasse B4'!$H$14","v":1547},{"$f":"+'Übersicht der Klasse B4'!$I$14","v":1586},{"$f":"+'Übersicht der Klasse B4'!$J$14","v":1696},{"$f":"+'Übersicht der Klasse B4'!$K$14","v":1656},{"$f":"+'Übersicht der Klasse B4'!$L$14","v":1569},{"$f":"+'Übersicht der Klasse B4'!$M$14","v":0},{"$f":"+'Übersicht der Klasse B4'!$N$14","v":0},{"$f":"+'Übersicht der Klasse B4'!$O$14","v":0},{"$f":"+'Übersicht der Klasse B4'!$P$14","v":0},{"$f":"+'Übersicht der Klasse B4'!$Q$14","v":0},{"$f":"+'Übersicht der Klasse B4'!$R$14","v":0},{"$f":"+'Übersicht der Klasse B4'!$S$14","v":0},{"$f":"+'Übersicht der Klasse B4'!$T$14","v":0},{"$f":"+'Übersicht der Klasse B4'!$U$14","v":0},{"$f":"SUM($AE$24:$AR$24)","v":8054}]
[null,null,null,null,null,null,null,null,null,null,null,{"$f":"+$E$10","v":"Generali 3"},{"$f":"+'Übersicht der Klasse B4'!$E$20","v":26},null,null,null,{"$f":"IF(Q4>0,RANK(Q4,$Q$4:$Z$4,10),\"0\")","v":8},{"$f":"IF(R4>0,RANK(R4,$Q$4:$Z$4,10),\"0\")","v":1},3,2,6,9,4,10,5,7,null,null,null,{"$f":"+'Spielbogen 10er'!G13","v":"DAT 2"},{"$f":"+'Übersicht der Klasse B4'!$H$16","v":1817},{"$f":"+'Übersicht der Klasse B4'!$I$16","v":1967},{"$f":"+'Übersicht der Klasse B4'!$J$16","v":1661},{"$f":"+'Übersicht der Klasse B4'!$K$16","v":2005},{"$f":"+'Übersicht der Klasse B4'!$L$16","v":1975},{"$f":"+'Übersicht der Klasse B4'!$M$16","v":0},{"$f":"+'Übersicht der Klasse B4'!$N$16","v":0},{"$f":"+'Übersicht der Klasse B4'!$O$16","v":0},{"$f":"+'Übersicht der Klasse B4'!$P$16","v":0},{"$f":"+'Übersicht der Klasse B4'!$Q$16","v":0},{"$f":"+'Übersicht der Klasse B4'!$R$16","v":0},{"$f":"+'Übersicht der Klasse B4'!$S$16","v":0},{"$f":"+'Übersicht der Klasse B4'!$T$16","v":0},{"$f":"+'Übersicht der Klasse B4'!$U$16","v":0},{"$f":"SUM($AE$25:$AR$25)","v":9425}]
[null,null,null,null,null,null,null,null,null,null,null,{"$f":"+$E$11","v":"Finanzamt 3"},{"$f":"+'Übersicht der Klasse B4'!$E$22","v":20},null,null,null,{"$f":"IF(COUNTIF($Q$4:$Z$4,Q4)>1,\"1\",\"\")","v":""},{"$f":"IF(COUNTIF($Q$4:$Z$4,R4)>1,\"1\",\"\")","v":""},"","","","","","","","",null,null,null,{"$f":"+'Spielbogen 10er'!G14","v":"PAN 1"},{"$f":"+'Übersicht der Klasse B4'!$H$18","v":1921},{"$f":"+'Übersicht der Klasse B4'!$I$18","v":1955},{"$f":"+'Übersicht der Klasse B4'!$J$18","v":1847},{"$f":"+'Übersicht der Klasse B4'!$K$18","v":2032},{"$f":"+'Übersicht der Klasse B4'!$L$18","v":1879},{"$f":"+'Übersicht der Klasse B4'!$M$18","v":0},{"$f":"+'Übersicht der Klasse B4'!$N$18","v":0},{"$f":"+'Übersicht der Klasse B4'!$O$18","v":0},{"$f":"+'Übersicht der Klasse B4'!$P$18","v":0},{"$f":"+'Übersicht der Klasse B4'!$Q$18","v":0},{"$f":"+'Übersicht der Klasse B4'!$R$18","v":0},{"$f":"+'Übersicht der Klasse B4'!$S$18","v":0},{"$f":"+'Übersicht der Klasse B4'!$T$18","v":0},{"$f":"+'Übersicht der Klasse B4'!$U$18","v":0},{"$f":"SUM($AE$26:$AR$26)","v":9634}]
[null,null,null,null,null,null,null,null,null,null,null,{"$f":"+$E$12","v":"HASPA 5"},{"$f":"+'Übersicht der Klasse B4'!$E$24","v":32},null,null,null,null,null,null,null,null,null,null,null,null,null,null,null,null,{"$f":"+'Spielbogen 10er'!G15","v":"GEN 3"},{"$f":"+'Übersicht der Klasse B4'!$H$20","v":1734},{"$f":"+'Übersicht der Klasse B4'!$I$20","v":1646},{"$f":"+'Übersicht der Klasse B4'!$J$20","v":1758},{"$f":"+'Übersicht der Klasse B4'!$K$20","v":1845},{"$f":"+'Übersicht der Klasse B4'!$L$20","v":1789},{"$f":"+'Übersicht der Klasse B4'!$M$20","v":0},{"$f":"+'Übersicht der Klasse B4'!$N$20","v":0},{"$f":"+'Übersicht der Klasse B4'!$O$20","v":0},{"$f":"+'Übersicht der Klasse B4'!$P$20","v":0},{"$f":"+'Übersicht der Klasse B4'!$Q$20","v":0},{"$f":"+'Übersicht der Klasse B4'!$R$20","v":0},{"$f":"+'Übersicht der Klasse B4'!$S$20","v":0},{"$f":"+'Übersicht der Klasse B4'!$T$20","v":0},{"$f":"+'Übersicht der Klasse B4'!$U$20","v":0},{"$f":"SUM($AE$27:$AR$27)","v":8772}]
[null,null,null,null,null,null,null,null,null,null,null,{"$f":"+$E$13","v":"BWVL 5"},{"$f":"+'Übersicht der Klasse B4'!$E$26","v":28},null,null,null,"2. Antritt",null,null,null,null,null,null,null,null,null,null,null,null,{"$f":"+'Spielbogen 10er'!G16","v":"FAH 3"},{"$f":"+'Übersicht der Klasse B4'!$H$22","v":1951},{"$f":"+'Übersicht der Klasse B4'!$I$22","v":1438},{"$f":"+'Übersicht der Klasse B4'!$J$22","v":1588},{"$f":"+'Übersicht der Klasse B4'!$K$22","v":1671},{"$f":"+'Übersicht der Klasse B4'!$L$22","v":1575},{"$f":"+'Übersicht der Klasse B4'!$M$22","v":0},{"$f":"+'Übersicht der Klasse B4'!$N$22","v":0},{"$f":"+'Übersicht der Klasse B4'!$O$22","v":0},{"$f":"+'Übersicht der Klasse B4'!$P$22","v":0},{"$f":"+'Übersicht der Klasse B4'!$Q$22","v":0},{"$f":"+'Übersicht der Klasse B4'!$R$22","v":0},{"$f":"+'Übersicht der Klasse B4'!$S$22","v":0},{"$f":"+'Übersicht der Klasse B4'!$T$22","v":0},{"$f":"+'Übersicht der Klasse B4'!$U$22","v":0},{"$f":"SUM($AE$28:$AR$28)","v":8223}]
[null,null,null,null,null,null,null,null,null,null,null,{"$f":"+$E$14","v":"Eppendorf AG 1"},{"$f":"+'Übersicht der Klasse B4'!$E$28","v":124},null,null,null,{"$f":"IF($Q$31=\"1\",+$Q$30+0.5,+$Q$30)","v":5},{"$f":"IF($R$31=\"1\",+$R$30+0.5,+$R$30)","v":4},{"$f":"IF($S$31=\"1\",+$S$30+0.5,+$S$30)","v":10},{"$f":"IF($T$31=\"1\",+$T$30+0.5,+$T$30)","v":2},{"$f":"IF($U$31=\"1\",+$U$30+0.5,+$U$30)","v":9},{"$f":"IF($V$31=\"1\",+$V$30+0.5,+$V$30)","v":8},{"$f":"IF($W$31=\"1\",+$W$30+0.5,+$W$30)","v":3},{"$f":"IF($X$31=\"1\",+$X$30+0.5,+$X$30)","v":1},{"$f":"IF($Y$31=\"1\",+$Y$30+0.5,+$Y$30)","v":7},{"$f":"IF($Z$31=\"1\",+$Z$30+0.5,+$Z$30)","v":6},null,null,null,{"$f":"+'Spielbogen 10er'!G17","v":"HAS 5"},{"$f":"+'Übersicht der Klasse B4'!$H$24","v":1756},{"$f":"+'Übersicht der Klasse B4'!$I$24","v":1854},{"$f":"+'Übersicht der Klasse B4'!$J$24","v":1928},{"$f":"+'Übersicht der Klasse B4'!$K$24","v":1792},{"$f":"+'Übersicht der Klasse B4'!$L$24","v":1770},{"$f":"+'Übersicht der Klasse B4'!$M$24","v":0},{"$f":"+'Übersicht der Klasse B4'!$N$24","v":0},{"$f":"+'Übersicht der Klasse B4'!$O$24","v":0},{"$f":"+'Übersicht der Klasse B4'!$P$24","v":0},{"$f":"+'Übersicht der Klasse B4'!$Q$24","v":0},{"$f":"+'Übersicht der Klasse B4'!$R$24","v":0},{"$f":"+'Übersicht der Klasse B4'!$S$24","v":0},{"$f":"+'Übersicht der Klasse B4'!$T$24","v":0},{"$f":"+'Übersicht der Klasse B4'!$U$24","v":0},{"$f":"SUM($AE$29:$AR$29)","v":9100}]
[null,null,null,null,null,null,null,null,null,null,null,null,null,null,null,null,{"$f":"IF(Q5>0,RANK(Q5,$Q$5:$Z$5,10),\"0\")","v":5},{"$f":"IF(R5>0,RANK(R5,$Q$5:$Z$5,10),\"0\")","v":4},10,2,9,8,3,1,7,6,null,null,null,{"$f":"+'Spielbogen 10er'!G18","v":"BWV 5"},{"$f":"+'Übersicht der Klasse B4'!$H$26","v":1827},{"$f":"+'Übersicht der Klasse B4'!$I$26","v":1835},{"$f":"+'Übersicht der Klasse B4'!$J$26","v":1746},{"$f":"+'Übersicht der Klasse B4'!$K$26","v":2024},{"$f":"+'Übersicht der Klasse B4'!$L$26","v":1295},{"$f":"+'Übersicht der Klasse B4'!$M$26","v":0},{"$f":"+'Übersicht der Klasse B4'!$N$26","v":0},{"$f":"+'Übersicht der Klasse B4'!$O$26","v":0},{"$f":"+'Übersicht der Klasse B4'!$P$26","v":0},{"$f":"+'Übersicht der Klasse B4'!$Q$26","v":0},{"$f":"+'Übersicht der Klasse B4'!$R$26","v":0},{"$f":"+'Übersicht der Klasse B4'!$S$26","v":0},{"$f":"+'Übersicht der Klasse B4'!$T$26","v":0},{"$f":"+'Übersicht der Klasse B4'!$U$26","v":0},{"$f":"SUM($AE$30:$AR$30)","v":8727}]
[null,null,null,null,null,null,null,null,null,null,null,null,null,null,null,null,{"$f":"IF(COUNTIF($Q$5:$Z$5,Q5)>1,\"1\",\"\")","v":""},{"$f":"IF(COUNTIF($Q$5:$Z$5,R5)>1,\"1\",\"\")","v":""},"","","","","","","","",null,null,null,{"$f":"+'Spielbogen 10er'!G19","v":0},{"$f":"+'Übersicht der Klasse B4'!$H$28","v":1886},{"$f":"+'Übersicht der Klasse B4'!$I$28","v":1886},{"$f":"+'Übersicht der Klasse B4'!$J$28","v":1886},{"$f":"+'Übersicht der Klasse B4'!$K$28","v":1886},{"$f":"+'Übersicht der Klasse B4'!$L$28","v":1886},{"$f":"+'Übersicht der Klasse B4'!$M$28","v":1886},{"$f":"+'Übersicht der Klasse B4'!$N$28","v":1886},{"$f":"+'Übersicht der Klasse B4'!$O$28","v":1886},{"$f":"+'Übersicht der Klasse B4'!$P$28","v":1886},{"$f":"+'Übersicht der Klasse B4'!$Q$28","v":1886},{"$f":"+'Übersicht der Klasse B4'!$R$28","v":1886},{"$f":"+'Übersicht der Klasse B4'!$S$28","v":1886},{"$f":"+'Übersicht der Klasse B4'!$T$28","v":1886},{"$f":"+'Übersicht der Klasse B4'!$U$28","v":1886},{"$f":"SUM($AE$31:$AR$31)","v":26404}]
[null,null,null,null,null,null,null,null,null,null,null,"Übersicht aller Mannschaften / Spiele"]
[null,null,null,null,null,null,null,null,null,null,null,"1. Mannschaft","Spiele",null,null,null,"3. Antritt"]
[null,null,null,null,null,null,null,null,null,null,null,{"$f":"+$E$4","v":"Eppendorf AG 1"},{"$f":"COUNTIF('Übersicht der Klasse B4'!$H$8:$U$8,\">1\")*12","v":60},null,null,null,{"$f":"IF($Q$36=\"1\",+$Q$35+0.5,+$Q$35)","v":2},{"$f":"IF($R$36=\"1\",+$R$35+0.5,+$R$35)","v":1},{"$f":"IF($S$36=\"1\",+$S$35+0.5,+$S$35)","v":9},{"$f":"IF($T$36=\"1\",+$T$35+0.5,+$T$35)","v":5},{"$f":"IF($U$36=\"1\",+$U$35+0.5,+$U$35)","v":4},{"$f":"IF($V$36=\"1\",+$V$35+0.5,+$V$35)","v":8},{"$f":"IF($W$36=\"1\",+$W$35+0.5,+$W$35)","v":7},{"$f":"IF($X$36=\"1\",+$X$35+0.5,+$X$35)","v":3},{"$f":"IF($Y$36=\"1\",+$Y$35+0.5,+$Y$35)","v":10},{"$f":"IF($Z$36=\"1\",+$Z$35+0.5,+$Z$35)","v":6},{"$f":"IF($AA$36=\"1\",+$AA$35+0.5,+$AA$35)","v":10},{"$f":"IF($AB$36=\"1\",+$AB$35+0.5,+$AB$35)","v":"0"}]
[null,null,null,null,null,null,null,null,null,null,null,{"$f":"+$E$5","v":"Energie Sportvereinigung 2"},{"$f":"COUNTIF('Übersicht der Klasse B4'!$H$10:$U$10,\">1\")*12","v":60},null,null,null,{"$f":"IF(Q6>0,RANK(Q6,$Q$6:$Z$6,10),\"0\")","v":2},{"$f":"IF(R6>0,RANK(R6,$Q$6:$Z$6,10),\"0\")","v":1},9,5,4,8,7,3,10,6,{"$f":"IF($AA$6>0,RANK($AA$6,$Q$6:$AA$6,10),\"0\")","v":10},{"$f":"IF($AB$6>0,RANK($AB$6,$Q$6:$W$6,10),\"0\")","v":"0"},null,null,{"$f":"+Hilfstabelle!$AA$9","v":"EAG 1"},{"$f":"+Hilfstabelle!$AB$9","v":"ESV 2"},{"$f":"+Hilfstabelle!$AC$9","v":"AXA 1"},{"$f":"+Hilfstabelle!$AD$9","v":"ERG 3"},{"$f":"+Hilfstabelle!$AE$9","v":"DAT 2"},{"$f":"+Hilfstabelle!$AF$9","v":"PAN 1"},{"$f":"+Hilfstabelle!$AG$9","v":"GEN 3"},{"$f":"+Hilfstabelle!$AH$9","v":"FAH 3"},{"$f":"+Hilfstabelle!$AI$9","v":"HAS 5"},{"$f":"+Hilfstabelle!$AJ$9","v":"BWV 5"},{"$f":"+Hilfstabelle!$AK$9","v":"EAG 1"}]
[null,null,null,null,null,null,null,null,null,null,null,{"$f":"+$E$6","v":"AXA 1"},{"$f":"COUNTIF('Übersicht der Klasse B4'!$H$12:$U$12,\">1\")*12","v":60},null,null,null,{"$f":"IF(COUNTIF($Q$6:$Z$6,Q6)>1,\"1\",\"\")","v":""},{"$f":"IF(COUNTIF($Q$6:$Z$6,R6)>1,\"1\",\"\")","v":""},"","","","","","","","",{"$f":"IF(COUNTIF($Q$6:$AA$6,$AA$6)>1,\"1\",\"\")","v":""},{"$f":"IF(COUNTIF($Q$6:$W$6,$AB$6)>1,\"1\",\"\")","v":""},null,"1. Antritt",{"$f":"+'Anhang zum Spielbericht'!$G$19","v":1886},{"$f":"+'Anhang zum Spielbericht'!$H$19","v":1512},{"$f":"+'Anhang zum Spielbericht'!$I$19","v":1599},{"$f":"+'Anhang zum Spielbericht'!$J$19","v":1547},{"$f":"+'Anhang zum Spielbericht'!$K$19","v":1817},{"$f":"+'Anhang zum Spielbericht'!L19","v":1921},{"$f":"+'Anhang zum Spielbericht'!M19","v":1734},{"$f":"+'Anhang zum Spielbericht'!N19","v":1951},{"$f":"+'Anhang zum Spielbericht'!O19","v":1756},{"$f":"+'Anhang zum Spielbericht'!P19","v":1827},{"$f":"+'Anhang zum Spielbericht'!Q19","v":0}]
[null,null,null,null,null,null,null,null,null,null,null,{"$f":"+$E$7","v":"ERGO Sports 3"},{"$f":"COUNTIF('Übersicht der Klasse B4'!$H$14:$U$14,\">1\")*12","v":60},null,null,null,null,null,null,null,null,null,null,null,null,null,null,null,null,"2. Antritt",{"$f":"+'Anhang zum Spielbericht'!$G$40","v":1744},{"$f":"+'Anhang zum Spielbericht'!$H$40","v":1687},{"$f":"+'Anhang zum Spielbericht'!$I$40","v":2044},{"$f":"+'Anhang zum Spielbericht'!$J$40","v":1586},{"$f":"+'Anhang zum Spielbericht'!$K$40","v":1967},{"$f":"+'Anhang zum Spielbericht'!L40","v":1955},{"$f":"+'Anhang zum Spielbericht'!M40","v":1646},{"$f":"+'Anhang zum Spielbericht'!N40","v":1438},{"$f":"+'Anhang zum Spielbericht'!O40","v":1854},{"$f":"+'Anhang zum Spielbericht'!P40","v":1835},{"$f":"+'Anhang zum Spielbericht'!Q40","v":0}]
[null,null,null,null,null,null,null,null,null,null,null,{"$f":"+$E$8","v":"Dataport 2"},{"$f":"COUNTIF('Übersicht der Klasse B4'!$H$16:$U$16,\">1\")*12","v":60},null,null,null,"4. Antritt",null,null,null,null,null,null,null,null,null,null,null,null,"3. Antritt",{"$f":"+'Anhang zum Spielbericht'!$G$63","v":1556},{"$f":"+'Anhang zum Spielbericht'!$H$63","v":1438},{"$f":"+'Anhang zum Spielbericht'!$I$63","v":1865},{"$f":"+'Anhang zum Spielbericht'!$J$63","v":1696},{"$f":"+'Anhang zum Spielbericht'!$K$63","v":1661},{"$f":"+'Anhang zum Spielbericht'!L63","v":1847},{"$f":"+'Anhang zum Spielbericht'!M63","v":1758},{"$f":"+'Anhang zum Spielbericht'!N63","v":1588},{"$f":"+'Anhang zum Spielbericht'!O63","v":1928},{"$f":"+'Anhang zum Spielbericht'!P63","v":1746},{"$f":"+'Anhang zum Spielbericht'!Q63","v":541}]
[null,null,null,null,null,null,null,null,null,null,null,{"$f":"+$E$9","v":"Panasonic 1"},{"$f":"COUNTIF('Übersicht der Klasse B4'!$H$18:$U$18,\">1\")*12","v":60},null,null,null,{"$f":"IF($Q$41=\"1\",+$Q$40+0.5,+$Q$40)","v":7},{"$f":"IF($R$41=\"1\",+$R$40+0.5,+$R$40)","v":1},{"$f":"IF($S$41=\"1\",+$S$40+0.5,+$S$40)","v":10},{"$f":"IF($T$41=\"1\",+$T$40+0.5,+$T$40)","v":2},{"$f":"IF($U$41=\"1\",+$U$40+0.5,+$U$40)","v":6},{"$f":"IF($V$41=\"1\",+$V$40+0.5,+$V$40)","v":9},{"$f":"IF($W$41=\"1\",+$W$40+0.5,+$W$40)","v":5},{"$f":"IF($X$41=\"1\",+$X$40+0.5,+$X$40)","v":3},{"$f":"IF($Y$41=\"1\",+$Y$40+0.5,+$Y$40)","v":4},{"$f":"IF($Z$41=\"1\",+$Z$40+0.5,+$Z$40)","v":8},{"$f":"IF($AA$41=\"1\",+$AA$40+0.5,+$AA$40)","v":6},{"$f":"IF($AB$41=\"1\",+$AB$40+0.5,+$AB$40)","v":"0"},null,"4. Antritt",{"$f":"+'Anhang zum Spielbericht'!$G$87","v":2006},{"$f":"+'Anhang zum Spielbericht'!$H$87","v":1569},{"$f":"+'Anhang zum Spielbericht'!$I$87","v":2034},{"$f":"+'Anhang zum Spielbericht'!$J$87","v":1656},{"$f":"+'Anhang zum Spielbericht'!$K$87","v":2005},{"$f":"+'Anhang zum Spielbericht'!L87","v":2032},{"$f":"+'Anhang zum Spielbericht'!M87","v":1845},{"$f":"+'Anhang zum Spielbericht'!N87","v":1671},{"$f":"+'Anhang zum Spielbericht'!O87","v":1792},{"$f":"+'Anhang zum Spielbericht'!P87","v":2024},{"$f":"+'Anhang zum Spielbericht'!Q87","v":0}]
[null,null,null,null,null,null,null,null,null,null,null,{"$f":"+$E$10","v":"Generali 3"},{"$f":"COUNTIF('Übersicht der Klasse B4'!$H$20:$U$20,\">1\")*12","v":60},null,null,null,{"$f":"IF(Q7>0,RANK(Q7,$Q$7:$Z$7,10),\"0\")","v":7},{"$f":"IF(R7>0,RANK(R7,$Q$7:$Z$7,10),\"0\")","v":1},10,2,6,9,5,3,4,8,{"$f":"IF($AA$7>0,RANK($AA$7,$Q$7:$AA$7,10),\"0\")","v":6},{"$f":"IF($AB$7>0,RANK($AB$7,$Q$7:$W$7,10),\"0\")","v":"0"},null,"5. Antritt",{"$f":"+'Anhang zum Spielbericht'!$G$110","v":1667},{"$f":"+'Anhang zum Spielbericht'!$H$110","v":1671},{"$f":"+'Anhang zum Spielbericht'!$I$110","v":1945},{"$f":"+'Anhang zum Spielbericht'!$J$110","v":1569},{"$f":"+'Anhang zum Spielbericht'!$K$110","v":1975},{"$f":"+'Anhang zum Spielbericht'!L110","v":1879},{"$f":"+'Anhang zum Spielbericht'!M110","v":1789},{"$f":"+'Anhang zum Spielbericht'!N110","v":1575},{"$f":"+'Anhang zum Spielbericht'!O110","v":1770},{"$f":"+'Anhang zum Spielbericht'!P110","v":1295},{"$f":"+'Anhang zum Spielbericht'!Q110","v":0}]
[null,null,null,null,null,null,null,null,null,null,null,{"$f":"+$E$11","v":"Finanzamt 3"},{"$f":"COUNTIF('Übersicht der Klasse B4'!$H$22:$U$22,\">1\")*12","v":60},null,null,null,{"$f":"IF(COUNTIF($Q$7:$Z$7,Q7)>1,\"1\",\"\")","v":""},{"$f":"IF(COUNTIF($Q$7:$Z$7,R7)>1,\"1\",\"\")","v":""},"","","","","","","","",{"$f":"IF(COUNTIF($Q$7:$AA$7,$AA$7)>1,\"1\",\"\")","v":""},{"$f":"IF(COUNTIF($Q$7:$W$7,$AB$7)>1,\"1\",\"\")","v":""},null,"6. Antritt",{"$f":"+'Anhang zum Spielbericht'!$G$133","v":0},{"$f":"+'Anhang zum Spielbericht'!$H$133","v":0},{"$f":"+'Anhang zum Spielbericht'!$I$133","v":0},{"$f":"+'Anhang zum Spielbericht'!$J$133","v":0},{"$f":"+'Anhang zum Spielbericht'!$K$133","v":0},{"$f":"+'Anhang zum Spielbericht'!L133","v":0},{"$f":"+'Anhang zum Spielbericht'!M133","v":0},{"$f":"+'Anhang zum Spielbericht'!N133","v":0},{"$f":"+'Anhang zum Spielbericht'!O133","v":0},{"$f":"+'Anhang zum Spielbericht'!P133","v":0},{"$f":"+'Anhang zum Spielbericht'!Q133","v":0}]
[null,null,null,null,null,null,null,null,null,null,null,{"$f":"+$E$12","v":"HASPA 5"},{"$f":"COUNTIF('Übersicht der Klasse B4'!$H$24:$U$24,\">1\")*12","v":60},null,null,null,null,null,null,null,null,null,null,null,null,null,null,null,null,"7. Antritt",{"$f":"+'Anhang zum Spielbericht'!$G$156","v":0},{"$f":"+'Anhang zum Spielbericht'!$H$156","v":0},{"$f":"+'Anhang zum Spielbericht'!$I$156","v":0},{"$f":"+'Anhang zum Spielbericht'!$J$156","v":0},{"$f":"+'Anhang zum Spielbericht'!$K$156","v":0},{"$f":"+'Anhang zum Spielbericht'!L156","v":0},{"$f":"+'Anhang zum Spielbericht'!M156","v":0},{"$f":"+'Anhang zum Spielbericht'!N156","v":0},{"$f":"+'Anhang zum Spielbericht'!O156","v":0},{"$f":"+'Anhang zum Spielbericht'!P156","v":0},{"$f":"+'Anhang zum Spielbericht'!Q156","v":0}]
[null,null,null,null,null,null,null,null,null,null,null,{"$f":"+$E$13","v":"BWVL 5"},{"$f":"COUNTIF('Übersicht der Klasse B4'!$H$26:$U$26,\">1\")*12","v":60},null,null,null,"5. Antritt",null,null,null,null,null,null,null,null,null,null,null,null,"8. Antritt",{"$f":"+'Anhang zum Spielbericht'!$G$179","v":0},{"$f":"+'Anhang zum Spielbericht'!$H$179","v":0},{"$f":"+'Anhang zum Spielbericht'!$I$179","v":0},{"$f":"+'Anhang zum Spielbericht'!$J$179","v":0},{"$f":"+'Anhang zum Spielbericht'!$K$179","v":0},{"$f":"+'Anhang zum Spielbericht'!L179","v":0},{"$f":"+'Anhang zum Spielbericht'!M179","v":0},{"$f":"+'Anhang zum Spielbericht'!N179","v":0},{"$f":"+'Anhang zum Spielbericht'!O179","v":0},{"$f":"+'Anhang zum Spielbericht'!P179","v":0},{"$f":"+'Anhang zum Spielbericht'!Q179","v":0}]
[null,null,null,null,null,null,null,null,null,null,null,{"$f":"+$E$14","v":"Eppendorf AG 1"},{"$f":"COUNTIF('Übersicht der Klasse B4'!$H$28:$U$28,\">1\")*12","v":168},null,null,null,{"$f":"IF($Q$46=\"1\",+$Q$45+0.5,+$Q$45)","v":4},{"$f":"IF($R$46=\"1\",+$R$45+0.5,+$R$45)","v":5},{"$f":"IF($S$46=\"1\",+$S$45+0.5,+$S$45)","v":9},{"$f":"IF($T$46=\"1\",+$T$45+0.5,+$T$45)","v":2},{"$f":"IF($U$46=\"1\",+$U$45+0.5,+$U$45)","v":10},{"$f":"IF($V$46=\"1\",+$V$45+0.5,+$V$45)","v":8},{"$f":"IF($W$46=\"1\",+$W$45+0.5,+$W$45)","v":7},{"$f":"IF($X$46=\"1\",+$X$45+0.5,+$X$45)","v":3},{"$f":"IF($Y$46=\"1\",+$Y$45+0.5,+$Y$45)","v":6},{"$f":"IF($Z$46=\"1\",+$Z$45+0.5,+$Z$45)","v":1},{"$f":"IF($AA$46=\"1\",+$AA$45+0.5,+$AA$45)","v":9},{"$f":"IF($AB$46=\"1\",+$AB$45+0.5,+$AB$45)","v":"0"},null,"9. Antritt",{"$f":"+'Anhang zum Spielbericht'!$G$202","v":0},{"$f":"+'Anhang zum Spielbericht'!$H$202","v":0},{"$f":"+'Anhang zum Spielbericht'!$I$202","v":0},{"$f":"+'Anhang zum Spielbericht'!$J$202","v":0},{"$f":"+'Anhang zum Spielbericht'!$K$202","v":0},{"$f":"+'Anhang zum Spielbericht'!L202","v":0},{"$f":"+'Anhang zum Spielbericht'!M202","v":0},{"$f":"+'Anhang zum Spielbericht'!N202","v":0},{"$f":"+'Anhang zum Spielbericht'!O202","v":0},{"$f":"+'Anhang zum Spielbericht'!P202","v":0},{"$f":"+'Anhang zum Spielbericht'!Q202","v":0}]
[null,null,null,null,null,null,null,null,null,null,null,null,null,null,null,null,{"$f":"IF(Q8>0,RANK(Q8,$Q$8:$Z$8,10),\"0\")","v":4},{"$f":"IF(R8>0,RANK(R8,$Q$8:$Z$8,10),\"0\")","v":5},9,2,10,8,7,3,6,1,{"$f":"IF($AA$8>0,RANK($AA$8,$Q$8:$AA$8,10),\"0\")","v":9},{"$f":"IF($AB$8>0,RANK($AB$8,$Q$8:$W$8,10),\"0\")","v":"0"},null,"10. Antritt",{"$f":"+'Anhang zum Spielbericht'!$G$225","v":0},{"$f":"+'Anhang zum Spielbericht'!$H$225","v":0},{"$f":"+'Anhang zum Spielbericht'!$I$225","v":0},{"$f":"+'Anhang zum Spielbericht'!$J$225","v":0},{"$f":"+'Anhang zum Spielbericht'!$K$225","v":0},{"$f":"+'Anhang zum Spielbericht'!L225","v":0},{"$f":"+'Anhang zum Spielbericht'!M225","v":0},{"$f":"+'Anhang zum Spielbericht'!N225","v":0},{"$f":"+'Anhang zum Spielbericht'!O225","v":0},{"$f":"+'Anhang zum Spielbericht'!P225","v":0},{"$f":"+'Anhang zum Spielbericht'!Q225","v":0},null,null,null,null,null,null,null,{"$error":"#VALUE!"},null,null,null,null,{"$error":"#VALUE!"},null,null,null,null,null,null,null,null,null,null,null,null,{"$error":"#VALUE!"},null,null,null,null,null,null,null,null,null,null,null,{"$error":"#VALUE!"}]
[null,null,null,null,null,null,null,null,null,null,null,null,null,null,null,null,{"$f":"IF(COUNTIF($Q$8:$Z$8,Q8)>1,\"1\",\"\")","v":""},{"$f":"IF(COUNTIF($Q$8:$Z$8,R8)>1,\"1\",\"\")","v":""},"","","","","","","","",{"$f":"IF(COUNTIF($AA$8:$AA$8,$AA$8)>1,\"1\",\"\")","v":""},{"$f":"IF(COUNTIF($Z$8:$AB$8,$AB$8)>1,\"1\",\"\")","v":""},null,"11. Antritt",{"$f":"+'Anhang zum Spielbericht'!$G$248","v":0},{"$f":"+'Anhang zum Spielbericht'!$H$248","v":0},{"$f":"+'Anhang zum Spielbericht'!$I$248","v":0},{"$f":"+'Anhang zum Spielbericht'!$J$248","v":0},{"$f":"+'Anhang zum Spielbericht'!$K$248","v":0},{"$f":"+'Anhang zum Spielbericht'!L248","v":0},{"$f":"+'Anhang zum Spielbericht'!M248","v":0},{"$f":"+'Anhang zum Spielbericht'!N248","v":0},{"$f":"+'Anhang zum Spielbericht'!O248","v":0},{"$f":"+'Anhang zum Spielbericht'!P248","v":0},{"$f":"+'Anhang zum Spielbericht'!Q248","v":0}]
[null,null,null,null,null,null,null,null,null,null,null,null,null,null,null,null,null,null,null,null,null,null,null,null,null,null,null,null,null,"12. Antritt",{"$f":"+'Anhang zum Spielbericht'!$G$271","v":0},{"$f":"+'Anhang zum Spielbericht'!$H$271","v":0},{"$f":"+'Anhang zum Spielbericht'!$I$271","v":0},{"$f":"+'Anhang zum Spielbericht'!$J$271","v":0},{"$f":"+'Anhang zum Spielbericht'!$K$271","v":0},{"$f":"+'Anhang zum Spielbericht'!L271","v":0},{"$f":"+'Anhang zum Spielbericht'!M271","v":0},{"$f":"+'Anhang zum Spielbericht'!N271","v":0},{"$f":"+'Anhang zum Spielbericht'!O271","v":0},{"$f":"+'Anhang zum Spielbericht'!P271","v":0},{"$f":"+'Anhang zum Spielbericht'!Q271","v":0}]
[null,null,null,null,null,null,null,null,null,null,null,null,null,null,null,null,"6. Antritt",null,null,null,null,null,null,null,null,null,null,null,null,"13. Antritt",{"$f":"+'Anhang zum Spielbericht'!$G$294","v":0},{"$f":"+'Anhang zum Spielbericht'!$H$294","v":0},{"$f":"+'Anhang zum Spielbericht'!$I$294","v":0},{"$f":"+'Anhang zum Spielbericht'!$J$294","v":0},{"$f":"+'Anhang zum Spielbericht'!$K$294","v":0},{"$f":"+'Anhang zum Spielbericht'!L294","v":0},{"$f":"+'Anhang zum Spielbericht'!M294","v":0},{"$f":"+'Anhang zum Spielbericht'!N294","v":0},{"$f":"+'Anhang zum Spielbericht'!O294","v":0},{"$f":"+'Anhang zum Spielbericht'!P294","v":0},{"$f":"+'Anhang zum Spielbericht'!Q294","v":0}]
[null,null,null,null,null,null,null,null,null,null,null,null,null,null,null,null,{"$f":"IF($Q$51=\"1\",+$Q$50+0.5,+$Q$50)","v":0.5},{"$f":"IF($R$51=\"1\",+$R$50+0.5,+$R$50)","v":0.5},{"$f":"IF($S$51=\"1\",+$S$50+0.5,+$S$50)","v":0.5},{"$f":"IF($T$51=\"1\",+$T$50+0.5,+$T$50)","v":0.5},{"$f":"IF($U$51=\"1\",+$U$50+0.5,+$U$50)","v":0.5},{"$f":"IF($V$51=\"1\",+$V$50+0.5,+$V$50)","v":0.5},{"$f":"IF($W$51=\"1\",+$W$50+0.5,+$W$50)","v":0.5},{"$f":"IF($X$51=\"1\",+$X$50+0.5,+$X$50)","v":0.5},{"$f":"IF($Y$51=\"1\",+$Y$50+0.5,+$Y$50)","v":0.5},{"$f":"IF($Z$51=\"1\",+$Z$50+0.5,+$Z$50)","v":0.5},{"$f":"IF($AA$51=\"1\",+$AA$50+0.5,+$AA$50)","v":11},{"$f":"IF($AB$51=\"1\",+$AB$50+0.5,+$AB$50)","v":0.5},null,"14. Antritt",{"$f":"+'Anhang zum Spielbericht'!$G$317","v":0},{"$f":"+'Anhang zum Spielbericht'!$H$317","v":0},{"$f":"+'Anhang zum Spielbericht'!$I$317","v":0},{"$f":"+'Anhang zum Spielbericht'!$J$317","v":0},{"$f":"+'Anhang zum Spielbericht'!$K$317","v":0},{"$f":"+'Anhang zum Spielbericht'!L317","v":0},{"$f":"+'Anhang zum Spielbericht'!M317","v":0},{"$f":"+'Anhang zum Spielbericht'!N317","v":0},{"$f":"+'Anhang zum Spielbericht'!O317","v":0},{"$f":"+'Anhang zum Spielbericht'!P317","v":0},{"$f":"+'Anhang zum Spielbericht'!Q317","v":0}]
[null,null,null,null,null,null,null,null,null,null,null,null,null,null,null,null,{"$f":"IF(Q9>0,RANK(Q9,$Q$9:$Z$9,10),\"0\")","v":"0"},{"$f":"IF(R9>0,RANK(R9,$Q$9:$Z$9,10),\"0\")","v":"0"},"0","0","0","0","0","0","0","0",{"$f":"IF($AA$9>0,RANK($AA$9,$Q$9:$AA$9,10),\"0\")","v":11},{"$f":"IF($AB$9>0,RANK($AB$9,$Q$9:$W$9,10),\"0\")","v":"0"},null,"Gesamt Pins:",{"$f":"SUM($AE$36:$AE$49)","v":8859},{"$f":"SUM($AF$36:$AF$49)","v":7877},{"$f":"SUM($AG$36:$AG$49)","v":9487},{"$f":"SUM($AH$36:$AH$49)","v":8054},{"$f":"SUM($AI$36:$AI$49)","v":9425},{"$f":"SUM($AJ$36:$AJ$49)","v":9634},{"$f":"SUM(AK36:AK49)","v":8772},{"$f":"SUM($AL$36:$AL$49)","v":8223},{"$f":"SUM($AM$36:$AM$49)","v":9100},{"$f":"SUM($AN$36:$AN$49)","v":8727},null,null,null,null,null,null,null,null,"S R H  1",null,null,null,null,"B W V  4",null,null,null,null,null,null,null,null,null,null,null,null,"S R H  1",null,null,null,null,null,null,null,null,null,null,null,"B W V  4"]
[null,null,null,null,null,null,null,null,null,null,null,null,null,null,null,null,{"$f":"IF(COUNTIF($Q$9:$Z$9,Q9)>1,\"1\",\"\")","v":"1"},{"$f":"IF(COUNTIF($Q$9:$Z$9,R9)>1,\"1\",\"\")","v":"1"},"1","1","1","1","1","1","1","1",{"$f":"IF(COUNTIF($Q$9:$AA$9,$AA$9)>1,\"1\",\"\")","v":""},{"$f":"IF(COUNTIF($Q$9:$W$9,$AB$9)>1,\"1\",\"\")","v":"1"}]
[null,null,null,null,null,null,null,null,null,null,null,null,null,null,null,null,null,null,null,null,null,null,null,null,null,null,null,null,null,null,"1. Antritt","2. Antritt","3. Antritt","4. Antritt","5. Antritt","6. Antritt","7. Antritt","8. Antritt","9. Antritt","10. Antritt","11. Antritt","12. Antritt","13. Antritt","14. Antritt","Gesamt Pins:"]
[null,null,null,null,null,null,null,null,null,null,null,null,null,null,null,null,"7. Antritt",null,null,null,null,null,null,null,null,null,null,null,null,{"$f":"+$F$4","v":"EAG 1"},{"$f":"+'Anhang zum Spielbericht'!$G$19","v":1886},{"$f":"+'Anhang zum Spielbericht'!$G$40","v":1744},{"$f":"+'Anhang zum Spielbericht'!$G$63","v":1556},{"$f":"+'Anhang zum Spielbericht'!$G$87","v":2006},{"$f":"+'Anhang zum Spielbericht'!$G$110","v":1667},{"$f":"+'Anhang zum Spielbericht'!$G$133","v":0},{"$f":"+'Anhang zum Spielbericht'!$G$156","v":0},{"$f":"+'Anhang zum Spielbericht'!$G$179","v":0},{"$f":"+'Anhang zum Spielbericht'!$G$202","v":0},{"$f":"+'Anhang zum Spielbericht'!$G$225","v":0},{"$f":"+'Anhang zum Spielbericht'!$G$248","v":0},{"$f":"+'Anhang zum Spielbericht'!$G$271","v":0},{"$f":"+'Anhang zum Spielbericht'!$G$294","v":0},{"$f":"+'Anhang zum Spielbericht'!$G$317","v":0},{"$f":"SUM($AE$53:$AR$53)","v":8859},null,null,null,null,null,null,null,null,null,null,null,null,null,null,null,null,null,null,null,null,null,{"$error":"#VALUE!"},null,null,null,null,null,null,null,null,null,null,null,{"$error":"#VALUE!"}]
[null,null,null,null,null,null,null,null,null,null,null,null,null,null,null,null,{"$f":"IF($Q$56=\"1\",+$Q$55+0.5,+$Q$55)","v":"0"},{"$f":"IF($R$56=\"1\",+$R$55+0.5,+$R$55)","v":"0"},{"$f":"IF($S$56=\"1\",+$S$55+0.5,+$S$55)","v":"0"},{"$f":"IF($T$56=\"1\",+$T$55+0.5,+$T$55)","v":"0"},{"$f":"IF($U$56=\"1\",+$U$55+0.5,+$U$55)","v":"0"},{"$f":"IF($V$56=\"1\",+$V$55+0.5,+$V$55)","v":"0"},{"$f":"IF($W$56=\"1\",+$W$55+0.5,+$W$55)","v":"0"},{"$f":"IF($X$56=\"1\",+$X$55+0.5,+$X$55)","v":"0"},{"$f":"IF($Y$56=\"1\",+$Y$55+0.5,+$Y$55)","v":"0"},{"$f":"IF($Z$56=\"1\",+$Z$55+0.5,+$Z$55)","v":"0"},{"$f":"IF($AA$56=\"1\",+$AA$55+0.5,+$AA$55)","v":11},{"$f":"IF($AB$56=\"1\",+$AB$55+0.5,+$AB$55)","v":0.5},null,{"$f":"+$F$5","v":"ESV 2"},{"$f":"+'Anhang zum Spielbericht'!$H$19","v":1512},{"$f":"+'Anhang zum Spielbericht'!$H$40","v":1687},{"$f":"+'Anhang zum Spielbericht'!$H$63","v":1438},{"$f":"+'Anhang zum Spielbericht'!$H$87","v":1569},{"$f":"+'Anhang zum Spielbericht'!$H$110","v":1671},{"$f":"+'Anhang zum Spielbericht'!$H$133","v":0},{"$f":"+'Anhang zum Spielbericht'!$H$156","v":0},{"$f":"+'Anhang zum Spielbericht'!$H$179","v":0},{"$f":"+'Anhang zum Spielbericht'!$H$202","v":0},{"$f":"+'Anhang zum Spielbericht'!$H$225","v":0},{"$f":"+'Anhang zum Spielbericht'!$H$248","v":0},{"$f":"+'Anhang zum Spielbericht'!$H$271","v":0},{"$f":"+'Anhang zum Spielbericht'!$H$294","v":0},{"$f":"+'Anhang zum Spielbericht'!$H$317","v":0},{"$f":"SUM($AE$54:$AR$54)","v":7877},null,null,null,{"$error":"#VALUE!"},null,null,null,null,{"$error":"#VALUE!"}]
[null,null,null,null,null,null,"KAH 1","DAT 2"," ",null,null,null,null,null,null,null,{"$f":"IF(Q10>0,RANK(Q10,$Q$10:$Z$10,10),\"0\")","v":"0"},{"$f":"IF(R10>0,RANK(R10,$Q$10:$Z$10,10),\"0\")","v":"0"},"0","0","0","0","0","0","0","0",{"$f":"IF($AA$10>0,RANK($AA$10,$Q$10:$AA$10,10),\"0\")","v":11},{"$f":"IF($AB$10>0,RANK($AB$10,$Q$10:$W$10,10),\"0\")","v":"0"},null,{"$f":"+$F$6","v":"AXA 1"},{"$f":"+'Anhang zum Spielbericht'!$I$19","v":1599},{"$f":"+'Anhang zum Spielbericht'!$I$40","v":2044},{"$f":"+'Anhang zum Spielbericht'!$I$63","v":1865},{"$f":"+'Anhang zum Spielbericht'!$I$87","v":2034},{"$f":"+'Anhang zum Spielbericht'!$I$110","v":1945},{"$f":"+'Anhang zum Spielbericht'!$I$133","v":0},{"$f":"+'Anhang zum Spielbericht'!$I$156","v":0},{"$f":"+'Anhang zum Spielbericht'!$I$179","v":0},{"$f":"+'Anhang zum Spielbericht'!$I$202","v":0},{"$f":"+'Anhang zum Spielbericht'!$I$225","v":0},{"$f":"+'Anhang zum Spielbericht'!$I$248","v":0},{"$f":"+'Anhang zum Spielbericht'!$I$271","v":0},{"$f":"+'Anhang zum Spielbericht'!$I$294","v":0},{"$f":"+'Anhang zum Spielbericht'!$I$317","v":0},{"$f":"SUM($AE$55:$AR$55)","v":9487}]
[null,null,null,null,null,null,"BAS 2","JUS 2"," ",null,null,null,null,null,null,null,{"$f":"IF(COUNTIF(Q10:$Z$10,$Q$7)>1,\"1\",\"\")","v":""},{"$f":"IF(COUNTIF(R10:$Z$10,$Q$7)>1,\"1\",\"\")","v":""},{"$f":"IF(COUNTIF(S10:$Z$10,$Q$7)>1,\"1\",\"\")","v":""},{"$f":"IF(COUNTIF(T10:$Z$10,$Q$7)>1,\"1\",\"\")","v":""},{"$f":"IF(COUNTIF(U10:$Z$10,$Q$7)>1,\"1\",\"\")","v":""},{"$f":"IF(COUNTIF(V10:$Z$10,$Q$7)>1,\"1\",\"\")","v":""},{"$f":"IF(COUNTIF(W10:$Z$10,$Q$7)>1,\"1\",\"\")","v":""},{"$f":"IF(COUNTIF(X10:$Z$10,$Q$7)>1,\"1\",\"\")","v":""},{"$f":"IF(COUNTIF(Y10:$Z$10,$Q$7)>1,\"1\",\"\")","v":""},{"$f":"IF(COUNTIF(Z10:$Z$10,$Q$7)>1,\"1\",\"\")","v":""},{"$f":"IF(COUNTIF($Q$10:$AA$10,$AA$7)>1,\"1\",\"\")","v":""},{"$f":"IF(COUNTIF($Q$10:$W$10,$AB$7)>1,\"1\",\"\")","v":"1"},null,{"$f":"+$F$7","v":"ERG 3"},{"$f":"+'Anhang zum Spielbericht'!$J$19","v":1547},{"$f":"+'Anhang zum Spielbericht'!$J$40","v":1586},{"$f":"+'Anhang zum Spielbericht'!$J$63","v":1696},{"$f":"+'Anhang zum Spielbericht'!$J$87","v":1656},{"$f":"+'Anhang zum Spielbericht'!$J$110","v":1569},{"$f":"+'Anhang zum Spielbericht'!$J$133","v":0},{"$f":"+'Anhang zum Spielbericht'!$J$156","v":0},{"$f":"+'Anhang zum Spielbericht'!$J$179","v":0},{"$f":"+'Anhang zum Spielbericht'!$J$202","v":0},{"$f":"+'Anhang zum Spielbericht'!$J$225","v":0},{"$f":"+'Anhang zum Spielbericht'!$J$248","v":0},{"$f":"+'Anhang zum Spielbericht'!$J$271","v":0},{"$f":"+'Anhang zum Spielbericht'!$J$294","v":0},{"$f":"+'Anhang zum Spielbericht'!$J$317","v":0},{"$f":"SUM($AE$56:$AR$56)","v":8054}]
[null,null,null,null,null,null,"SGS 1","GAS 1"," ",null,null,null,null,null,null,null,null,null,null,null,null,null,null,null,null,null,null,null,null,{"$f":"+$F$8","v":"DAT 2"},{"$f":"+'Anhang zum Spielbericht'!$K$19","v":1817},{"$f":"+'Anhang zum Spielbericht'!$K$40","v":1967},{"$f":"+'Anhang zum Spielbericht'!$K$63","v":1661},{"$f":"+'Anhang zum Spielbericht'!$K$87","v":2005},{"$f":"+'Anhang zum Spielbericht'!$K$110","v":1975},{"$f":"+'Anhang zum Spielbericht'!$K$133","v":0},{"$f":"+'Anhang zum Spielbericht'!$K$156","v":0},{"$f":"+'Anhang zum Spielbericht'!$K$179","v":0},{"$f":"+'Anhang zum Spielbericht'!$K$202","v":0},{"$f":"+'Anhang zum Spielbericht'!$K$225","v":0},{"$f":"+'Anhang zum Spielbericht'!$K$248","v":0},{"$f":"+'Anhang zum Spielbericht'!$K$271","v":0},{"$f":"+'Anhang zum Spielbericht'!$K$294","v":0},{"$f":"+'Anhang zum Spielbericht'!$K$317","v":0},{"$f":"SUM($AE$57:$AR$57)","v":9425}]
[null,null,null,null,null,null,"FAH 2","FAH 3"," ",null,null,null,null,null,null,null,"8. Antritt",null,null,null,null,null,null,null,null,null,null,null,null,{"$f":"+$F$9","v":"PAN 1"},{"$f":"+'Anhang zum Spielbericht'!$L$19","v":1921},{"$f":"+'Anhang zum Spielbericht'!$L$40","v":1955},{"$f":"+'Anhang zum Spielbericht'!$L$63","v":1847},{"$f":"+'Anhang zum Spielbericht'!$L$87","v":2032},{"$f":"+'Anhang zum Spielbericht'!$L$110","v":1879},{"$f":"+'Anhang zum Spielbericht'!$L$133","v":0},{"$f":"+'Anhang zum Spielbericht'!$L$156","v":0},{"$f":"+'Anhang zum Spielbericht'!$L$179","v":0},{"$f":"+'Anhang zum Spielbericht'!$L$202","v":0},{"$f":"+'Anhang zum Spielbericht'!$L$225","v":0},{"$f":"+'Anhang zum Spielbericht'!$L$248","v":0},{"$f":"+'Anhang zum Spielbericht'!$L$271","v":0},{"$f":"+'Anhang zum Spielbericht'!$L$294","v":0},{"$f":"+'Anhang zum Spielbericht'!$L$317","v":0},{"$f":"SUM($AE$58:$AR$58)","v":9634},null,null,null,"E D  2",null,null,null,null,"E L B  1",null,null,null,null,null,null,null,null,null,null,null,null,"E D  2",null,null,null,null,null,null,null,null,null,null,null,"E L B  1"]
[null,null,null,null,null,null,"CLP 1","OTT 3"," ",null,null,null,null,null,null,null,{"$f":"IF($Q$61=\"1\",+$Q$60+0.5,+$Q$60)","v":0.5},{"$f":"IF($R$61=\"1\",+$R$60+0.5,+$R$60)","v":0.5},{"$f":"IF($S$61=\"1\",+$S$60+0.5,+$S$60)","v":0.5},{"$f":"IF($T$61=\"1\",+$T$60+0.5,+$T$60)","v":0.5},{"$f":"IF($U$61=\"1\",+$U$60+0.5,+$U$60)","v":0.5},{"$f":"IF($V$61=\"1\",+$V$60+0.5,+$V$60)","v":0.5},{"$f":"IF($W$61=\"1\",+$W$60+0.5,+$W$60)","v":0.5},{"$f":"IF($X$61=\"1\",+$X$60+0.5,+$X$60)","v":0.5},{"$f":"IF($Y$61=\"1\",+$Y$60+0.5,+$Y$60)","v":0.5},{"$f":"IF($Z$61=\"1\",+$Z$60+0.5,+$Z$60)","v":0.5},{"$f":"IF($AA$61=\"1\",+$AA$60+0.5,+$AA$60)","v":11},{"$f":"IF($AB$61=\"1\",+$AB$60+0.5,+$AB$60)","v":0.5},null,{"$f":"+$F$10","v":"GEN 3"},{"$f":"+'Anhang zum Spielbericht'!$M$19","v":1734},{"$f":"+'Anhang zum Spielbericht'!$M$40","v":1646},{"$f":"+'Anhang zum Spielbericht'!$M$63","v":1758},{"$f":"+'Anhang zum Spielbericht'!$M$87","v":1845},{"$f":"+'Anhang zum Spielbericht'!$M$110","v":1789},{"$f":"+'Anhang zum Spielbericht'!$M$133","v":0},{"$f":"+'Anhang zum Spielbericht'!$M$156","v":0},{"$f":"+'Anhang zum Spielbericht'!$M$179","v":0},{"$f":"+'Anhang zum Spielbericht'!$M$202","v":0},{"$f":"+'Anhang zum Spielbericht'!$M$225","v":0},{"$f":"+'Anhang zum Spielbericht'!$M$248","v":0},{"$f":"+'Anhang zum Spielbericht'!$M$271","v":0},{"$f":"+'Anhang zum Spielbericht'!$M$294","v":0},{"$f":"+'Anhang zum Spielbericht'!$M$317","v":0},{"$f":"SUM($AE$59:$AR$59)","v":8772}]
[null,null,null,null,null,null,"TRE 1","HAS 7"," ",null,null,null,null,null,null,null,{"$f":"IF(Q11>0,RANK(Q11,$Q$11:$Z$11,10),\"0\")","v":"0"},{"$f":"IF(R11>0,RANK(R11,$Q$11:$Z$11,10),\"0\")","v":"0"},"0","0","0","0","0","0","0","0",{"$f":"IF($AA$11>0,RANK($AA$11,$Q$11:$AA$11,10),\"0\")","v":11},{"$f":"IF($AB$11>0,RANK($AB$11,$Q$11:$W$11,10),\"0\")","v":"0"},null,{"$f":"+$F$11","v":"FAH 3"},{"$f":"+'Anhang zum Spielbericht'!$N$19","v":1951},{"$f":"+'Anhang zum Spielbericht'!$N$40","v":1438},{"$f":"+'Anhang zum Spielbericht'!$N$63","v":1588},{"$f":"+'Anhang zum Spielbericht'!$N$87","v":1671},{"$f":"+'Anhang zum Spielbericht'!$N$110","v":1575},{"$f":"+'Anhang zum Spielbericht'!$N$133","v":0},{"$f":"+'Anhang zum Spielbericht'!$N$156","v":0},{"$f":"+'Anhang zum Spielbericht'!$N$179","v":0},{"$f":"+'Anhang zum Spielbericht'!$N$202","v":0},{"$f":"+'Anhang zum Spielbericht'!$N$225","v":0},{"$f":"+'Anhang zum Spielbericht'!$N$248","v":0},{"$f":"+'Anhang zum Spielbericht'!$N$271","v":0},{"$f":"+'Anhang zum Spielbericht'!$N$294","v":0},{"$f":"+'Anhang zum Spielbericht'!$N$317","v":0},{"$f":"SUM($AE$60:$AR$60)","v":8223}]
[null,null,null,null,null,null," ",null,null,null,null,null,null,null,null,null,{"$f":"IF(COUNTIF($Q$11:$Z$11,Q11)>1,\"1\",\"\")","v":"1"},{"$f":"IF(COUNTIF($Q$11:$Z$11,R11)>1,\"1\",\"\")","v":"1"},"1","1","1","1","1","1","1","1",{"$f":"IF(COUNTIF($Q$11:$AA$11,$AA$11)>1,\"1\",\"\")","v":""},{"$f":"IF(COUNTIF($Q$11:$W$11,$AB$11)>1,\"1\",\"\")","v":"1"},null,{"$f":"+$F$12","v":"HAS 5"},{"$f":"+'Anhang zum Spielbericht'!$O$19","v":1756},{"$f":"+'Anhang zum Spielbericht'!$O$40","v":1854},{"$f":"+'Anhang zum Spielbericht'!$O$63","v":1928},{"$f":"+'Anhang zum Spielbericht'!$O$87","v":1792},{"$f":"+'Anhang zum Spielbericht'!$O$110","v":1770},{"$f":"+'Anhang zum Spielbericht'!$O$133","v":0},{"$f":"+'Anhang zum Spielbericht'!$O$156","v":0},{"$f":"+'Anhang zum Spielbericht'!$O$179","v":0},{"$f":"+'Anhang zum Spielbericht'!$O$202","v":0},{"$f":"+'Anhang zum Spielbericht'!$O$225","v":0},{"$f":"+'Anhang zum Spielbericht'!$O$248","v":0},{"$f":"+'Anhang zum Spielbericht'!$O$271","v":0},{"$f":"+'Anhang zum Spielbericht'!$O$294","v":0},{"$f":"+'Anhang zum Spielbericht'!$O$317","v":0},{"$f":"SUM($AE$61:$AR$61)","v":9100},null,null,null,null,null,null,null,null,null,null,null,null,null,null,null,null,null,null,null,null,null,{"$error":"#VALUE!"},null,null,null,null,null,null,null,null,null,null,null,{"$error":"#VALUE!"}]
[null,null,null,null,null,null," ",null,null,null,null,null,null,null,null,null,null,null,null,null,null,null,null,null,null,null,null,null,null,{"$f":"+$F$13","v":"BWV 5"},{"$f":"+'Anhang zum Spielbericht'!$P$19","v":1827},{"$f":"+'Anhang zum Spielbericht'!$P$40","v":1835},{"$f":"+'Anhang zum Spielbericht'!$P$63","v":1746},{"$f":"+'Anhang zum Spielbericht'!$P$87","v":2024},{"$f":"+'Anhang zum Spielbericht'!$P$110","v":1295},{"$f":"+'Anhang zum Spielbericht'!$P$133","v":0},{"$f":"+'Anhang zum Spielbericht'!$P$156","v":0},{"$f":"+'Anhang zum Spielbericht'!$P$179","v":0},{"$f":"+'Anhang zum Spielbericht'!$P$202","v":0},{"$f":"+'Anhang zum Spielbericht'!$P$225","v":0},{"$f":"+'Anhang zum Spielbericht'!$P$248","v":0},{"$f":"+'Anhang zum Spielbericht'!$P$271","v":0},{"$f":"+'Anhang zum Spielbericht'!$P$294","v":0},{"$f":"+'Anhang zum Spielbericht'!$P$317","v":0},{"$f":"SUM($AE$62:$AR$62)","v":8727},null,null,null,{"$error":"#VALUE!"},null,null,null,null,{"$error":"#VALUE!"}]
[null,null,null,null,null,null,null,null,null,null,null,null,null,null,null,null,"9. Antritt",null,null,null,null,null,null,null,null,null,null,null,null,null,{"$f":"+'Anhang zum Spielbericht'!$Q$19","v":0},{"$f":"+'Anhang zum Spielbericht'!$Q$40","v":0},{"$f":"+'Anhang zum Spielbericht'!$Q$63","v":541},{"$f":"+'Anhang zum Spielbericht'!$Q$87","v":0},{"$f":"+'Anhang zum Spielbericht'!$Q$110","v":0},{"$f":"+'Anhang zum Spielbericht'!$Q$133","v":0},{"$f":"+'Anhang zum Spielbericht'!$Q$156","v":0},{"$f":"+'Anhang zum Spielbericht'!$Q$179","v":0},{"$f":"+'Anhang zum Spielbericht'!$Q$202","v":0},{"$f":"+'Anhang zum Spielbericht'!$Q$225","v":0},{"$f":"+'Anhang zum Spielbericht'!$Q$248","v":0},{"$f":"+'Anhang zum Spielbericht'!$Q$271","v":0},{"$f":"+'Anhang zum Spielbericht'!$Q$294","v":0},{"$f":"+'Anhang zum Spielbericht'!$Q$317","v":0},{"$f":"SUM($AE$63:$AR$63)","v":541}]
[null,null,null,null,null,null,null,null,null,null,null,null,null,null,null,null,{"$f":"IF($Q$66=\"1\",+$Q$65+0.5,+$Q$65)","v":0.5},{"$f":"IF($R$66=\"1\",+$R$65+0.5,+$R$65)","v":0.5},{"$f":"IF($S$66=\"1\",+$S$65+0.5,+$S$65)","v":0.5},{"$f":"IF($T$66=\"1\",+$T$65+0.5,+$T$65)","v":0.5},{"$f":"IF($U$66=\"1\",+$U$65+0.5,+$U$65)","v":0.5},{"$f":"IF($V$66=\"1\",+$V$65+0.5,+$V$65)","v":0.5},{"$f":"IF($W$66=\"1\",+$W$65+0.5,+$W$65)","v":0.5},{"$f":"IF($X$66=\"1\",+$X$65+0.5,+$X$65)","v":0.5},{"$f":"IF($Y$66=\"1\",+$Y$65+0.5,+$Y$65)","v":0.5},{"$f":"IF($Z$66=\"1\",+$Z$65+0.5,+$Z$65)","v":0.5},{"$f":"IF($AA$66=\"1\",+$AA$65+0.5,+$AA$65)","v":11},{"$f":"IF($AB$66=\"1\",+$AB$65+0.5,+$AB$65)","v":0.5}]
[null,null,null,null,null,null,null,null,null,null,null,null,null,null,null,null,{"$f":"IF(Q12>0,RANK(Q12,$Q$12:$Z$12,10),\"0\")","v":"0"},{"$f":"IF(R12>0,RANK(R12,$Q$12:$Z$12,10),\"0\")","v":"0"},"0","0","0","0","0","0","0","0",{"$f":"IF($AA$12>0,RANK($AA$12,$Q$12:$AA$12,10),\"0\")","v":11},{"$f":"IF($AB$12>0,RANK($AB$12,$Q$12:$W$12,10),\"0\")","v":"0"}]
[null,null,null,null,null,null,null,null,null,null,null,null,null,null,null,null,{"$f":"IF(COUNTIF($Q$12:$Z$12,Q12)>1,\"1\",\"\")","v":"1"},{"$f":"IF(COUNTIF($Q$12:$Z$12,R12)>1,\"1\",\"\")","v":"1"},"1","1","1","1","1","1","1","1",{"$f":"IF(COUNTIF($Q$12:$AA$12,$AA$12)>1,\"1\",\"\")","v":""},{"$f":"IF(COUNTIF($Q$12:$W$12,$AB$12)>1,\"1\",\"\")","v":"1"},null,null,null,null,null,null,null,null,null,null,null,null,null,null,null,null,null,null,null,null,"D K Y  1",null,null,null,null,"J U L  1",null,null,null,null,null,null,null,null,null,null,null,null,"D K Y  1",null,null,null,null,null,null,null,null,null,null,null,"J U L  1"]
[]
[null,null,null,null,null,null,null,null,null,null,null,null,null,null,null,null,"10. Antritt"]
[null,null,null,null,null,null,null,null,null,null,null,null,null,null,null,null,{"$f":"IF($Q$71=\"1\",+$Q$70+0.5,+$Q$70)","v":0.5},{"$f":"IF($R$71=\"1\",+$R$70+0.5,+$R$70)","v":0.5},{"$f":"IF($S$71=\"1\",+$S$70+0.5,+$S$70)","v":0.5},{"$f":"IF($T$71=\"1\",+$T$70+0.5,+$T$70)","v":0.5},{"$f":"IF($U$71=\"1\",+$U$70+0.5,+$U$70)","v":0.5},{"$f":"IF($V$71=\"1\",+$V$70+0.5,+$V$70)","v":0.5},{"$f":"IF($W$71=\"1\",+$W$70+0.5,+$W$70)","v":0.5},{"$f":"IF($X$71=\"1\",+$X$70+0.5,+$X$70)","v":0.5},{"$f":"IF($Y$71=\"1\",+$Y$70+0.5,+$Y$70)","v":0.5},{"$f":"IF($Z$71=\"1\",+$Z$70+0.5,+$Z$70)","v":0.5},{"$f":"IF($AA$71=\"1\",+$AA$70+0.5,+$AA$70)","v":11},{"$f":"IF($AB$71=\"1\",+$AB$70+0.5,+$AB$70)","v":0.5},null,null,null,null,null,null,null,null,null,null,null,null,null,null,null,null,null,null,null,null,null,null,null,null,null,null,null,null,null,null,null,null,null,null,null,null,null,null,{"$error":"#VALUE!"},null,null,null,null,null,null,null,null,null,null,null,{"$error":"#VALUE!"}]
[null,null,null,null,null,null,null,null,null,null,null,null,null,null,null,null,{"$f":"IF(Q13>0,RANK(Q13,$Q$13:$Z$13,10),\"0\")","v":"0"},{"$f":"IF(R13>0,RANK(R13,$Q$13:$Z$13,10),\"0\")","v":"0"},"0","0","0","0","0","0","0","0",{"$f":"IF($AA$13>0,RANK($AA$13,$Q$13:$AA$13,10),\"0\")","v":11},{"$f":"IF($AB$13>0,RANK($AB$13,$Q$13:$W$13,10),\"0\")","v":"0"},null,null,null,null,null,null,null,null,null,null,null,null,null,null,null,null,null,null,null,null,{"$error":"#VALUE!"},null,null,null,null,{"$error":"#VALUE!"}]
[null,null,null,null,null,null,null,null,null,null,null,null,null,null,null,null,{"$f":"IF(COUNTIF($Q$13:$Z$13,Q13)>1,\"1\",\"\")","v":"1"},{"$f":"IF(COUNTIF($Q$13:$Z$13,R13)>1,\"1\",\"\")","v":"1"},"1","1","1","1","1","1","1","1",{"$f":"IF(COUNTIF($Q$13:$AA$13,$AA$13)>1,\"1\",\"\")","v":""},{"$f":"IF(COUNTIF($Q$13:$W$13,$AB$13)>1,\"1\",\"\")","v":"1"}]
[]
[null,null,null,null,null,null,null,null,null,null,null,null,null,null,null,null,"11. Antritt"]
[null,null,null,null,null,null,null,null,null,null,null,null,null,null,null,null,{"$f":"IF($Q$76=\"1\",+$Q$75+0.5,+$Q$75)","v":0.5},{"$f":"IF($R$76=\"1\",+$R$75+0.5,+$R$75)","v":0.5},{"$f":"IF($S$76=\"1\",+$S$75+0.5,+$S$75)","v":0.5},{"$f":"IF($T$76=\"1\",+$T$75+0.5,+$T$75)","v":0.5},{"$f":"IF($U$76=\"1\",+$U$75+0.5,+$U$75)","v":0.5},{"$f":"IF($V$76=\"1\",+$V$75+0.5,+$V$75)","v":0.5},{"$f":"IF($W$76=\"1\",+$W$75+0.5,+$W$75)","v":0.5},{"$f":"IF($X$76=\"1\",+$X$75+0.5,+$X$75)","v":0.5},{"$f":"IF($Y$76=\"1\",+$Y$75+0.5,+$Y$75)","v":0.5},{"$f":"IF($Z$76=\"1\",+$Z$75+0.5,+$Z$75)","v":0.5},{"$f":"IF($AA$76=\"1\",+$AA$75+0.5,+$AA$75)","v":11},{"$f":"IF($AB$76=\"1\",+$AB$75+0.5,+$AB$75)","v":0.5},null,null,null,null,null,null,null,null,null,null,null,null,null,null,null,null,null,null,null,null,"H P A  1",null,null,null,null,"D A T  1",null,null,null,null,null,null,null,null,null,null,null,null,"H P A  1",null,null,null,null,null,null,null,null,null,null,null,"D A T  1"]
[null,null,null,null,null,null,null,null,null,null,null,null,null,null,null,null,{"$f":"IF(Q14>0,RANK(Q14,$Q$14:$Z$14,10),\"0\")","v":"0"},{"$f":"IF(R14>0,RANK(R14,$Q$14:$Z$14,10),\"0\")","v":"0"},"0","0","0","0","0","0","0","0",{"$f":"IF($AA$14>0,RANK($AA$14,$Q$14:$AA$14,10),\"0\")","v":11},{"$f":"IF($AB$14>0,RANK($AB$14,$Q$14:$W$14,10),\"0\")","v":"0"}]
[null,null,null,null,null,null,null,null,null,null,null,null,null,null,null,null,{"$f":"IF(COUNTIF($Q$14:$Z$14,Q14)>1,\"1\",\"\")","v":"1"},{"$f":"IF(COUNTIF($Q$14:$Z$14,R14)>1,\"1\",\"\")","v":"1"},"1","1","1","1","1","1","1","1",{"$f":"IF(COUNTIF($Q$14:$AA$14,$AA$14)>1,\"1\",\"\")","v":""},{"$f":"IF(COUNTIF($Q$14:$W$14,$AB$14)>1,\"1\",\"\")","v":"1"}]
[null,null,null,null,null,null,null,null,null,null,null,null,null,null,null,null,null,null,null,null,null,null,null,null,null,null,null,null,null,null,null,null,null,null,null,null,null,null,null,null,null,null,null,null,null,null,null,null,null,null,null,null,null,null,null,null,null,null,null,null,null,null,null,null,null,null,{"$error":"#VALUE!"},null,null,null,null,null,null,null,null,null,null,null,{"$error":"#VALUE!"}]
[null,null,null,null,null,null,null,null,null,null,null,null,null,null,null,null,"12. Antritt",null,null,null,null,null,null,null,null,null,null,null,null,null,null,null,null,null,null,null,null,null,null,null,null,null,null,null,null,null,null,null,{"$error":"#VALUE!"},null,null,null,null,{"$error":"#VALUE!"}]
[null,null,null,null,null,null,null,null,null,null,null,null,null,null,null,null,{"$f":"IF($Q$81=\"1\",+$Q$80+0.5,+$Q$80)","v":0.5},{"$f":"IF($R$81=\"1\",+$R$80+0.5,+$R$80)","v":0.5},{"$f":"IF($S$81=\"1\",+$S$80+0.5,+$S$80)","v":0.5},{"$f":"IF($T$81=\"1\",+$T$80+0.5,+$T$80)","v":0.5},{"$f":"IF($U$81=\"1\",+$U$80+0.5,+$U$80)","v":0.5},{"$f":"IF($V$81=\"1\",+$V$80+0.5,+$V$80)","v":0.5},{"$f":"IF($W$81=\"1\",+$W$80+0.5,+$W$80)","v":0.5},{"$f":"IF($X$81=\"1\",+$X$80+0.5,+$X$80)","v":0.5},{"$f":"IF($Y$81=\"1\",+$Y$80+0.5,+$Y$80)","v":0.5},{"$f":"IF($Z$81=\"1\",+$Z$80+0.5,+$Z$80)","v":0.5},{"$f":"IF($AA$81=\"1\",+$AA$80+0.5,+$AA$80)","v":11},{"$f":"IF($AB$81=\"1\",+$AB$80+0.5,+$AB$80)","v":0.5}]
[null,null,null,null,null,null,null,null,null,null,null,null,null,null,null,null,{"$f":"IF(Q15>0,RANK(Q15,$Q$15:$Z$15,10),\"0\")","v":"0"},{"$f":"IF(R15>0,RANK(R15,$Q$15:$Z$15,10),\"0\")","v":"0"},"0","0","0","0","0","0","0","0",{"$f":"IF($AA$15>0,RANK($AA$15,$Q$15:$AA$15,10),\"0\")","v":11},{"$f":"IF($AB$15>0,RANK($AB$15,$Q$15:$W$15,10),\"0\")","v":"0"}]
[null,null,null,null,null,null,null,null,null,null,null,null,null,null,null,null,{"$f":"IF(COUNTIF($Q$15:$Z$15,Q15)>1,\"1\",\"\")","v":"1"},{"$f":"IF(COUNTIF($Q$15:$Z$15,R15)>1,\"1\",\"\")","v":"1"},"1","1","1","1","1","1","1","1",{"$f":"IF(COUNTIF($Q$15:$AA$15,$AA$15)>1,\"1\",\"\")","v":""},{"$f":"IF(COUNTIF($Q$15:$W$15,$AB$15)>1,\"1\",\"\")","v":"1"}]
[null,null,null,null,null,null,null,null,null,null,null,null,null,null,null,null,null,null,null,null,null,null,null,null,null,null,null,null,null,null,null,null,null,null,null,null,null,null,null,null,null,null,null,null,null,null,null,null,"K S  2",null,null,null,null,"P A N  1",null,null,null,null,null,null,null,null,null,null,null,null,"K S  2",null,null,null,null,null,null,null,null,null,null,null,"P A N  1"]
[null,null,null,null,null,null,null,null,null,null,null,null,null,null,null,null,"13. Antritt"]
[null,null,null,null,null,null,null,null,null,null,null,null,null,null,null,null,{"$f":"IF($Q$86=\"1\",+$Q$85+0.5,+$Q$85)","v":0.5},{"$f":"IF($R$86=\"1\",+$R$85+0.5,+$R$85)","v":0.5},{"$f":"IF($S$86=\"1\",+$S$85+0.5,+$S$85)","v":0.5},{"$f":"IF($T$86=\"1\",+$T$85+0.5,+$T$85)","v":0.5},{"$f":"IF($U$86=\"1\",+$U$85+0.5,+$U$85)","v":0.5},{"$f":"IF($V$86=\"1\",+$V$85+0.5,+$V$85)","v":0.5},{"$f":"IF($W$86=\"1\",+$W$85+0.5,+$W$85)","v":0.5},{"$f":"IF($X$86=\"1\",+$X$85+0.5,+$X$85)","v":0.5},{"$f":"IF($Y$86=\"1\",+$Y$85+0.5,+$Y$85)","v":0.5},{"$f":"IF($Z$86=\"1\",+$Z$85+0.5,+$Z$85)","v":0.5},{"$f":"IF($AA$86=\"1\",+$AA$85+0.5,+$AA$85)","v":11},{"$f":"IF($AB$86=\"1\",+$AB$85+0.5,+$AB$85)","v":0.5}]
[null,null,null,null,null,null,null,null,null,null,null,null,null,null,null,null,{"$f":"IF(Q16>0,RANK(Q16,$Q$16:$Z$16,10),\"0\")","v":"0"},{"$f":"IF(R16>0,RANK(R16,$Q$16:$Z$16,10),\"0\")","v":"0"},"0","0","0","0","0","0","0","0",{"$f":"IF($AA$16>0,RANK($AA$16,$Q$16:$AA$16,10),\"0\")","v":11},{"$f":"IF($AB$16>0,RANK($AB$16,$Q$16:$W$16,10),\"0\")","v":"0"}]
[null,null,null,null,null,null,null,null,null,null,null,null,null,null,null,null,{"$f":"IF(COUNTIF($Q$16:$Z$16,Q16)>1,\"1\",\"\")","v":"1"},{"$f":"IF(COUNTIF($Q$16:$Z$16,R16)>1,\"1\",\"\")","v":"1"},"1","1","1","1","1","1","1","1",{"$f":"IF(COUNTIF($Q$16:$AA$16,$AA$16)>1,\"1\",\"\")","v":""},{"$f":"IF(COUNTIF($Q$16:$W$16,$AB$16)>1,\"1\",\"\")","v":"1"}]
[]
[null,null,null,null,null,null,null,null,null,null,null,null,null,null,null,null,"14. Antritt"]
[null,null,null,null,null,null,null,null,null,null,null,null,null,null,null,null,{"$f":"IF($Q$91=\"1\",+$Q$90+0.5,+$Q$90)","v":0.5},{"$f":"IF($R$91=\"1\",+$R$90+0.5,+$R$90)","v":0.5},{"$f":"IF($S$91=\"1\",+$S$90+0.5,+$S$90)","v":0.5},{"$f":"IF($T$91=\"1\",+$T$90+0.5,+$T$90)","v":0.5},{"$f":"IF($U$91=\"1\",+$U$90+0.5,+$U$90)","v":0.5},{"$f":"IF($V$91=\"1\",+$V$90+0.5,+$V$90)","v":0.5},{"$f":"IF($W$91=\"1\",+$W$90+0.5,+$W$90)","v":0.5},{"$f":"IF($X$91=\"1\",+$X$90+0.5,+$X$90)","v":0.5},{"$f":"IF($Y$91=\"1\",+$Y$90+0.5,+$Y$90)","v":0.5},{"$f":"IF($Z$91=\"1\",+$Z$90+0.5,+$Z$90)","v":0.5},{"$f":"IF($AA$91=\"1\",+$AA$90+0.5,+$AA$90)","v":11},{"$f":"IF($AB$91=\"1\",+$AB$90+0.5,+$AB$90)","v":0.5}]
[null,null,null,null,null,null,null,null,null,null,null,null,null,null,null,null,{"$f":"IF(Q17>0,RANK(Q17,$Q$17:$Z$17,10),\"0\")","v":"0"},{"$f":"IF(R17>0,RANK(R17,$Q$17:$Z$17,10),\"0\")","v":"0"},"0","0","0","0","0","0","0","0",{"$f":"IF($AA$17>0,RANK($AA$17,$Q$17:$AA$17,10),\"0\")","v":11},{"$f":"IF($AB$17>0,RANK($AB$17,$Q$17:$W$17,10),\"0\")","v":"0"}]
[null,null,null,null,null,null,null,null,null,null,null,null,null,null,null,null,{"$f":"IF(COUNTIF($Q$17:$Z$17,Q17)>1,\"1\",\"\")","v":"1"},{"$f":"IF(COUNTIF($Q$17:$Z$17,R17)>1,\"1\",\"\")","v":"1"},"1","1","1","1","1","1","1","1",{"$f":"IF(COUNTIF($Q$17:$AA$17,$AA$17)>1,\"1\",\"\")","v":""},{"$f":"IF(COUNTIF($Q$17:$W$17,$AB$17)>1,\"1\",\"\")","v":"1"}]

{"sheet":"Hilfstabelle","index":19,"n_rows":72,"n_cols":89,"rows_kept":72,"cut":false,"hidden":true,"merged":[[4,23,4,24],[1,85,1,88],[2,0,2,3],[2,5,2,6],[2,8,2,11],[3,14,3,15],[3,17,3,18],[2,70,2,83],[1,62,1,68],[2,58,2,60],[1,51,1,60]]}
[]
[null,null,null,null,null,null,null,null,null,null,null,null,null,null,null,null,null,null,null,null,null,null,null,null,null,null,null,null,null,null,null,null,null,null,null,null,null,null,null,null,null,"Anhang zum Spielbericht",null,"Spielberichte drucken",null,null,null,null,null,null,null,"Für Spielereinteilung",null,null,null,null,null,null,null,null,null,null,"Für Kalender",null,null,null,null,null,null,null,null,null,null,null,null,null,null,null,null,null,null,null,null,null,null,"Anhang zum Spielbericht"]
["Spieler, bei neue Saison neue Formel bei Bahn",null,null,null,null,"Für Spielberichte",null,null,"Anhang zum Spielbericht",null,null,null,null,null,null,null,null,null,null,null,"Mitglieder","Passnummer",null,null,null,null,null,null,null,null,null,null,null,null,null,null,null,null,null,null,null,null,null,null,null,null,null,null,{"$f":"+'Spielbogen 10er'!J5","v":"OT"},{"$f":"IF(AW3=\"OT\",\"Othmarschen\",\"Wandsbek\")","v":"Othmarschen"},null,{"$f":"+'Offizielle BSV-Rangliste'!F9","v":"Annegret Schmidt"},{"$f":"+'Offizielle BSV-Rangliste'!I9","v":137.50793650793651},"1.",{"$f":"+B5","v":"2025-09-09"},{"$f":"+C5&\" - (\"&AW3&\")\"","v":"Othmarschen - (OT)"},null,"Jahr","Mannschaftsschnitt letzte Saison",null,null,null,"1. Antritt",{"$f":"+AX3","v":"Othmarschen"},null,null,"Turniere","Meldeschluss","Termine",null,"Anlage für Übersicht der Klasse",null,null,null,null,null,null,null,null,null,null,null,null,null,null,"Datenüberprüfung","Klicken","Datenmatrix","Spalte1"]
["Antritt","Datum","Bahn","Jahr",null,"Datum","Klasse",null,"Antritt","Datum","Bahn","Ausrichter",null,null,"Strafgeldliste",null,null,"Spielereinteilung",null,null,"Annegret Schmidt",19222,null,null,null,null,null,null,null,null,null,null,null,null,null,null,null,null,null,null,null,null,null,"1. Antritt",null,null,{"$f":"+Mannschaftsübersicht!D8","v":"Panasonic 1"},{"$f":"+Mannschaftsübersicht!C8","v":"1."},{"$f":"+'Spielbogen 10er'!J6","v":"WB"},{"$f":"IF(AW4=\"OT\",\"Othmarschen\",\"Wandsbek\")","v":"Wandsbek"},null,{"$f":"+'Offizielle BSV-Rangliste'!F10","v":"Ilona Wetzel"},{"$f":"+'Offizielle BSV-Rangliste'!I10","v":153.75510204081633},"2.",{"$f":"+B6","v":"2025-09-23"},{"$f":"+C6&\" - (\"&AW4&\")\"","v":"Wandsbek - (WB)"},null,"24/25","Pins","Schnitt Mann.","Schnitt Einzel",null,{"$f":"+BC3","v":"2025-09-09"},{"$f":"+Spielereinteilung!B106","v":"Jörg Frahm"},null,"Meldeschluss","ED = Eröffnungsdoppel  ",{"$f":"+'Anmeldegruppen Turniere'!$AC$7","v":"2025-08-20"},{"$f":"+'Anmeldegruppen Turniere'!$AB$8","v":"13. / 14. 09. 2025"},null,{"$f":"IF($K$5=\"Wandsbek\",\"WB\",\"OT\")","v":"OT"},{"$f":"IF($K$6=\"Wandsbek\",\"WB\",\"OT\")","v":"WB"},{"$f":"IF($K$7=\"Wandsbek\",\"WB\",\"OT\")","v":"OT"},{"$f":"IF($K$8=\"Wandsbek\",\"WB\",\"OT\")","v":"WB"},{"$f":"IF($K$9=\"Wandsbek\",\"WB\",\"OT\")","v":"OT"},{"$f":"IF($K$10=\"Wandsbek\",\"WB\",\"OT\")","v":"WB"},{"$f":"IF($K$11=\"Wandsbek\",\"WB\",\"OT\")","v":"OT"},{"$f":"IF($K$12=\"Wandsbek\",\"WB\",\"OT\")","v":"WB"},{"$f":"IF($K$13=\"Wandsbek\",\"WB\",\"OT\")","v":"OT"},{"$f":"IF($K$14=\"Wandsbek\",\"WB\",\"OT\")","v":"WB"},{"$f":"IF($K$15=\"Wandsbek\",\"WB\",\"OT\")","v":"OT"},{"$f":"IF($K$16=\"Wandsbek\",\"WB\",\"OT\")","v":"WB"},{"$f":"IF($K$17=\"Wandsbek\",\"WB\",\"OT\")","v":"OT"},{"$f":"IF($K$18=\"Wandsbek\",\"WB\",\"OT\")","v":"WB"},null,"10. Antritt",{"$f":"HYPERLINK(VLOOKUP(CH4,Anhang_zum_Spielbericht_Datenmatrix,2,0),\"Hier klicken\")","v":"Hier klicken"},"1. Antritt","#='Anhang zum Spielbericht'!Anhang_zum_Spielbericht_1_Antritt"]
["1.",{"$f":"+'Hilfstabelle Mannschaften'!C4","v":"2025-09-09"},{"$f":"+AX3","v":"Othmarschen"},{"$f":"+'Hilfstabelle Mannschaften'!I8","v":"2025/2026"},null,{"$f":"+B5","v":"2025-09-09"},{"$f":"+'Hilfstabelle Mannschaften'!I4","v":"B2"},null,1,{"$f":"+$B$5","v":"2025-09-09"},{"$f":"+C5","v":"Othmarschen"},{"$f":"+'Hilfstabelle Mannschaften'!E4","v":"Eppendorf AG 1"},{"$f":"+'Spielbogen 10er'!G9","v":"EAG 1"},null,"1. Antritt",{"$f":"+J5","v":"2025-09-09"},null,{"$f":"+B5","v":"2025-09-09"},{"$f":"IF($K$5=\"Wandsbek\",\"WB\",\"OT\")","v":"OT"},null,"Deniz Hagelstein",24775,null,"Anhang zum Spielbericht",null,null,{"$f":"+L5","v":"Eppendorf AG 1"},{"$f":"+L6","v":"Energie Sportvereinigung 2"},{"$f":"+L7","v":"AXA 1"},{"$f":"+L8","v":"ERGO Sports 3"},{"$f":"+L9","v":"Dataport 2"},{"$f":"+L10","v":"Panasonic 1"},{"$f":"+L11","v":"Generali 3"},{"$f":"+L12","v":"Finanzamt 3"},{"$f":"+L13","v":"HASPA 5"},{"$f":"+L14","v":"BWVL 5"},{"$f":"+L15","v":"Eppendorf AG 1"},null,null,null,null,"2. Antritt",null,"2. Antritt",null,null,{"$f":"+Mannschaftsübersicht!D9","v":"AXA 1"},{"$f":"+Mannschaftsübersicht!C9","v":"2."},{"$f":"+'Spielbogen 10er'!J7","v":"OT"},"Othmarschen",null,{"$f":"+'Offizielle BSV-Rangliste'!F16","v":"Mario Jurk"},{"$f":"+'Offizielle BSV-Rangliste'!I16","v":180.27777777777777},"3.",{"$f":"+B7","v":"2025-10-07"},"Othmarschen - (OT)",null,null,26254,1875,156.27000000000001,null,null,{"$f":"+Spielereinteilung!B107","v":"Ilona Wetzel"},null,null,null,null,null,null,{"$f":"+$B$5","v":"2025-09-09"},{"$f":"+$B$6","v":"2025-09-23"},{"$f":"+$B$7","v":"2025-10-07"},{"$f":"+$B$8","v":"2025-10-21"},{"$f":"+$B$9","v":"2025-11-04"},{"$f":"+$B$10","v":"2025-11-18"},{"$f":"+$B$11","v":"2026-01-13"},{"$f":"+$B$12","v":"2026-01-27"},{"$f":"+$B$13","v":"2026-02-10"},{"$f":"+$B$14","v":"2026-02-24"},{"$f":"+$B$15","v":"2026-03-10"},{"$f":"+$B$16","v":"2026-03-24"},{"$f":"+$B$17","v":"2026-04-07"},{"$f":"+$B$18","v":"2026-04-21"},null,null,null,"2. Antritt","#='Anhang zum Spielbericht'!Anhang_zum_Spielbericht_2_Antritt"]
["2.",{"$f":"+'Hilfstabelle Mannschaften'!C5","v":"2025-09-23"},"Wandsbek",null,null,{"$f":"+B6","v":"2025-09-23"},null,null,2,{"$f":"+$B$6","v":"2025-09-23"},{"$f":"+C6","v":"Wandsbek"},{"$f":"+'Hilfstabelle Mannschaften'!E5","v":"Energie Sportvereinigung 2"},{"$f":"+'Spielbogen 10er'!G10","v":"ESV 2"},null,"2. Antritt",{"$f":"+J6","v":"2025-09-23"},null,"2025-09-23",{"$f":"IF($K$6=\"Wandsbek\",\"WB\",\"OT\")","v":"WB"},null,"Frank Nijholt",24774,null,{"$f":"+P5","v":"2025-09-09"},1,null,{"$f":"VLOOKUP(AA5,$AU$4:$AV$14,2,0)","v":"6."},"10.","2.","9.","3.","1.","7.","8.","4.","5.","6.",null,null,null,null,"3. Antritt",null,"3. Antritt",null,null,{"$f":"+Mannschaftsübersicht!D10","v":"Dataport 2"},{"$f":"+Mannschaftsübersicht!C10","v":"3."},{"$f":"+'Spielbogen 10er'!J8","v":"WB"},"Wandsbek",null,{"$f":"+'Offizielle BSV-Rangliste'!F17","v":"Kai Roßberg"},{"$f":"+'Offizielle BSV-Rangliste'!I17","v":179.41666666666666},"4.",{"$f":"+B8","v":"2025-10-21"},"Wandsbek - (WB)",null,null,null,null,null,null,null,{"$f":"+Spielereinteilung!B108","v":"Michael Wetzel"},null,"Meldeschluss","HC = Hamburg Cup",{"$f":"+'Anmeldegruppen Turniere'!$AC$11","v":"2025-09-03"},{"$f":"+'Anmeldegruppen Turniere'!$AB$11","v":"27. / 28. 09. 2025"},null,null,null,null,null,null,null,null,null,null,null,null,null,null,null,null,null,null,"3. Antritt","#='Anhang zum Spielbericht'!Anhang_zum_Spielbericht_3_Antritt"]
["3.",{"$f":"+'Hilfstabelle Mannschaften'!C6","v":"2025-10-07"},"Othmarschen",null,null,"2025-10-07",null,null,3,{"$f":"+$B$7","v":"2025-10-07"},"Othmarschen",{"$f":"+'Hilfstabelle Mannschaften'!E6","v":"AXA 1"},{"$f":"+'Spielbogen 10er'!G11","v":"AXA 1"},null,"3. Antritt","2025-10-07",null,"2025-10-07",{"$f":"IF($K$7=\"Wandsbek\",\"WB\",\"OT\")","v":"OT"},null,"Ilona Wetzel",22115,null,"2025-09-23",2,null,null,null,null,null,null,null,null,null,null,null,null,null,null,null,null,"4. Antritt",null,"4. Antritt",null,null,{"$f":"+Mannschaftsübersicht!D11","v":"HASPA 5"},{"$f":"+Mannschaftsübersicht!C11","v":"4."},{"$f":"+'Spielbogen 10er'!J9","v":"OT"},"Othmarschen",null,{"$f":"+'Offizielle BSV-Rangliste'!F18","v":"Michael Wetzel"},{"$f":"+'Offizielle BSV-Rangliste'!I18","v":176.78571428571428},"5.",{"$f":"+B9","v":"2025-11-04"},"Othmarschen - (OT)",null,null,null,null,null,null,null,{"$f":"+Spielereinteilung!B109","v":"Kai Roßberg"},null,null,null,null,{"$f":"+'Anmeldegruppen Turniere'!$AB$12","v":"11. / 12. 10. 2025"},null,null,null,null,null,null,null,null,null,null,null,null,null,null,null,null,null,null,"4. Antritt","#='Anhang zum Spielbericht'!Anhang_zum_Spielbericht_4_Antritt"]
["4.",{"$f":"+'Hilfstabelle Mannschaften'!C7","v":"2025-10-21"},"Wandsbek",null,null,"2025-10-21",null,null,4,{"$f":"+$B$8","v":"2025-10-21"},"Wandsbek",{"$f":"+'Hilfstabelle Mannschaften'!E7","v":"ERGO Sports 3"},{"$f":"+'Spielbogen 10er'!G12","v":"ERG 3"},null,"4. Antritt","2025-10-21",null,"2025-10-21",{"$f":"IF($K$8=\"Wandsbek\",\"WB\",\"OT\")","v":"WB"},null,"Jörg Frahm",19221,null,"2025-10-07",3,null,"Hilfstabelle Mannschaften: Q3 - AA3",null,null,null,null,null,null,null,null,null,null,null,null,null,null,"5. Antritt",null,"5. Antritt",null,null,{"$f":"+Mannschaftsübersicht!D12","v":"BWVL 5"},{"$f":"+Mannschaftsübersicht!C12","v":"5."},{"$f":"+'Spielbogen 10er'!J10","v":"WB"},"Wandsbek",null,{"$f":"+'Offizielle BSV-Rangliste'!F19","v":"Jörg Frahm"},{"$f":"+'Offizielle BSV-Rangliste'!I19","v":170.96774193548387},"6.",{"$f":"+B10","v":"2025-11-18"},"Wandsbek - (WB)",null,null,null,null,null,null,"2. Antritt",{"$f":"+AX4","v":"Wandsbek"},null,null,null,null,null,null,null,null,null,null,null,null,null,null,null,null,null,null,null,null,null,null,null,"5. Antritt","#='Anhang zum Spielbericht'!Anhang_zum_Spielbericht_5_Antritt"]
["5.",{"$f":"+'Hilfstabelle Mannschaften'!C8","v":"2025-11-04"},"Othmarschen",null,null,"2025-11-04",null,null,5,{"$f":"+$B$9","v":"2025-11-04"},"Othmarschen",{"$f":"+'Hilfstabelle Mannschaften'!E8","v":"Dataport 2"},{"$f":"+'Spielbogen 10er'!G13","v":"DAT 2"},null,"5. Antritt","2025-11-04",null,"2025-11-04",{"$f":"IF($K$9=\"Wandsbek\",\"WB\",\"OT\")","v":"OT"},null,"Kai Roßberg",21889,null,"2025-10-21",4,null,{"$f":"+M5","v":"EAG 1"},{"$f":"+M6","v":"ESV 2"},{"$f":"+M7","v":"AXA 1"},{"$f":"+M8","v":"ERG 3"},{"$f":"+M9","v":"DAT 2"},{"$f":"+M10","v":"PAN 1"},{"$f":"+M11","v":"GEN 3"},{"$f":"+M12","v":"FAH 3"},{"$f":"+M13","v":"HAS 5"},{"$f":"+M14","v":"BWV 5"},{"$f":"+M15","v":"EAG 1"},{"$f":"+M16","v":"ESV 2"},{"$f":"+M17","v":"AXA 1"},{"$f":"+M18","v":"ERG 3"},null,"6. Antritt",null,"6. Antritt",null,null,{"$f":"+Mannschaftsübersicht!D13","v":"Eppendorf AG 1"},{"$f":"+Mannschaftsübersicht!C13","v":"6."},{"$f":"+'Spielbogen 10er'!J11","v":"OT"},"Othmarschen",null,{"$f":"+'Offizielle BSV-Rangliste'!F20","v":"Frank Nijholt"},{"$f":"+'Offizielle BSV-Rangliste'!I20","v":136.73333333333332},"7.",{"$f":"+B11","v":"2026-01-13"},"Othmarschen - (OT)",null,null,null,null,null,null,{"$f":"+BC4","v":"2025-09-23"},{"$f":"+Spielereinteilung!K106","v":"Frank Nijholt"},null,"Meldeschluss","HM = Herbst-Mixed",{"$f":"+'Anmeldegruppen Turniere'!$AC$14","v":"2025-10-22"},{"$f":"+'Anmeldegruppen Turniere'!$AB$14","v":"15. / 16. 11. 2025"},null,null,null,null,null,null,null,null,null,null,null,null,null,null,null,null,null,null,"6. Antritt","#='Anhang zum Spielbericht'!Anhang_zum_Spielbericht_6_Antritt"]
["6.",{"$f":"+'Hilfstabelle Mannschaften'!C9","v":"2025-11-18"},"Wandsbek",null,null,"2025-11-18",null,null,6,{"$f":"+$B$10","v":"2025-11-18"},"Wandsbek",{"$f":"+'Hilfstabelle Mannschaften'!E9","v":"Panasonic 1"},{"$f":"+'Spielbogen 10er'!G14","v":"PAN 1"},null,"6. Antritt","2025-11-18",null,"2025-11-18",{"$f":"IF($K$10=\"Wandsbek\",\"WB\",\"OT\")","v":"WB"},null,"Mario Jurk",23302,null,"2025-11-04",5,null,null,null,null,null,null,null,null,null,null,null,null,null,null,null,null,"7. Antritt",null,"7. Antritt",null,null,{"$f":"+Mannschaftsübersicht!D14","v":"Generali 3"},{"$f":"+Mannschaftsübersicht!C14","v":"7."},{"$f":"+'Spielbogen 10er'!J12","v":"WB"},"Wandsbek",null,{"$f":"+'Offizielle BSV-Rangliste'!F21","v":"Deniz Hagelstein"},{"$f":"+'Offizielle BSV-Rangliste'!I21","v":134.1904761904762},"8.",{"$f":"+B12","v":"2026-01-27"},"Wandsbek - (WB)",null,null,null,null,null,null,null,{"$f":"+Spielereinteilung!K107","v":"Annegret Schmidt"},null,null,null,null,null,null,null,null,null,null,null,null,null,null,null,null,null,null,null,null,null,null,null,"7. Antritt","#='Anhang zum Spielbericht'!Anhang_zum_Spielbericht_7_Antritt"]
["7.",{"$f":"+'Hilfstabelle Mannschaften'!C10","v":"2026-01-13"},"Othmarschen",null,null,"2026-01-13",null,null,7,{"$f":"+$B$11","v":"2026-01-13"},"Othmarschen",{"$f":"+'Hilfstabelle Mannschaften'!E10","v":"Generali 3"},{"$f":"+'Spielbogen 10er'!G15","v":"GEN 3"},null,"7. Antritt","2026-01-13",null,"2026-01-13",{"$f":"IF($K$11=\"Wandsbek\",\"WB\",\"OT\")","v":"OT"},null,"Matthias Nolte",20137,null,"2025-11-18",6,null,null,null,null,null,null,null,null,null,null,null,null,null,null,null,null,"8. Antritt",null,"8. Antritt",null,null,{"$f":"+Mannschaftsübersicht!D15","v":"Finanzamt 3"},{"$f":"+Mannschaftsübersicht!C15","v":"8."},{"$f":"+'Spielbogen 10er'!J13","v":"OT"},"Othmarschen",null,{"$f":"+'Offizielle BSV-Rangliste'!F22","v":"Matthias Nolte"},{"$f":"+'Offizielle BSV-Rangliste'!I22","v":133.33333333333334},"9.",{"$f":"+B13","v":"2026-02-10"},"Othmarschen - (OT)",null,null,null,null,null,null,null,{"$f":"+Spielereinteilung!K108","v":"Jörg Frahm"},null,"Meldeschluss","WB = Weihnachts-Bowling",{"$f":"+'Anmeldegruppen Turniere'!$AC$19","v":"2025-11-19"},{"$f":"+'Anmeldegruppen Turniere'!$AB$19","v":"13. / 14. 12. 2025"},null,null,null,null,null,null,null,null,null,null,null,null,null,null,null,null,null,null,"8. Antritt","#='Anhang zum Spielbericht'!Anhang_zum_Spielbericht_8_Antritt"]
["8.",{"$f":"+'Hilfstabelle Mannschaften'!C11","v":"2026-01-27"},"Wandsbek",null,null,"2026-01-27",null,null,8,{"$f":"+$B$12","v":"2026-01-27"},"Wandsbek",{"$f":"+'Hilfstabelle Mannschaften'!E11","v":"Finanzamt 3"},{"$f":"+'Spielbogen 10er'!G16","v":"FAH 3"},null,"8. Antritt","2026-01-27",null,"2026-01-27",{"$f":"IF($K$12=\"Wandsbek\",\"WB\",\"OT\")","v":"WB"},null,"Michael Wetzel",22113,null,"2026-01-13",7,null,null,null,null,null,null,null,null,null,null,null,null,null,null,null,null,"9. Antritt",null,"9. Antritt",null,null,{"$f":"+Mannschaftsübersicht!D16","v":"ERGO Sports 3"},{"$f":"+Mannschaftsübersicht!C16","v":"9."},{"$f":"+'Spielbogen 10er'!J14","v":"WB"},"Wandsbek",null,null,null,"10.",{"$f":"+B14","v":"2026-02-24"},"Wandsbek - (WB)",null,null,null,null,null,null,null,{"$f":"+Spielereinteilung!K109","v":"Kai Roßberg"},null,null,null,null,null,null,null,null,null,null,null,null,null,null,null,null,null,null,null,null,null,null,null,"9. Antritt","#='Anhang zum Spielbericht'!Anhang_zum_Spielbericht_9_Antritt"]
["9.",{"$f":"+'Hilfstabelle Mannschaften'!C12","v":"2026-02-10"},"Othmarschen",null,null,"2026-02-10",null,null,9,{"$f":"+$B$13","v":"2026-02-10"},"Othmarschen",{"$f":"+'Hilfstabelle Mannschaften'!E12","v":"HASPA 5"},{"$f":"+'Spielbogen 10er'!G17","v":"HAS 5"},null,"9. Antritt","2026-02-10",null,"2026-02-10",{"$f":"IF($K$13=\"Wandsbek\",\"WB\",\"OT\")","v":"OT"},null,null,null,null,"2026-01-27",8,null,null,null,null,null,null,null,null,null,null,null,null,null,null,null,null,"10. Antritt",null,"10. Antritt",null,null,{"$f":"+Mannschaftsübersicht!D17","v":"Energie Sportvereinigung 2"},{"$f":"+Mannschaftsübersicht!C17","v":"10."},{"$f":"+'Spielbogen 10er'!J15","v":"OT"},"Othmarschen",null,null,null,"11.",{"$f":"+B15","v":"2026-03-10"},"Othmarschen - (OT)",null,null,null,null,null,null,"3. Antritt",{"$f":"+AX5","v":"Othmarschen"},null,"Meldeschluss","EM = Einzelmeisterschaft",{"$f":"+'Anmeldegruppen Turniere'!$AC$22","v":" 24. Dezember 2025"},{"$f":"+'Anmeldegruppen Turniere'!$AB$22","v":"17. / 18. 01. 2026"},null,null,null,null,null,null,null,null,null,null,null,null,null,null,null,null,null,null,"10. Antritt","#='Anhang zum Spielbericht'!Anhang_zum_Spielbericht_10_Antritt"]
["10.",{"$f":"+'Hilfstabelle Mannschaften'!C13","v":"2026-02-24"},"Wandsbek",null,null,"2026-02-24",null,null,10,{"$f":"+$B$14","v":"2026-02-24"},"Wandsbek",{"$f":"+'Hilfstabelle Mannschaften'!E13","v":"BWVL 5"},{"$f":"+'Spielbogen 10er'!G18","v":"BWV 5"},null,"10. Antritt","2026-02-24",null,"2026-02-24",{"$f":"IF($K$14=\"Wandsbek\",\"WB\",\"OT\")","v":"WB"},null,null,null,null,"2026-02-10",9,null,null,null,null,null,null,null,null,null,null,null,null,null,null,null,null,"11. Antritt",null,"11. Antritt",null,null,{"$f":"+Mannschaftsübersicht!D18","v":"Eppendorf AG 1"},{"$f":"+Mannschaftsübersicht!C18","v":"11."},{"$f":"+'Spielbogen 10er'!J16","v":"WB"},"Wandsbek",null,null,null,"12.",{"$f":"+B16","v":"2026-03-24"},"Wandsbek - (WB)",null,null,null,null,null,null,{"$f":"+BC5","v":"2025-10-07"},{"$f":"+Spielereinteilung!T106","v":"Matthias Nolte"},null,null,null,null,null,null,null,null,null,null,null,null,null,null,null,null,null,null,null,null,null,null,null,"11. Antritt","#='Anhang zum Spielbericht'!Anhang_zum_Spielbericht_11_Antritt"]
["11.",{"$f":"+'Hilfstabelle Mannschaften'!C14","v":"2026-03-10"},"Othmarschen",null,null,"2026-03-10",null,null,11,{"$f":"+$B$15","v":"2026-03-10"},"Othmarschen",{"$f":"+'Hilfstabelle Mannschaften'!E14","v":"Eppendorf AG 1"},{"$f":"+M5","v":"EAG 1"},null,"11. Antritt","2026-03-10",null,"2026-03-10",{"$f":"IF($K$15=\"Wandsbek\",\"WB\",\"OT\")","v":"OT"},null,null,null,null,"2026-02-24",10,null,null,null,null,null,null,null,null,null,null,null,null,null,null,null,null,"12. Antritt",null,"12. Antritt",null,null,null,null,{"$f":"+'Spielbogen 10er'!J17","v":"OT"},"Othmarschen",null,null,null,"13.",{"$f":"+B17","v":"2026-04-07"},"Othmarschen - (OT)",null,null,null,null,null,null,null,{"$f":"+Spielereinteilung!T107","v":"Ilona Wetzel"},null,"Meldeschluss","FM = Frühjahrs-Mixed",{"$f":"+'Anmeldegruppen Turniere'!$AC$25","v":"2026-02-25"},{"$f":"+'Anmeldegruppen Turniere'!$AB$25","v":"21. / 22. 03. 2026"},null,null,null,null,null,null,null,null,null,null,null,null,null,null,null,null,null,null,"12. Antritt","#='Anhang zum Spielbericht'!Anhang_zum_Spielbericht_12_Antritt"]
["12.",{"$f":"+'Hilfstabelle Mannschaften'!C15","v":"2026-03-24"},"Wandsbek",null,null,"2026-03-24",null,null,12,{"$f":"+$B$16","v":"2026-03-24"},"Wandsbek",{"$f":"+'Hilfstabelle Mannschaften'!E15","v":"Energie Sportvereinigung 2"},{"$f":"+M6","v":"ESV 2"},null,"12. Antritt","2026-03-24",null,"2026-03-24",{"$f":"IF($K$16=\"Wandsbek\",\"WB\",\"OT\")","v":"WB"},null,null,null,null,"2026-03-10",11,null,null,null,null,null,null,null,null,null,null,null,null,null,null,null,null,"13. Antritt",null,"13. Antritt",null,null,null,null,{"$f":"+'Spielbogen 10er'!J18","v":"WB"},"Wandsbek",null,null,null,"14.",{"$f":"+B18","v":"2026-04-21"},"Wandsbek - (WB)",null,null,null,null,null,null,null,{"$f":"+Spielereinteilung!T108","v":"Annegret Schmidt"},null,null,null,null,null,null,null,null,null,null,null,null,null,null,null,null,null,null,null,null,null,null,null,"13. Antritt","#='Anhang zum Spielbericht'!Anhang_zum_Spielbericht_13_Antritt"]
["13.",{"$f":"+'Hilfstabelle Mannschaften'!C16","v":"2026-04-07"},"Othmarschen",null,null,"2026-04-07",null,null,13,{"$f":"+$B$17","v":"2026-04-07"},"Othmarschen",{"$f":"+'Hilfstabelle Mannschaften'!E16","v":"AXA 1"},"AXA 1",null,"13. Antritt","2026-04-07",null,"2026-04-07",{"$f":"IF($K$17=\"Wandsbek\",\"WB\",\"OT\")","v":"OT"},null,null,null,null,"2026-03-24",12,null,null,null,null,null,null,null,null,null,null,null,null,null,null,null,null,"14. Antritt",null,"14. Antritt",null,null,null,null,null,null,null,null,null,null,null,null,null,null,null,null,null,null,null,{"$f":"+Spielereinteilung!T109","v":"Kai Roßberg"},null,"Meldeschluss","DM = Doppelmeisterschaft",{"$f":"+'Anmeldegruppen Turniere'!$AC$30","v":"2026-04-01"},{"$f":"+'Anmeldegruppen Turniere'!$AB$30","v":"25. / 26. 04. 2026"},null,null,null,null,null,null,null,null,null,null,null,null,null,null,null,null,null,null,"14. Antritt","#='Anhang zum Spielbericht'!Anhang_zum_Spielbericht_14_Antritt"]
["14.",{"$f":"+'Hilfstabelle Mannschaften'!C17","v":"2026-04-21"},"Wandsbek",null,null,"2026-04-21",null,null,14,{"$f":"+$B$18","v":"2026-04-21"},"Wandsbek",{"$f":"+'Hilfstabelle Mannschaften'!E17","v":"ERGO Sports 3"},"ERG 3",null,"14. Antritt","2026-04-21",null,"2026-04-21",{"$f":"IF($K$18=\"Wandsbek\",\"WB\",\"OT\")","v":"WB"},null,null,null,null,"2026-04-07",13,null,null,null,null,null,null,null,null,null,null,null,null,null,null,null,null,null,null,null,null,null,null,null,null,null,null,null,null,null,null,null,null,null,null,null,null,null,"4. Antritt",{"$f":"+AX6","v":"Wandsbek"},null,null,null,null,{"$f":"+'Anmeldegruppen Turniere'!$AB$31","v":"09. / 10. 05. 2026"}]
[null,null,null,null,null,null,null,null,null,null,null,null,null,null,null,null,null,null,null,null,null,null,null,"2026-04-21",14,null,null,null,null,null,null,null,null,null,null,null,null,null,null,null,null,null,null,null,null,null,null,null,null,null,null,null,null,null,null,null,null,null,null,null,null,null,{"$f":"+BC6","v":"2025-10-21"},{"$f":"+Spielereinteilung!AC106","v":"Frank Nijholt"}]
[null,null,null,null,null,null,null,null,null,null,null,null,null,null,null,null,null,null,null,null,null,null,null,null,null,null,null,null,null,null,null,null,null,null,null,null,null,null,null,null,null,null,null,null,null,null,null,null,null,null,null,null,null,null,null,null,null,null,null,null,null,null,null,{"$f":"+Spielereinteilung!AC107","v":"Deniz Hagelstein"}]
[null,null,null,null,null,null,null,null,null,null,null,null,null,null,null,null,null,null,null,null,null,null,null,null,null,null,null,null,null,null,null,null,null,null,null,null,null,null,null,null,null,null,null,null,null,null,null,null,null,null,null,null,null,null,null,null,null,null,null,null,null,null,null,{"$f":"+Spielereinteilung!AC108","v":"Michael Wetzel"}]
[null,null,null,null,null,null,null,null,null,null,null,null,null,null,null,null,null,null,null,null,null,null,null,null,null,null,null,null,null,null,null,null,null,null,null,null,null,null,null,null,null,null,null,null,null,null,null,null,null,null,null,null,null,null,null,null,null,null,null,null,null,null,null,{"$f":"+Spielereinteilung!AC109","v":"Mario Jurk"}]
[null,null,null,null,null,null,null,null,null,null,null,null,null,null,null,null,null,null,null,null,null,null,null,null,null,null,null,null,null,null,null,null,null,null,null,null,null,null,null,null,null,null,null,null,null,null,null,null,null,null,null,null,null,null,null,null,null,null,null,null,null,null,"5. Antritt",{"$f":"+AX7","v":"Othmarschen"}]
[null,null,null,null,null,null,null,null,null,null,null,null,null,null,null,null,null,null,null,null,null,null,null,null,null,null,null,null,null,null,null,null,null,null,null,null,null,null,null,null,null,null,null,null,null,null,null,null,null,null,null,null,null,null,null,null,null,null,null,null,null,null,{"$f":"+BC7","v":"2025-11-04"},{"$f":"+Spielereinteilung!AL106","v":"Matthias Nolte"}]
[null,null,null,null,null,null,null,null,null,null,null,null,null,null,null,null,null,null,null,null,null,null,null,null,null,null,null,null,null,null,null,null,null,null,null,null,null,null,null,null,null,null,null,null,null,null,null,null,null,null,null,null,null,null,null,null,null,null,null,null,null,null,null,{"$f":"+Spielereinteilung!AL107","v":"Deniz Hagelstein"}]
[null,null,null,null,null,null,null,null,null,null,null,null,null,null,null,null,null,null,null,null,null,null,null,null,null,null,null,null,null,null,null,null,null,null,null,null,null,null,null,null,null,null,null,null,null,null,null,null,null,null,null,null,null,null,null,null,null,null,null,null,null,null,null,{"$f":"+Spielereinteilung!AL108","v":"Ilona Wetzel"}]
[null,null,null,null,null,null,null,null,null,null,null,null,null,null,null,null,null,null,null,null,null,null,null,null,null,null,null,null,null,null,null,null,null,null,null,null,null,null,null,null,null,null,null,null,null,null,null,null,null,null,null,null,null,null,null,null,null,null,null,null,null,null,null,{"$f":"+Spielereinteilung!AL109","v":"Kai Roßberg"}]
[null,null,null,null,null,null,null,null,null,null,null,null,null,null,null,null,null,null,null,null,null,null,null,null,null,null,null,null,null,null,null,null,null,null,null,null,null,null,null,null,null,null,null,null,null,null,null,null,null,null,null,null,null,null,null,null,null,null,null,null,null,null,"6. Antritt",{"$f":"+AX8","v":"Wandsbek"}]
[null,null,null,null,null,null,null,null,null,null,null,null,null,null,null,null,null,null,null,null,null,null,null,null,null,null,null,null,null,null,null,null,null,null,null,null,null,null,null,null,null,null,null,null,null,null,null,null,null,null,null,null,null,null,null,null,null,null,null,null,null,null,{"$f":"+BC8","v":"2025-11-18"},{"$f":"+Spielereinteilung!B115","v":"Frank Nijholt"}]
[null,null,null,null,null,null,null,null,null,null,null,null,null,null,null,null,null,null,null,null,null,null,null,null,null,null,null,null,null,null,null,null,null,null,null,null,null,null,null,null,null,null,null,null,null,null,null,null,null,null,null,null,null,null,null,null,null,null,null,null,null,null,null,{"$f":"+Spielereinteilung!B116","v":"Ilona Wetzel"}]
[null,null,null,null,null,null,null,null,null,null,null,null,null,null,null,null,null,null,null,null,null,null,null,null,null,null,null,null,null,null,null,null,null,null,null,null,null,null,null,null,null,null,null,null,null,null,null,null,null,null,null,null,null,null,null,null,null,null,null,null,null,null,null,{"$f":"+Spielereinteilung!B117","v":"Michael Wetzel"}]
[null,null,null,null,null,null,null,null,null,null,null,null,null,null,null,null,null,null,null,null,null,null,null,null,null,null,null,null,null,null,null,null,null,null,null,null,null,null,null,null,null,null,null,null,null,null,null,null,null,null,null,null,null,null,null,null,null,null,null,null,null,null,null,{"$f":"+Spielereinteilung!B118","v":"Mario Jurk"}]
[null,null,null,null,null,null,null,null,null,null,null,null,null,null,null,null,null,null,null,null,null,null,null,null,null,null,null,null,null,null,null,null,null,null,null,null,null,null,null,null,null,null,null,null,null,null,null,null,null,null,null,null,null,null,null,null,null,null,null,null,null,null,"7. Antritt",{"$f":"+AX9","v":"Othmarschen"}]
[null,null,null,null,null,null,null,null,null,null,null,null,null,null,null,null,null,null,null,null,null,null,null,null,null,null,null,null,null,null,null,null,null,null,null,null,null,null,null,null,null,null,null,null,null,null,null,null,null,null,null,null,null,null,null,null,null,null,null,null,null,null,{"$f":"+BC9","v":"2026-01-13"},{"$f":"+Spielereinteilung!K115","v":"Matthias Nolte"}]
[null,null,null,null,null,null,null,null,null,null,null,null,null,null,null,null,null,null,null,null,null,null,null,null,null,null,null,null,null,null,null,null,null,null,null,null,null,null,null,null,null,null,null,null,null,null,null,null,null,null,null,null,null,null,null,null,null,null,null,null,null,null,null,{"$f":"+Spielereinteilung!K116","v":"Frank Nijholt"}]
[null,null,null,null,null,null,null,null,null,null,null,null,null,null,null,null,null,null,null,null,null,null,null,null,null,null,null,null,null,null,null,null,null,null,null,null,null,null,null,null,null,null,null,null,null,null,null,null,null,null,null,null,null,null,null,null,null,null,null,null,null,null,null,{"$f":"+Spielereinteilung!K117","v":"Annegret Schmidt"}]
[null,null,null,null,null,null,null,null,null,null,null,null,null,null,null,null,null,null,null,null,null,null,null,null,null,null,null,null,null,null,null,null,null,null,null,null,null,null,null,null,null,null,null,null,null,null,null,null,null,null,null,null,null,null,null,null,null,null,null,null,null,null,null,{"$f":"+Spielereinteilung!K118","v":"Mario Jurk"}]
[null,null,null,null,null,null,null,null,null,null,null,null,null,null,null,null,null,null,null,null,null,null,null,null,null,null,null,null,null,null,null,null,null,null,null,null,null,null,null,null,null,null,null,null,null,null,null,null,null,null,null,null,null,null,null,null,null,null,null,null,null,null,"8. Antritt",{"$f":"+AX10","v":"Wandsbek"}]
[null,null,null,null,null,null,null,null,null,null,null,null,null,null,null,null,null,null,null,null,null,null,null,null,null,null,null,null,null,null,null,null,null,null,null,null,null,null,null,null,null,null,null,null,null,null,null,null,null,null,null,null,null,null,null,null,null,null,null,null,null,null,{"$f":"+BC10","v":"2026-01-27"},{"$f":"+Spielereinteilung!T115","v":"Ilona Wetzel"}]
[null,null,null,null,null,null,null,null,null,null,null,null,null,null,null,null,null,null,null,null,null,null,null,null,null,null,null,null,null,null,null,null,null,null,null,null,null,null,null,null,null,null,null,null,null,null,null,null,null,null,null,null,null,null,null,null,null,null,null,null,null,null,null,{"$f":"+Spielereinteilung!T116","v":"Jörg Frahm"}]
[null,null,null,null,null,null,null,null,null,null,null,null,null,null,null,null,null,null,null,null,null,null,null,null,null,null,null,null,null,null,null,null,null,null,null,null,null,null,null,null,null,null,null,null,null,null,null,null,null,null,null,null,null,null,null,null,null,null,null,null,null,null,null,{"$f":"+Spielereinteilung!T117","v":"Kai Roßberg"}]
[null,null,null,null,null,null,null,null,null,null,null,null,null,null,null,null,null,null,null,null,null,null,null,null,null,null,null,null,null,null,null,null,null,null,null,null,null,null,null,null,null,null,null,null,null,null,null,null,null,null,null,null,null,null,null,null,null,null,null,null,null,null,null,{"$f":"+Spielereinteilung!T118","v":"Mario Jurk"}]
[null,null,null,null,null,null,null,null,null,null,null,null,null,null,null,null,null,null,null,null,null,null,null,null,null,null,null,null,null,null,null,null,null,null,null,null,null,null,null,null,null,null,null,null,null,null,null,null,null,null,null,null,null,null,null,null,null,null,null,null,null,null,"9. Antritt",{"$f":"+AX11","v":"Othmarschen"}]
[null,null,null,null,null,null,null,null,null,null,null,null,null,null,null,null,null,null,null,null,null,null,null,null,null,null,null,null,null,null,null,null,null,null,null,null,null,null,null,null,null,null,null,null,null,null,null,null,null,null,null,null,null,null,null,null,null,null,null,null,null,null,{"$f":"+BC11","v":"2026-02-10"},{"$f":"+Spielereinteilung!AC115","v":"Annegret Schmidt"}]
[null,null,null,null,null,null,null,null,null,null,null,null,null,null,null,null,null,null,null,null,null,null,null,null,null,null,null,null,null,null,null,null,null,null,null,null,null,null,null,null,null,null,null,null,null,null,null,null,null,null,null,null,null,null,null,null,null,null,null,null,null,null,null,{"$f":"+Spielereinteilung!AC116","v":"Ilona Wetzel"}]
[null,null,null,null,null,null,null,null,null,null,null,null,null,null,null,null,null,null,null,null,null,null,null,null,null,null,null,null,null,null,null,null,null,null,null,null,null,null,null,null,null,null,null,null,null,null,null,null,null,null,null,null,null,null,null,null,null,null,null,null,null,null,null,{"$f":"+Spielereinteilung!AC117","v":"Jörg Frahm"}]
[null,null,null,null,null,null,null,null,null,null,null,null,null,null,null,null,null,null,null,null,null,null,null,null,null,null,null,null,null,null,null,null,null,null,null,null,null,null,null,null,null,null,null,null,null,null,null,null,null,null,null,null,null,null,null,null,null,null,null,null,null,null,null,{"$f":"+Spielereinteilung!AC118","v":"Michael Wetzel"}]
[null,null,null,null,null,null,null,null,null,null,null,null,null,null,null,null,null,null,null,null,null,null,null,null,null,null,null,null,null,null,null,null,null,null,null,null,null,null,null,null,null,null,null,null,null,null,null,null,null,null,null,null,null,null,null,null,null,null,null,null,null,null,"10. Antritt",{"$f":"+AX12","v":"Wandsbek"}]
[null,null,null,null,null,null,null,null,null,null,null,null,null,null,null,null,null,null,null,null,null,null,null,null,null,null,null,null,null,null,null,null,null,null,null,null,null,null,null,null,null,null,null,null,null,null,null,null,null,null,null,null,null,null,null,null,null,null,null,null,null,null,{"$f":"+BC12","v":"2026-02-24"},{"$f":"+Spielereinteilung!AL115","v":"Frank Nijholt"}]
[null,null,null,null,null,null,null,null,null,null,null,null,null,null,null,null,null,null,null,null,null,null,null,null,null,null,null,null,null,null,null,null,null,null,null,null,null,null,null,null,null,null,null,null,null,null,null,null,null,null,null,null,null,null,null,null,null,null,null,null,null,null,null,{"$f":"+Spielereinteilung!AL116","v":"Annegret Schmidt"}]
[null,null,null,null,null,null,null,null,null,null,null,null,null,null,null,null,null,null,null,null,null,null,null,null,null,null,null,null,null,null,null,null,null,null,null,null,null,null,null,null,null,null,null,null,null,null,null,null,null,null,null,null,null,null,null,null,null,null,null,null,null,null,null,{"$f":"+Spielereinteilung!AL117","v":"Deniz Hagelstein"}]
[null,null,null,null,null,null,null,null,null,null,null,null,null,null,null,null,null,null,null,null,null,null,null,null,null,null,null,null,null,null,null,null,null,null,null,null,null,null,null,null,null,null,null,null,null,null,null,null,null,null,null,null,null,null,null,null,null,null,null,null,null,null,null,{"$f":"+Spielereinteilung!AL118","v":"Michael Wetzel"}]
[null,null,null,null,null,null,null,null,null,null,null,null,null,null,null,null,null,null,null,null,null,null,null,null,null,null,null,null,null,null,null,null,null,null,null,null,null,null,null,null,null,null,null,null,null,null,null,null,null,null,null,null,null,null,null,null,null,null,null,null,null,null,"11. Antritt-",{"$f":"+AX13","v":"Othmarschen"}]
[null,null,null,null,null,null,null,null,null,null,null,null,null,null,null,null,null,null,null,null,null,null,null,null,null,null,null,null,null,null,null,null,null,null,null,null,null,null,null,null,null,null,null,null,null,null,null,null,null,null,null,null,null,null,null,null,null,null,null,null,null,null,{"$f":"+BC13","v":"2026-03-10"},{"$f":"+Spielereinteilung!B124","v":"Matthias Nolte"}]
[null,null,null,null,null,null,null,null,null,null,null,null,null,null,null,null,null,null,null,null,null,null,null,null,null,null,null,null,null,null,null,null,null,null,null,null,null,null,null,null,null,null,null,null,null,null,null,null,null,null,null,null,null,null,null,null,null,null,null,null,null,null,null,{"$f":"+Spielereinteilung!B125","v":"Deniz Hagelstein"}]
[null,null,null,null,null,null,null,null,null,null,null,null,null,null,null,null,null,null,null,null,null,null,null,null,null,null,null,null,null,null,null,null,null,null,null,null,null,null,null,null,null,null,null,null,null,null,null,null,null,null,null,null,null,null,null,null,null,null,null,null,null,null,null,{"$f":"+Spielereinteilung!B126","v":"Frank Nijholt"}]
[null,null,null,null,null,null,null,null,null,null,null,null,null,null,null,null,null,null,null,null,null,null,null,null,null,null,null,null,null,null,null,null,null,null,null,null,null,null,null,null,null,null,null,null,null,null,null,null,null,null,null,null,null,null,null,null,null,null,null,null,null,null,null,{"$f":"+Spielereinteilung!B127","v":"Mario Jurk"}]
[null,null,null,null,null,null,null,null,null,null,null,null,null,null,null,null,null,null,null,null,null,null,null,null,null,null,null,null,null,null,null,null,null,null,null,null,null,null,null,null,null,null,null,null,null,null,null,null,null,null,null,null,null,null,null,null,null,null,null,null,null,null,"12. Antritt-",{"$f":"+AX14","v":"Wandsbek"}]
[null,null,null,null,null,null,null,null,null,null,null,null,null,null,null,null,null,null,null,null,null,null,null,null,null,null,null,null,null,null,null,null,null,null,null,null,null,null,null,null,null,null,null,null,null,null,null,null,null,null,null,null,null,null,null,null,null,null,null,null,null,null,{"$f":"+BC14","v":"2026-03-24"},{"$f":"+Spielereinteilung!K124","v":"Deniz Hagelstein"}]
[null,null,null,null,null,null,null,null,null,null,null,null,null,null,null,null,null,null,null,null,null,null,null,null,null,null,null,null,null,null,null,null,null,null,null,null,null,null,null,null,null,null,null,null,null,null,null,null,null,null,null,null,null,null,null,null,null,null,null,null,null,null,null,{"$f":"+Spielereinteilung!K125","v":"Annegret Schmidt"}]
[null,null,null,null,null,null,null,null,null,null,null,null,null,null,null,null,null,null,null,null,null,null,null,null,null,null,null,null,null,null,null,null,null,null,null,null,null,null,null,null,null,null,null,null,null,null,null,null,null,null,null,null,null,null,null,null,null,null,null,null,null,null,null,{"$f":"+Spielereinteilung!K126","v":"Kai Roßberg"}]
[null,null,null,null,null,null,null,null,null,null,null,null,null,null,null,null,null,null,null,null,null,null,null,null,null,null,null,null,null,null,null,null,null,null,null,null,null,null,null,null,null,null,null,null,null,null,null,null,null,null,null,null,null,null,null,null,null,null,null,null,null,null,null,{"$f":"+Spielereinteilung!K127","v":"Mario Jurk"}]
[null,null,null,null,null,null,null,null,null,null,null,null,null,null,null,null,null,null,null,null,null,null,null,null,null,null,null,null,null,null,null,null,null,null,null,null,null,null,null,null,null,null,null,null,null,null,null,null,null,null,null,null,null,null,null,null,null,null,null,null,null,null,"13. Antritt-",{"$f":"+AX15","v":"Othmarschen"}]
[null,null,null,null,null,null,null,null,null,null,null,null,null,null,null,null,null,null,null,null,null,null,null,null,null,null,null,null,null,null,null,null,null,null,null,null,null,null,null,null,null,null,null,null,null,null,null,null,null,null,null,null,null,null,null,null,null,null,null,null,null,null,{"$f":"+BC15","v":"2026-04-07"},{"$f":"+Spielereinteilung!T124","v":"Matthias Nolte"}]
[null,null,null,null,null,null,null,null,null,null,null,null,null,null,null,null,null,null,null,null,null,null,null,null,null,null,null,null,null,null,null,null,null,null,null,null,null,null,null,null,null,null,null,null,null,null,null,null,null,null,null,null,null,null,null,null,null,null,null,null,null,null,null,{"$f":"+Spielereinteilung!T125","v":"Jörg Frahm"}]
[null,null,null,null,null,null,null,null,null,null,null,null,null,null,null,null,null,null,null,null,null,null,null,null,null,null,null,null,null,null,null,null,null,null,null,null,null,null,null,null,null,null,null,null,null,null,null,null,null,null,null,null,null,null,null,null,null,null,null,null,null,null,null,{"$f":"+Spielereinteilung!T126","v":"Michael Wetzel"}]
[null,null,null,null,null,null,null,null,null,null,null,null,null,null,null,null,null,null,null,null,null,null,null,null,null,null,null,null,null,null,null,null,null,null,null,null,null,null,null,null,null,null,null,null,null,null,null,null,null,null,null,null,null,null,null,null,null,null,null,null,null,null,null,{"$f":"+Spielereinteilung!T127","v":"Mario Jurk"}]
[null,null,null,null,null,null,null,null,null,null,null,null,null,null,null,null,null,null,null,null,null,null,null,null,null,null,null,null,null,null,null,null,null,null,null,null,null,null,null,null,null,null,null,null,null,null,null,null,null,null,null,null,null,null,null,null,null,null,null,null,null,null,"14. Antritt-",{"$f":"+AX16","v":"Wandsbek"}]
[null,null,null,null,null,null,null,null,null,null,null,null,null,null,null,null,null,null,null,null,null,null,null,null,null,null,null,null,null,null,null,null,null,null,null,null,null,null,null,null,null,null,null,null,null,null,null,null,null,null,null,null,null,null,null,null,null,null,null,null,null,null,{"$f":"+BC16","v":"2026-04-21"},{"$f":"+Spielereinteilung!AC124","v":"Deniz Hagelstein"}]
[null,null,null,null,null,null,null,null,null,null,null,null,null,null,null,null,null,null,null,null,null,null,null,null,null,null,null,null,null,null,null,null,null,null,null,null,null,null,null,null,null,null,null,null,null,null,null,null,null,null,null,null,null,null,null,null,null,null,null,null,null,null,null,{"$f":"+Spielereinteilung!AC125","v":"Ilona Wetzel"}]
[null,null,null,null,null,null,null,null,null,null,null,null,null,null,null,null,null,null,null,null,null,null,null,null,null,null,null,null,null,null,null,null,null,null,null,null,null,null,null,null,null,null,null,null,null,null,null,null,null,null,null,null,null,null,null,null,null,null,null,null,null,null,null,{"$f":"+Spielereinteilung!AC126","v":"Jörg Frahm"}]
[null,null,null,null,null,null,null,null,null,null,null,null,null,null,null,null,null,null,null,null,null,null,null,null,null,null,null,null,null,null,null,null,null,null,null,null,null,null,null,null,null,null,null,null,null,null,null,null,null,null,null,null,null,null,null,null,null,null,null,null,null,null,null,{"$f":"+Spielereinteilung!AC127","v":"Michael Wetzel"}]

{"sheet":"Anhang zum Spielbericht","index":20,"n_rows":323,"n_cols":209,"rows_kept":323,"cut":false,"hidden":false,"merged":[[320,4,320,5],[113,4,113,5],[136,4,136,5],[159,4,159,5],[182,4,182,5],[205,4,205,5],[228,4,228,5],[251,4,251,5],[274,4,274,5],[297,4,297,5],[315,4,315,5],[316,4,316,5],[317,4,317,5],[318,4,318,5],[225,4,225,5],[226,4,226,5],[223,4,223,5],[196,4,196,5],[311,4,311,5],[155,4,155,5],[248,4,248,5],[292,4,292,5],[293,4,293,5],[242,4,242,5],[0,208,0,209],[1,208,1,209],[319,4,319,5],[308,4,310,5],[312,4,312,5],[313,4,313,5],[314,4,314,5],[0,192,0,193],[1,192,1,193],[294,4,294,5],[295,4,295,5],[0,176,0,177],[1,176,1,177],[296,4,296,5],[285,4,287,5],[245,4,245,5],[246,4,246,5],[266,4,266,5],[224,4,224,5],[221,4,221,5],[0,160,0,161],[1,160,1,161],[216,4,218,5],[154,4,154,5],[90,4,90,5],[239,4,241,5],[243,4,243,5],[244,4,244,5],[222,4,222,5],[219,4,219,5],[170,4,172,5],[0,144,0,145],[1,144,1,145],[0,128,0,129],[1,128,1,129],[202,4,202,5],[203,4,203,5],[0,112,0,113],[1,112,1,113],[227,4,227,5],[220,4,220,5],[127,4,127,5],[0,96,0,97],[1,96,1,97],[156,4,156,5],[157,4,157,5],[0,80,0,81],[1,80,1,81],[0,64,0,65],[1,64,1,65],[60,4,60,5],[61,4,61,5],[62,4,62,5],[158,4,158,5],[101,4,103,5],[34,4,34,5],[37,4,37,5],[40,4,40,5],[105,4,105,5],[88,4,88,5],[78,4,80,5],[82,4,82,5],[83,4,83,5],[84,4,84,5],[85,4,85,5],[43,4,43,5],[54,4,56,5],[89,4,89,5],[65,4,65,5],[64,4,64,5],[58,4,58,5],[57,4,57,5],[81,4,81,5],[59,4,59,5],[66,4,66,5],[86,4,86,5],[87,4,87,5],[63,4,63,5],[0,0,0,1],[1,0,1,1],[11,4,13,5],[41,4,41,5],[42,4,42,5],[31,4,33,5],[35,4,35,5],[36,4,36,5],[14,4,14,5],[15,4,15,5],[16,4,16,5],[17,4,17,5],[18,4,18,5],[19,4,19,5],[38,4,38,5],[39,4,39,5],[289,4,289,5],[290,4,290,5],[291,4,291,5],[273,4,273,5],[262,4,264,5],[269,4,269,5],[270,4,270,5],[247,4,247,5],[288,4,288,5],[267,4,267,5],[271,4,271,5],[272,4,272,5],[265,4,265,5],[268,4,268,5],[249,4,249,5],[250,4,250,5],[124,4,126,5],[128,4,128,5],[204,4,204,5],[176,4,176,5],[193,4,195,5],[197,4,197,5],[198,4,198,5],[199,4,199,5],[200,4,200,5],[201,4,201,5],[181,4,181,5],[179,4,179,5],[180,4,180,5],[177,4,177,5],[178,4,178,5],[175,4,175,5],[153,4,153,5],[311,0,311,1],[131,4,131,5],[104,4,104,5],[134,4,134,5],[152,4,152,5],[150,4,150,5],[147,4,149,5],[151,4,151,5],[111,4,111,5],[174,4,174,5],[129,4,129,5],[130,4,130,5],[110,4,110,5],[112,4,112,5],[132,4,132,5],[133,4,133,5],[106,4,106,5],[107,4,107,5],[108,4,108,5],[109,4,109,5],[173,4,173,5],[135,4,135,5]]}
["Start",null,null,null,null,null,null,null,null,null,null,null,null,null,null,null,null,null,null,null,null,null,null,null,null,null,null,null,null,null,null,null,null,null,null,null,null,null,null,null,null,null,null,null,null,null,null,null,null,null,null,null,null,null,null,null,null,null,null,null,null,null,null,null,null,null,null,null,null,null,null,null,null,null,null,null,null,null,null,null,null,null,null,null,null,null,null,null,null,null,null,null,null,null,null,null,null,null,null,null,null,null,null,null,null,null,null,null,null,null,null,null,null,null,null,null,null,null,null,null,null,null,null,null,null,null,null,null,null,null,null,null,null,null,null,null,null,null,null,null,null,null,null,null,"Start",null,null,null,null,null,null,null,null,null,null,null,null,null,null,null,"Start",null,null,null,null,null,null,null,null,null,null,null,null,null,null,null,"Start",null,null,null,null,null,null,null,null,null,null,null,null,null,null,null,"Start",null,null,null,null,null,null,null,null,null,null,null,null,null,null,null,"Start"]
["Rangliste",null,null,null,null,null,null,null,null,null,null,null,null,null,null,null,null,null,null,null,null,null,null,null,null,null,null,null,null,null,null,null,null,null,null,null,null,null,null,null,null,null,null,null,null,null,null,null,null,null,null,null,null,null,null,null,null,null,null,null,null,null,null,null,null,null,null,null,null,null,null,null,null,null,null,null,null,null,null,null,null,null,null,null,null,null,null,null,null,null,null,null,null,null,null,null,null,null,null,null,null,null,null,null,null,null,null,null,null,null,null,null,null,null,null,null,null,null,null,null,null,null,null,null,null,null,null,null,null,null,null,null,null,null,null,null,null,null,null,null,null,null,null,null,"Rangliste",null,null,null,null,null,null,null,null,null,null,null,null,null,null,null,"Rangliste",null,null,null,null,null,null,null,null,null,null,null,null,null,null,null,"Rangliste",null,null,null,null,null,null,null,null,null,null,null,null,null,null,null,"Rangliste",null,null,null,null,null,null,null,null,null,null,null,null,null,null,null,"Rangliste"]
[]
[null,null,null,null,"Anhang zum Spielbericht  B O W L I N G"]
[null,null,null,null,null,null,null,null,null,null,null,null,null,null,null,null,"Punktspielserie"]
[null,null,null,null,"alle Felder sind unbedingt auszufüllen und mit dem Original-Spielbericht einzusenden."]
[]
[null,null,null,null,null,null,"Klasse:",{"$f":"+Hilfstabelle!$G$5","v":"B2"},null,"Antritt-Nr. :",1,"Datum :",{"$f":"VLOOKUP(K8,Hilfstabelle!$I$5:$J$18,2,0)","v":"2025-09-09"},"Halle :",{"$f":"VLOOKUP(K8,Hilfstabelle!$I$5:$L$18,3,0)","v":"Othmarschen"}]
[]
[null,null,null,null,null,null,"Ausrichter BSG:",null,{"$f":"+VLOOKUP(K8,Hilfstabelle!$I$5:$L$18,4,0)&\"\"","v":"Eppendorf AG 1"},null,null,"Mannschaftsführer: Michael Wetzel      -     Telefon: 0172/412 45 69"]
[null,null,null,null,null,null,"Bahn:","Bahn:","Bahn:","Bahn:","Bahn:","Bahn:","Bahn:","Bahn:","Bahn:","Bahn:","Bahn:"]
[null,null,null,null,"Durch-\ngänge",null,"BSG","BSG","BSG","BSG","BSG","BSG","BSG","BSG","BSG","BSG","BSG"]
[null,null,null,null,null,null,{"$f":"VLOOKUP(G14,Hilfstabelle!$L$5:$M$16,2,0)","v":"EAG 1"},{"$f":"VLOOKUP(H14,Hilfstabelle!$L$5:$M$16,2,0)","v":"ESV 2"},{"$f":"VLOOKUP(I14,Hilfstabelle!$L$5:$M$16,2,0)","v":"AXA 1"},{"$f":"VLOOKUP(J14,Hilfstabelle!$L$5:$M$16,2,0)","v":"ERG 3"},{"$f":"VLOOKUP(K14,Hilfstabelle!$L$5:$M$16,2,0)","v":"DAT 2"},{"$f":"VLOOKUP(L14,Hilfstabelle!$L$5:$M$16,2,0)","v":"PAN 1"},{"$f":"VLOOKUP(M14,Hilfstabelle!$L$5:$M$16,2,0)","v":"GEN 3"},{"$f":"VLOOKUP(N14,Hilfstabelle!$L$5:$M$16,2,0)","v":"FAH 3"},{"$f":"VLOOKUP(O14,Hilfstabelle!$L$5:$M$16,2,0)","v":"HAS 5"},{"$f":"VLOOKUP(P14,Hilfstabelle!$L$5:$M$16,2,0)","v":"BWV 5"},{"$f":"VLOOKUP(Q14,Hilfstabelle!$L$5:$M$16,2,0)","v":"EAG 1"}]
[null,null,null,null,null,null,{"$f":"+Hilfstabelle!$L$5","v":"Eppendorf AG 1"},{"$f":"+Hilfstabelle!$L$6","v":"Energie Sportvereinigung 2"},{"$f":"+Hilfstabelle!$L$7","v":"AXA 1"},{"$f":"+Hilfstabelle!$L$8","v":"ERGO Sports 3"},{"$f":"+Hilfstabelle!$L$9","v":"Dataport 2"},{"$f":"+Hilfstabelle!$L$10","v":"Panasonic 1"},{"$f":"+Hilfstabelle!$L$11","v":"Generali 3"},{"$f":"+Hilfstabelle!$L$12","v":"Finanzamt 3"},{"$f":"+Hilfstabelle!$L$13","v":"HASPA 5"},{"$f":"+Hilfstabelle!$L$14","v":"BWVL 5"},{"$f":"+Hilfstabelle!$L$15","v":"Eppendorf AG 1"}]
[null,null,null,null,1,null,621,539,464,514,619,633,587,717,593,629]
[null,null,null,null,2,null,583,463,585,543,595,582,573,644,624,601]
[null,null,null,null,"1 + 2",null,{"$f":"+G16+G15","v":1204},1002,1049,1057,1214,1215,1160,1361,1217,1230,{"$f":"+Q16+Q15","v":0}]
[null,null,null,null,3,null,682,510,550,490,603,706,574,590,539,597]
[null,null,null,null,"Pins\nGesamt",null,{"$f":"+G18+G17","v":1886},1512,1599,1547,1817,1921,1734,1951,1756,1827,0]
[null,null,null,null,"Punkte\nAntritt",null,{"$f":"IF(G23=\"1\",+G22+0.5,+G22)","v":8},1,3,2,6,9,4,10,5,7,"0"]
[]
[null,null,null,null,null,null,{"$f":"IF(G15>0,RANK(G19,$G$19:$P$19,10),\"0\")","v":8},{"$f":"IF(H15>0,RANK(H19,$G$19:$P$19,10),\"0\")","v":1},3,2,6,9,4,10,5,7,{"$f":"IF(Q15>0,RANK(Q19,$G$19:$P$19,10),\"0\")","v":"0"}]
[null,null,null,null,null,null,{"$f":"IF(COUNTIF($G$22:$P$22,G22)>1,\"1\",\"\")","v":""},"","","","","","","","","",""]
[null,null,null,null,"Anhang zum Spielbericht  B O W L I N G",null,null,null,null,null,null,null,null,null,null,null,null,null,null,null,{"$f":"+#REF!/2","v":{"$error":"#REF!"}},{"$f":"+#REF!/2","v":{"$error":"#REF!"}},null,{"$f":"+#REF!/2","v":{"$error":"#REF!"}},{"$f":"+#REF!/2","v":{"$error":"#REF!"}},{"$f":"+#REF!/2","v":{"$error":"#REF!"}},{"$f":"+#REF!/2","v":{"$error":"#REF!"}},{"$f":"+#REF!/2","v":{"$error":"#REF!"}},{"$f":"+#REF!/2","v":{"$error":"#REF!"}},{"$f":"+#REF!/2","v":{"$error":"#REF!"}}]
[null,null,null,null,null,null,null,null,null,null,null,null,null,null,null,null,"Punktspielserie"]
[null,null,null,null,"alle Felder sind unbedingt auszufüllen und mit dem Original-Spielbericht einzusenden."]
[]
[null,null,null,null,null,null,"Klasse:",{"$f":"+Hilfstabelle!$G$5","v":"B2"},null,"Antritt-Nr. :",2,"Datum :",{"$f":"VLOOKUP(K28,Hilfstabelle!$I$5:$J$18,2,0)","v":"2025-09-23"},"Halle :",{"$f":"VLOOKUP(K28,Hilfstabelle!$I$5:$L$18,3,0)","v":"Wandsbek"}]
[]
[null,null,null,null,null,null,"Ausrichter BSG:",null,{"$f":"+VLOOKUP(K28,Hilfstabelle!$I$5:$L$18,4,0)&\"\"","v":"Energie Sportvereinigung 2"},null,null,"Mannschaftsführer: Michael Wetzel      -     Telefon: 0172/412 45 69"]
[null,null,null,null,null,null,"Bahn:","Bahn:","Bahn:","Bahn:","Bahn:","Bahn:","Bahn:","Bahn:","Bahn:","Bahn:","Bahn:"]
[null,null,null,null,"Durch-\ngänge",null,"BSG","BSG","BSG","BSG","BSG","BSG","BSG","BSG","BSG","BSG","BSG"]
[null,null,null,null,null,null,{"$f":"VLOOKUP(G34,Hilfstabelle!$L$5:$M$16,2,0)","v":"EAG 1"},{"$f":"VLOOKUP(H34,Hilfstabelle!$L$5:$M$16,2,0)","v":"ESV 2"},{"$f":"VLOOKUP(I34,Hilfstabelle!$L$5:$M$16,2,0)","v":"AXA 1"},{"$f":"VLOOKUP(J34,Hilfstabelle!$L$5:$M$16,2,0)","v":"ERG 3"},{"$f":"VLOOKUP(K34,Hilfstabelle!$L$5:$M$16,2,0)","v":"DAT 2"},{"$f":"VLOOKUP(L34,Hilfstabelle!$L$5:$M$16,2,0)","v":"PAN 1"},{"$f":"VLOOKUP(M34,Hilfstabelle!$L$5:$M$16,2,0)","v":"GEN 3"},{"$f":"VLOOKUP(N34,Hilfstabelle!$L$5:$M$16,2,0)","v":"FAH 3"},{"$f":"VLOOKUP(O34,Hilfstabelle!$L$5:$M$16,2,0)","v":"HAS 5"},{"$f":"VLOOKUP(P34,Hilfstabelle!$L$5:$M$16,2,0)","v":"BWV 5"},{"$f":"VLOOKUP(Q34,Hilfstabelle!$L$5:$M$16,2,0)","v":"EAG 1"}]
[null,null,null,null,null,null,{"$f":"+Hilfstabelle!$L$5","v":"Eppendorf AG 1"},{"$f":"+Hilfstabelle!$L$6","v":"Energie Sportvereinigung 2"},{"$f":"+Hilfstabelle!$L$7","v":"AXA 1"},{"$f":"+Hilfstabelle!$L$8","v":"ERGO Sports 3"},{"$f":"+Hilfstabelle!$L$9","v":"Dataport 2"},{"$f":"+Hilfstabelle!$L$10","v":"Panasonic 1"},{"$f":"+Hilfstabelle!$L$11","v":"Generali 3"},{"$f":"+Hilfstabelle!$L$12","v":"Finanzamt 3"},{"$f":"+Hilfstabelle!$L$13","v":"HASPA 5"},{"$f":"+Hilfstabelle!$L$14","v":"BWVL 5"},{"$f":"+Hilfstabelle!$L$15","v":"Eppendorf AG 1"}]
[null,null,null,null,"Platz",null,{"$f":"HLOOKUP(G34,Hilfstabelle!$AA$5:$AK$6,2,0)","v":"6."},{"$f":"HLOOKUP(H34,Hilfstabelle!$AA$5:$AK$6,2,0)","v":"10."},{"$f":"HLOOKUP(I34,Hilfstabelle!$AA$5:$AK$6,2,0)","v":"2."},{"$f":"HLOOKUP(J34,Hilfstabelle!$AA$5:$AK$6,2,0)","v":"9."},{"$f":"HLOOKUP(K34,Hilfstabelle!$AA$5:$AK$6,2,0)","v":"3."},{"$f":"HLOOKUP(L34,Hilfstabelle!$AA$5:$AK$6,2,0)","v":"1."},{"$f":"HLOOKUP(M34,Hilfstabelle!$AA$5:$AK$6,2,0)","v":"7."},{"$f":"HLOOKUP(N34,Hilfstabelle!$AA$5:$AK$6,2,0)","v":"8."},{"$f":"HLOOKUP(O34,Hilfstabelle!$AA$5:$AK$6,2,0)","v":"4."},{"$f":"HLOOKUP(P34,Hilfstabelle!$AA$5:$AK$6,2,0)","v":"5."},{"$f":"HLOOKUP(Q34,Hilfstabelle!$AA$5:$AK$6,2,0)","v":"6."}]
[null,null,null,null,1,null,566,568,679,552,666,614,531,517,666,568]
[null,null,null,null,2,null,573,515,682,505,689,694,567,513,575,676]
[null,null,null,null,"1 + 2",null,{"$f":"+G37+G36","v":1139},1083,1361,1057,1355,1308,1098,1030,1241,1244,{"$f":"+Q37+Q36","v":0}]
[null,null,null,null,3,null,605,604,683,529,612,647,548,408,613,591]
[null,null,null,null,"Pins\nGesamt",null,{"$f":"+G39+G38","v":1744},1687,2044,1586,1967,1955,1646,1438,1854,1835,0]
[null,null,null,null,"Punkte\nAntritt",null,{"$f":"IF(G46=\"1\",+G45+0.5,+G45)","v":5},{"$f":"IF(H46=\"1\",+H45+0.5,+H45)","v":4},10,2,9,8,3,1,7,6,"0"]
[null,null,null,null,"Punkte\nA L T",null,{"$f":"+G20","v":8},1,3,2,6,9,4,10,5,7,"0"]
[null,null,null,null,"Punkte\nN E U",null,{"$f":"IF(G36>0,+G42+G41,\" \")","v":13},{"$f":"IF(H36>0,+H42+H41,\" \")","v":5},13,4,15,17,7,11,12,13," "]
[null,null,null,null,"Gesamt Pins",null,{"$f":"+G40+G19","v":3630},3199,3643,3133,3784,3876,3380,3389,3610,3662,0]
[null,null,null,null,null,null,{"$f":"IF(G36>0,RANK(G40,$G$40:$P$40,10),\"0\")","v":5},{"$f":"IF(H36>0,RANK(H40,$G$40:$P$40,10),\"0\")","v":4},10,2,9,8,3,1,7,6,{"$f":"IF(Q36>0,RANK(Q40,$G$40:$P$40,10),\"0\")","v":"0"},{"$f":"IF(R36>0,RANK(R40,$G$40:$S$40,10),\"0\")","v":"0"},"0"]
[null,null,null,null,null,null,{"$f":"IF(COUNTIF($G$45:$P$45,G45)>1,\"1\",\"\")","v":""},{"$f":"IF(COUNTIF($G$45:$P$45,H45)>1,\"1\",\"\")","v":""},"","","","","","","","",{"$f":"IF(COUNTIF($G$45:$P$45,Q45)>1,\"1\",\"\")","v":""},{"$f":"IF(COUNTIF($G$45:$S$45,R45)>1,\"1\",\"\")","v":"1"},"1"]
[null,null,null,null,"Anhang zum Spielbericht  B O W L I N G"]
[null,null,null,null,null,null,null,null,null,null,null,null,null,null,null,null,"Punktspielserie"]
[null,null,null,null,"alle Felder sind unbedingt auszufüllen und mit dem Original-Spielbericht einzusenden."]
[]
[null,null,null,null,null,null,"Klasse:",{"$f":"+Hilfstabelle!$G$5","v":"B2"},null,"Antritt-Nr. :",3,"Datum :",{"$f":"VLOOKUP(K51,Hilfstabelle!$I$5:$J$18,2,0)","v":"2025-10-07"},"Halle :",{"$f":"VLOOKUP(K51,Hilfstabelle!$I$5:$L$18,3,0)","v":"Othmarschen"}]
[]
[null,null,null,null,null,null,"Ausrichter BSG:",null,{"$f":"+VLOOKUP(K51,Hilfstabelle!$I$5:$L$18,4,0)&\"\"","v":"AXA 1"},null,null,"Mannschaftsführer: Michael Wetzel      -     Telefon: 0172/412 45 69"]
[null,null,null,null,null,null,"Bahn: 4","Bahn: 11","Bahn: 3","Bahn: 12","Bahn: 6","Bahn: 9","Bahn: 5","Bahn: 8","Bahn: 10","Bahn: 7","Bahn:"]
[null,null,null,null,"Durch-\ngänge",null,"BSG","BSG","BSG","BSG","BSG","BSG","BSG","BSG","BSG","BSG","BSG"]
[null,null,null,null,null,null,{"$f":"VLOOKUP(G57,Hilfstabelle!$L$5:$M$16,2,0)","v":"EAG 1"},{"$f":"VLOOKUP(H57,Hilfstabelle!$L$5:$M$16,2,0)","v":"ESV 2"},{"$f":"VLOOKUP(I57,Hilfstabelle!$L$5:$M$16,2,0)","v":"AXA 1"},{"$f":"VLOOKUP(J57,Hilfstabelle!$L$5:$M$16,2,0)","v":"ERG 3"},{"$f":"VLOOKUP(K57,Hilfstabelle!$L$5:$M$16,2,0)","v":"DAT 2"},{"$f":"VLOOKUP(L57,Hilfstabelle!$L$5:$M$16,2,0)","v":"PAN 1"},{"$f":"VLOOKUP(M57,Hilfstabelle!$L$5:$M$16,2,0)","v":"GEN 3"},{"$f":"VLOOKUP(N57,Hilfstabelle!$L$5:$M$16,2,0)","v":"FAH 3"},{"$f":"VLOOKUP(O57,Hilfstabelle!$L$5:$M$16,2,0)","v":"HAS 5"},{"$f":"VLOOKUP(P57,Hilfstabelle!$L$5:$M$16,2,0)","v":"BWV 5"},{"$f":"VLOOKUP(Q57,Hilfstabelle!$L$5:$M$16,2,0)","v":"EAG 1"}]
[null,null,null,null,null,null,{"$f":"+Hilfstabelle!$L$5","v":"Eppendorf AG 1"},{"$f":"+Hilfstabelle!$L$6","v":"Energie Sportvereinigung 2"},{"$f":"+Hilfstabelle!$L$7","v":"AXA 1"},{"$f":"+Hilfstabelle!$L$8","v":"ERGO Sports 3"},{"$f":"+Hilfstabelle!$L$9","v":"Dataport 2"},{"$f":"+Hilfstabelle!$L$10","v":"Panasonic 1"},{"$f":"+Hilfstabelle!$L$11","v":"Generali 3"},{"$f":"+Hilfstabelle!$L$12","v":"Finanzamt 3"},{"$f":"+Hilfstabelle!$L$13","v":"HASPA 5"},{"$f":"+Hilfstabelle!$L$14","v":"BWVL 5"},{"$f":"+Hilfstabelle!$L$15","v":"Eppendorf AG 1"}]
[null,null,null,null,"Platz",null,{"$f":"HLOOKUP(G57,Hilfstabelle!$AA$5:$AK$6,2,0)","v":"6."},{"$f":"HLOOKUP(H57,Hilfstabelle!$AA$5:$AK$6,2,0)","v":"10."},{"$f":"HLOOKUP(I57,Hilfstabelle!$AA$5:$AK$6,2,0)","v":"2."},{"$f":"HLOOKUP(J57,Hilfstabelle!$AA$5:$AK$6,2,0)","v":"9."},{"$f":"HLOOKUP(K57,Hilfstabelle!$AA$5:$AK$6,2,0)","v":"3."},{"$f":"HLOOKUP(L57,Hilfstabelle!$AA$5:$AK$6,2,0)","v":"1."},{"$f":"HLOOKUP(M57,Hilfstabelle!$AA$5:$AK$6,2,0)","v":"7."},{"$f":"HLOOKUP(N57,Hilfstabelle!$AA$5:$AK$6,2,0)","v":"8."},{"$f":"HLOOKUP(O57,Hilfstabelle!$AA$5:$AK$6,2,0)","v":"4."},{"$f":"HLOOKUP(P57,Hilfstabelle!$AA$5:$AK$6,2,0)","v":"5."},{"$f":"HLOOKUP(Q57,Hilfstabelle!$AA$5:$AK$6,2,0)","v":"6."}]
[null,null,null,null,1,null,587,454,621,543,561,610,622,531,624,605]
[null,null,null,null,2,null,522,546,651,573,523,608,590,484,704,600]
[null,null,null,null,"1 + 2",null,{"$f":"+G60+G59","v":1109},1000,1272,1116,1084,1218,1212,1015,1328,1205,{"$f":"+Q60+Q59","v":0}]
[null,null,null,null,3,null,447,438,593,580,577,629,546,573,600,541,541]
[null,null,null,null,"Pins\nGesamt",null,{"$f":"+G62+G61","v":1556},1438,1865,1696,1661,1847,1758,1588,1928,1746,541]
[null,null,null,null,"Punkte\nAntritt",null,{"$f":"IF(G69=\"1\",+G68+0.5,+G68)","v":2},{"$f":"IF(H69=\"1\",+H68+0.5,+H68)","v":1},9,5,4,8,7,3,10,6,"0"]
[null,null,null,null,"Punkte\nA L T",null,{"$f":"+G43","v":13},5,13,4,15,17,7,11,12,13," "]
[null,null,null,null,"Punkte\nN E U",null,{"$f":"IF(G59>0,+G65+G64,\" \")","v":15},6,22,9,19,25,14,14,22,19," "]
[null,null,null,null,"Gesamt Pins",null,{"$f":"+G63+G44","v":5186},4637,5508,4829,5445,5723,5138,4977,5538,5408,541]
[null,null,null,null,null,null,{"$f":"IF(G59>0,RANK(G63,$G$63:$P$63,10),\"0\")","v":2},{"$f":"IF(H59>0,RANK(H63,$G$63:$P$63,10),\"0\")","v":1},9,5,4,8,7,3,10,6,{"$f":"IF(Q59>0,RANK(Q63,$G$63:$P$63,10),\"0\")","v":"0"}]
[null,null,null,null,null,null,{"$f":"IF(COUNTIF($G$68:$P$68,G68)>1,\"1\",\"\")","v":""},{"$f":"IF(COUNTIF($G$68:$P$68,H68)>1,\"1\",\"\")","v":""},"","","","","","","","",{"$f":"IF(COUNTIF($G$68:$P$68,Q68)>1,\"1\",\"\")","v":""}]
[null,null,null,null,null,null,{"$f":"IF(COUNTIF($F$20:$M$20,G68)>1,\"1\",\"\")","v":""},"","","","","","",null,null,null,""]
[null,null,null,null,"Anhang zum Spielbericht  B O W L I N G"]
[null,null,null,null,null,null,null,null,null,null,null,null,null,null,null,null,"Punktspielserie"]
[null,null,null,null,"alle Felder sind unbedingt auszufüllen und mit dem Original-Spielbericht einzusenden."]
[]
[null,null,null,null,null,null,"Klasse:",{"$f":"+Hilfstabelle!$G$5","v":"B2"},null,"Antritt-Nr. :",4,"Datum :",{"$f":"VLOOKUP(K75,Hilfstabelle!$I$5:$J$18,2,0)","v":"2025-10-21"},"Halle :",{"$f":"VLOOKUP(K75,Hilfstabelle!$I$5:$L$18,3,0)","v":"Wandsbek"}]
[]
[null,null,null,null,null,null,"Ausrichter BSG:",null,{"$f":"+VLOOKUP(K75,Hilfstabelle!$I$5:$L$18,4,0)&\"\"","v":"ERGO Sports 3"},null,null,"Mannschaftsführer: Michael Wetzel      -     Telefon: 0172/412 45 69"]
[null,null,null,null,null,null,"Bahn:","Bahn:","Bahn:","Bahn:","Bahn:","Bahn:","Bahn:","Bahn:","Bahn:","Bahn:","Bahn:"]
[null,null,null,null,"Durch-\ngänge",null,"BSG","BSG","BSG","BSG","BSG","BSG","BSG","BSG","BSG","BSG","BSG"]
[null,null,null,null,null,null,{"$f":"VLOOKUP(G81,Hilfstabelle!$L$5:$M$16,2,0)","v":"EAG 1"},{"$f":"VLOOKUP(H81,Hilfstabelle!$L$5:$M$16,2,0)","v":"ESV 2"},{"$f":"VLOOKUP(I81,Hilfstabelle!$L$5:$M$16,2,0)","v":"AXA 1"},{"$f":"VLOOKUP(J81,Hilfstabelle!$L$5:$M$16,2,0)","v":"ERG 3"},{"$f":"VLOOKUP(K81,Hilfstabelle!$L$5:$M$16,2,0)","v":"DAT 2"},{"$f":"VLOOKUP(L81,Hilfstabelle!$L$5:$M$16,2,0)","v":"PAN 1"},{"$f":"VLOOKUP(M81,Hilfstabelle!$L$5:$M$16,2,0)","v":"GEN 3"},{"$f":"VLOOKUP(N81,Hilfstabelle!$L$5:$M$16,2,0)","v":"FAH 3"},{"$f":"VLOOKUP(O81,Hilfstabelle!$L$5:$M$16,2,0)","v":"HAS 5"},{"$f":"VLOOKUP(P81,Hilfstabelle!$L$5:$M$16,2,0)","v":"BWV 5"},{"$f":"VLOOKUP(Q81,Hilfstabelle!$L$5:$M$16,2,0)","v":"EAG 1"}]
[null,null,null,null,null,null,{"$f":"+Hilfstabelle!$L$5","v":"Eppendorf AG 1"},{"$f":"+Hilfstabelle!$L$6","v":"Energie Sportvereinigung 2"},{"$f":"+Hilfstabelle!$L$7","v":"AXA 1"},{"$f":"+Hilfstabelle!$L$8","v":"ERGO Sports 3"},{"$f":"+Hilfstabelle!$L$9","v":"Dataport 2"},{"$f":"+Hilfstabelle!$L$10","v":"Panasonic 1"},{"$f":"+Hilfstabelle!$L$11","v":"Generali 3"},{"$f":"+Hilfstabelle!$L$12","v":"Finanzamt 3"},{"$f":"+Hilfstabelle!$L$13","v":"HASPA 5"},{"$f":"+Hilfstabelle!$L$14","v":"BWVL 5"},{"$f":"+Hilfstabelle!$L$15","v":"Eppendorf AG 1"}]
[null,null,null,null,"Platz",null,{"$f":"HLOOKUP(G81,Hilfstabelle!$AA$5:$AK$6,2,0)","v":"6."},{"$f":"HLOOKUP(H81,Hilfstabelle!$AA$5:$AK$6,2,0)","v":"10."},{"$f":"HLOOKUP(I81,Hilfstabelle!$AA$5:$AK$6,2,0)","v":"2."},{"$f":"HLOOKUP(J81,Hilfstabelle!$AA$5:$AK$6,2,0)","v":"9."},{"$f":"HLOOKUP(K81,Hilfstabelle!$AA$5:$AK$6,2,0)","v":"3."},{"$f":"HLOOKUP(L81,Hilfstabelle!$AA$5:$AK$6,2,0)","v":"1."},{"$f":"HLOOKUP(M81,Hilfstabelle!$AA$5:$AK$6,2,0)","v":"7."},{"$f":"HLOOKUP(N81,Hilfstabelle!$AA$5:$AK$6,2,0)","v":"8."},{"$f":"HLOOKUP(O81,Hilfstabelle!$AA$5:$AK$6,2,0)","v":"4."},{"$f":"HLOOKUP(P81,Hilfstabelle!$AA$5:$AK$6,2,0)","v":"5."},{"$f":"HLOOKUP(Q81,Hilfstabelle!$AA$5:$AK$6,2,0)","v":"6."},null,{"$f":"MIN(G82:M82)","v":0}]
[null,null,null,null,1,null,720,595,707,524,633,716,618,618,566,674]
[null,null,null,null,2,null,668,469,699,595,711,636,624,514,601,673]
[null,null,null,null,"1 + 2",null,{"$f":"+G84+G83","v":1388},1064,1406,1119,1344,1352,1242,1132,1167,1347,{"$f":"+Q84+Q83","v":0}]
[null,null,null,null,3,null,618,505,628,537,661,680,603,539,625,677]
[null,null,null,null,"Pins\nGesamt",null,{"$f":"+G86+G85","v":2006},1569,2034,1656,2005,2032,1845,1671,1792,2024,0]
[null,null,null,null,"Punkte\nAntritt",null,{"$f":"IF(G93=\"1\",+G92+0.5,+G92)","v":7},{"$f":"IF(H93=\"1\",+H92+0.5,+H92)","v":1},10,2,6,9,5,3,4,8,"0"]
[null,null,null,null,"Punkte\nA L T",null,{"$f":"+G66","v":15},6,22,9,19,25,14,14,22,19," "]
[null,null,null,null,"Punkte\nN E U",null,{"$f":"IF(G83>0,+G89+G88,\" \")","v":22},{"$f":"IF(H83>0,+H89+H88,\" \")","v":7},32,11,25,34,19,17,26,27," "]
[null,null,null,null,"Gesamt Pins",null,{"$f":"+G87+G67","v":7192},6206,7542,6485,7450,7755,6983,6648,7330,7432,541]
[null,null,null,null,null,null,{"$f":"IF(G83>0,RANK(G87,$G$87:$P$87,10),\"0\")","v":7},{"$f":"IF(H83>0,RANK(H87,$G$87:$P$87,10),\"0\")","v":1},10,2,6,9,5,3,4,8,{"$f":"IF(Q83>0,RANK(Q87,$G$87:$P$87,10),\"0\")","v":"0"}]
[null,null,null,null,null,null,{"$f":"IF(COUNTIF($G$92:$P$92,G92)>1,\"1\",\"\")","v":""},{"$f":"IF(COUNTIF($G$92:$P$92,H92)>1,\"1\",\"\")","v":""},"","","","","","","","",{"$f":"IF(COUNTIF($G$92:$P$92,Q92)>1,\"1\",\"\")","v":""}]
[null,null,null,null,"Anhang zum Spielbericht  B O W L I N G"]
[null,null,null,null,null,null,null,null,null,null,null,null,null,null,null,null,"Punktspielserie"]
[null,null,null,null,"alle Felder sind unbedingt auszufüllen und mit dem Original-Spielbericht einzusenden."]
[]
[null,null,null,null,null,null,"Klasse:",{"$f":"+Hilfstabelle!$G$5","v":"B2"},null,"Antritt-Nr. :",5,"Datum :",{"$f":"VLOOKUP(K98,Hilfstabelle!$I$5:$J$18,2,0)","v":"2025-11-04"},"Halle :",{"$f":"VLOOKUP(K98,Hilfstabelle!$I$5:$L$18,3,0)","v":"Othmarschen"}]
[]
[null,null,null,null,null,null,"Ausrichter BSG:",null,{"$f":"+VLOOKUP(K98,Hilfstabelle!$I$5:$L$18,4,0)&\"\"","v":"Dataport 2"},null,null,"Mannschaftsführer: Michael Wetzel      -     Telefon: 0172/412 45 69"]
[null,null,null,null,null,null,"Bahn:","Bahn:","Bahn:","Bahn:","Bahn:","Bahn:","Bahn:","Bahn:","Bahn:","Bahn:","Bahn:"]
[null,null,null,null,"Durch-\ngänge",null,"BSG","BSG","BSG","BSG","BSG","BSG","BSG","BSG","BSG","BSG","BSG"]
[null,null,null,null,null,null,{"$f":"VLOOKUP(G104,Hilfstabelle!$L$5:$M$16,2,0)","v":"EAG 1"},{"$f":"VLOOKUP(H104,Hilfstabelle!$L$5:$M$16,2,0)","v":"ESV 2"},{"$f":"VLOOKUP(I104,Hilfstabelle!$L$5:$M$16,2,0)","v":"AXA 1"},{"$f":"VLOOKUP(J104,Hilfstabelle!$L$5:$M$16,2,0)","v":"ERG 3"},{"$f":"VLOOKUP(K104,Hilfstabelle!$L$5:$M$16,2,0)","v":"DAT 2"},{"$f":"VLOOKUP(L104,Hilfstabelle!$L$5:$M$16,2,0)","v":"PAN 1"},{"$f":"VLOOKUP(M104,Hilfstabelle!$L$5:$M$16,2,0)","v":"GEN 3"},{"$f":"VLOOKUP(N104,Hilfstabelle!$L$5:$M$16,2,0)","v":"FAH 3"},{"$f":"VLOOKUP(O104,Hilfstabelle!$L$5:$M$16,2,0)","v":"HAS 5"},{"$f":"VLOOKUP(P104,Hilfstabelle!$L$5:$M$16,2,0)","v":"BWV 5"},{"$f":"VLOOKUP(Q104,Hilfstabelle!$L$5:$M$16,2,0)","v":"EAG 1"}]
[null,null,null,null,null,null,{"$f":"+Hilfstabelle!$L$5","v":"Eppendorf AG 1"},{"$f":"+Hilfstabelle!$L$6","v":"Energie Sportvereinigung 2"},{"$f":"+Hilfstabelle!$L$7","v":"AXA 1"},{"$f":"+Hilfstabelle!$L$8","v":"ERGO Sports 3"},{"$f":"+Hilfstabelle!$L$9","v":"Dataport 2"},{"$f":"+Hilfstabelle!$L$10","v":"Panasonic 1"},{"$f":"+Hilfstabelle!$L$11","v":"Generali 3"},{"$f":"+Hilfstabelle!$L$12","v":"Finanzamt 3"},{"$f":"+Hilfstabelle!$L$13","v":"HASPA 5"},{"$f":"+Hilfstabelle!$L$14","v":"BWVL 5"},{"$f":"+Hilfstabelle!$L$15","v":"Eppendorf AG 1"}]
[null,null,null,null,"Platz",null,{"$f":"HLOOKUP(G104,Hilfstabelle!$AA$5:$AK$6,2,0)","v":"6."},{"$f":"HLOOKUP(H104,Hilfstabelle!$AA$5:$AK$6,2,0)","v":"10."},{"$f":"HLOOKUP(I104,Hilfstabelle!$AA$5:$AK$6,2,0)","v":"2."},{"$f":"HLOOKUP(J104,Hilfstabelle!$AA$5:$AK$6,2,0)","v":"9."},{"$f":"HLOOKUP(K104,Hilfstabelle!$AA$5:$AK$6,2,0)","v":"3."},{"$f":"HLOOKUP(L104,Hilfstabelle!$AA$5:$AK$6,2,0)","v":"1."},{"$f":"HLOOKUP(M104,Hilfstabelle!$AA$5:$AK$6,2,0)","v":"7."},{"$f":"HLOOKUP(N104,Hilfstabelle!$AA$5:$AK$6,2,0)","v":"8."},{"$f":"HLOOKUP(O104,Hilfstabelle!$AA$5:$AK$6,2,0)","v":"4."},{"$f":"HLOOKUP(P104,Hilfstabelle!$AA$5:$AK$6,2,0)","v":"5."},{"$f":"HLOOKUP(Q104,Hilfstabelle!$AA$5:$AK$6,2,0)","v":"6."}]
[null,null,null,null,1,null,566,524,601,530,626,591,625,487,615,433]
[null,null,null,null,2,null,537,583,609,512,663,633,540,585,629,472]
[null,null,null,null,"1 + 2",null,{"$f":"+G107+G106","v":1103},1107,1210,1042,1289,1224,1165,1072,1244,905,{"$f":"+Q107+Q106","v":0}]
[null,null,null,null,3,null,564,564,735,527,686,655,624,503,526,390]
[null,null,null,null,"Pins\nGesamt",null,{"$f":"+G109+G108","v":1667},1671,1945,1569,1975,1879,1789,1575,1770,1295,0]
[null,null,null,null,"Punkte\nAntritt",null,{"$f":"IF(G116=\"1\",+G115+0.5,+G115)","v":4},{"$f":"IF(H116=\"1\",+H115+0.5,+H115)","v":5},9,2,10,8,7,3,6,1,"0"]
[null,null,null,null,"Punkte\nA L T",null,{"$f":"+G90","v":22},7,32,11,25,34,19,17,26,27," "]
[null,null,null,null,"Punkte\nN E U",null,{"$f":"IF(G106>0,+G112+G111,\" \")","v":26},{"$f":"IF(H106>0,+H112+H111,\" \")","v":12},41,13,35,42,26,20,32,28," "]
[null,null,null,null,"Gesamt Pins",null,{"$f":"+G110+G91","v":8859},7877,9487,8054,9425,9634,8772,8223,9100,8727,541]
[null,null,null,null,null,null,{"$f":"IF(G106>0,RANK(G110,$G$110:$P$110,10),\"0\")","v":4},5,9,2,10,8,7,3,6,1,"0"]
[null,null,null,null,null,null,{"$f":"IF(COUNTIF($G$115:$P$115,G115)>1,\"1\",\"\")","v":""},"","","","","","","","","",""]
[null,null,null,null,"Anhang zum Spielbericht  B O W L I N G"]
[null,null,null,null,null,null,null,null,null,null,null,null,null,null,null,null,"Punktspielserie"]
[null,null,null,null,"alle Felder sind unbedingt auszufüllen und mit dem Original-Spielbericht einzusenden."]
[]
[null,null,null,null,null,null,"Klasse:",{"$f":"+Hilfstabelle!$G$5","v":"B2"},null,"Antritt-Nr. :",6,"Datum :",{"$f":"VLOOKUP(K121,Hilfstabelle!$I$5:$J$18,2,0)","v":"2025-11-18"},"Halle :",{"$f":"VLOOKUP(K121,Hilfstabelle!$I$5:$L$18,3,0)","v":"Wandsbek"}]
[]
[null,null,null,null,null,null,"Ausrichter BSG:",null,{"$f":"+VLOOKUP(K121,Hilfstabelle!$I$5:$L$18,4,0)&\"\"","v":"Panasonic 1"},null,null,"Mannschaftsführer: Michael Wetzel      -     Telefon: 0172/412 45 69"]
[null,null,null,null,null,null,"Bahn:","Bahn:","Bahn:","Bahn:","Bahn:","Bahn:","Bahn:","Bahn:","Bahn:","Bahn:","Bahn:"]
[null,null,null,null,"Durch-\ngänge",null,"BSG","BSG","BSG","BSG","BSG","BSG","BSG","BSG","BSG","BSG","BSG"]
[null,null,null,null,null,null,{"$f":"VLOOKUP(G127,Hilfstabelle!$L$5:$M$16,2,0)","v":"EAG 1"},{"$f":"VLOOKUP(H127,Hilfstabelle!$L$5:$M$16,2,0)","v":"ESV 2"},{"$f":"VLOOKUP(I127,Hilfstabelle!$L$5:$M$16,2,0)","v":"AXA 1"},{"$f":"VLOOKUP(J127,Hilfstabelle!$L$5:$M$16,2,0)","v":"ERG 3"},{"$f":"VLOOKUP(K127,Hilfstabelle!$L$5:$M$16,2,0)","v":"DAT 2"},{"$f":"VLOOKUP(L127,Hilfstabelle!$L$5:$M$16,2,0)","v":"PAN 1"},{"$f":"VLOOKUP(M127,Hilfstabelle!$L$5:$M$16,2,0)","v":"GEN 3"},{"$f":"VLOOKUP(N127,Hilfstabelle!$L$5:$M$16,2,0)","v":"FAH 3"},{"$f":"VLOOKUP(O127,Hilfstabelle!$L$5:$M$16,2,0)","v":"HAS 5"},{"$f":"VLOOKUP(P127,Hilfstabelle!$L$5:$M$16,2,0)","v":"BWV 5"},{"$f":"VLOOKUP(Q127,Hilfstabelle!$L$5:$M$16,2,0)","v":"EAG 1"}]
[null,null,null,null,null,null,{"$f":"+Hilfstabelle!$L$5","v":"Eppendorf AG 1"},{"$f":"+Hilfstabelle!$L$6","v":"Energie Sportvereinigung 2"},{"$f":"+Hilfstabelle!$L$7","v":"AXA 1"},{"$f":"+Hilfstabelle!$L$8","v":"ERGO Sports 3"},{"$f":"+Hilfstabelle!$L$9","v":"Dataport 2"},{"$f":"+Hilfstabelle!$L$10","v":"Panasonic 1"},{"$f":"+Hilfstabelle!$L$11","v":"Generali 3"},{"$f":"+Hilfstabelle!$L$12","v":"Finanzamt 3"},{"$f":"+Hilfstabelle!$L$13","v":"HASPA 5"},{"$f":"+Hilfstabelle!$L$14","v":"BWVL 5"},{"$f":"+Hilfstabelle!$L$15","v":"Eppendorf AG 1"}]
[null,null,null,null,"Platz",null,{"$f":"HLOOKUP(G127,Hilfstabelle!$AA$5:$AK$6,2,0)","v":"6."},{"$f":"HLOOKUP(H127,Hilfstabelle!$AA$5:$AK$6,2,0)","v":"10."},{"$f":"HLOOKUP(I127,Hilfstabelle!$AA$5:$AK$6,2,0)","v":"2."},{"$f":"HLOOKUP(J127,Hilfstabelle!$AA$5:$AK$6,2,0)","v":"9."},{"$f":"HLOOKUP(K127,Hilfstabelle!$AA$5:$AK$6,2,0)","v":"3."},{"$f":"HLOOKUP(L127,Hilfstabelle!$AA$5:$AK$6,2,0)","v":"1."},{"$f":"HLOOKUP(M127,Hilfstabelle!$AA$5:$AK$6,2,0)","v":"7."},{"$f":"HLOOKUP(N127,Hilfstabelle!$AA$5:$AK$6,2,0)","v":"8."},{"$f":"HLOOKUP(O127,Hilfstabelle!$AA$5:$AK$6,2,0)","v":"4."},{"$f":"HLOOKUP(P127,Hilfstabelle!$AA$5:$AK$6,2,0)","v":"5."},{"$f":"HLOOKUP(Q127,Hilfstabelle!$AA$5:$AK$6,2,0)","v":"6."}]
[null,null,null,null,1]
[null,null,null,null,2]
[null,null,null,null,"1 + 2",null,{"$f":"+G130+G129","v":0},0,0,0,0,0,0,0,0,0,{"$f":"+Q130+Q129","v":0}]
[null,null,null,null,3]
[null,null,null,null,"Pins\nGesamt",null,{"$f":"+G132+G131","v":0},0,0,0,0,0,0,0,0,0,0]
[null,null,null,null,"Punkte\nAntritt",null,{"$f":"IF(G139=\"1\",+G138+0.5,+G138)","v":0.5},{"$f":"IF(H139=\"1\",+H138+0.5,+H138)","v":0.5},0.5,0.5,0.5,0.5,0.5,0.5,0.5,0.5,0.5]
[null,null,null,null,"Punkte\nA L T",null,{"$f":"+G113","v":26},12,41,13,35,42,26,20,32,28," "]
[null,null,null,null,"Punkte\nN E U",null,{"$f":"IF(G129>0,+G135+G134,\" \")","v":" "},{"$f":"IF(H129>0,+H135+H134,\" \")","v":" "}," "," "," "," "," "," "," "," "," "]
[null,null,null,null,"Gesamt Pins",null,{"$f":"+G133+G114","v":8859},7877,9487,8054,9425,9634,8772,8223,9100,8727,541]
[null,null,null,null,null,null,{"$f":"IF(G129>0,RANK(G133,$G$133:$P$133,10),\"0\")","v":"0"},"0","0","0","0","0","0","0","0","0","0"]
[null,null,null,null,null,null,{"$f":"IF(COUNTIF($G$138:$P$138,G138)>1,\"1\",\"\")","v":"1"},"1","1","1","1","1","1","1","1","1","1"]
[null,null,null,null,"Anhang zum Spielbericht  B O W L I N G"]
[null,null,null,null,null,null,null,null,null,null,null,null,null,null,null,null,"Punktspielserie"]
[null,null,null,null,"alle Felder sind unbedingt auszufüllen und mit dem Original-Spielbericht einzusenden."]
[]
[null,null,null,null,null,null,"Klasse:",{"$f":"+Hilfstabelle!$G$5","v":"B2"},null,"Antritt-Nr. :",7,"Datum :",{"$f":"VLOOKUP(K144,Hilfstabelle!$I$5:$J$18,2,0)","v":"2026-01-13"},"Halle :",{"$f":"VLOOKUP(K144,Hilfstabelle!$I$5:$L$18,3,0)","v":"Othmarschen"}]
[]
[null,null,null,null,null,null,"Ausrichter BSG:",null,{"$f":"+VLOOKUP(K144,Hilfstabelle!$I$5:$L$18,4,0)&\"\"","v":"Generali 3"},null,null,"Mannschaftsführer: Michael Wetzel      -     Telefon: 0172/412 45 69"]
[null,null,null,null,null,null,"Bahn:","Bahn:","Bahn:","Bahn:","Bahn:","Bahn:","Bahn:","Bahn:","Bahn:","Bahn:","Bahn:"]
[null,null,null,null,"Durch-\ngänge",null,"BSG","BSG","BSG","BSG","BSG","BSG","BSG","BSG","BSG","BSG","BSG"]
[null,null,null,null,null,null,{"$f":"VLOOKUP(G150,Hilfstabelle!$L$5:$M$16,2,0)","v":"EAG 1"},{"$f":"VLOOKUP(H150,Hilfstabelle!$L$5:$M$16,2,0)","v":"ESV 2"},{"$f":"VLOOKUP(I150,Hilfstabelle!$L$5:$M$16,2,0)","v":"AXA 1"},{"$f":"VLOOKUP(J150,Hilfstabelle!$L$5:$M$16,2,0)","v":"ERG 3"},{"$f":"VLOOKUP(K150,Hilfstabelle!$L$5:$M$16,2,0)","v":"DAT 2"},{"$f":"VLOOKUP(L150,Hilfstabelle!$L$5:$M$16,2,0)","v":"PAN 1"},{"$f":"VLOOKUP(M150,Hilfstabelle!$L$5:$M$16,2,0)","v":"GEN 3"},{"$f":"VLOOKUP(N150,Hilfstabelle!$L$5:$M$16,2,0)","v":"FAH 3"},{"$f":"VLOOKUP(O150,Hilfstabelle!$L$5:$M$16,2,0)","v":"HAS 5"},{"$f":"VLOOKUP(P150,Hilfstabelle!$L$5:$M$16,2,0)","v":"BWV 5"},{"$f":"VLOOKUP(Q150,Hilfstabelle!$L$5:$M$16,2,0)","v":"EAG 1"}]
[null,null,null,null,null,null,{"$f":"+Hilfstabelle!$L$5","v":"Eppendorf AG 1"},{"$f":"+Hilfstabelle!$L$6","v":"Energie Sportvereinigung 2"},{"$f":"+Hilfstabelle!$L$7","v":"AXA 1"},{"$f":"+Hilfstabelle!$L$8","v":"ERGO Sports 3"},{"$f":"+Hilfstabelle!$L$9","v":"Dataport 2"},{"$f":"+Hilfstabelle!$L$10","v":"Panasonic 1"},{"$f":"+Hilfstabelle!$L$11","v":"Generali 3"},{"$f":"+Hilfstabelle!$L$12","v":"Finanzamt 3"},{"$f":"+Hilfstabelle!$L$13","v":"HASPA 5"},{"$f":"+Hilfstabelle!$L$14","v":"BWVL 5"},{"$f":"+Hilfstabelle!$L$15","v":"Eppendorf AG 1"}]
[null,null,null,null,"Platz",null,{"$f":"HLOOKUP(G150,Hilfstabelle!$AA$5:$AK$6,2,0)","v":"6."},{"$f":"HLOOKUP(H150,Hilfstabelle!$AA$5:$AK$6,2,0)","v":"10."},{"$f":"HLOOKUP(I150,Hilfstabelle!$AA$5:$AK$6,2,0)","v":"2."},{"$f":"HLOOKUP(J150,Hilfstabelle!$AA$5:$AK$6,2,0)","v":"9."},{"$f":"HLOOKUP(K150,Hilfstabelle!$AA$5:$AK$6,2,0)","v":"3."},{"$f":"HLOOKUP(L150,Hilfstabelle!$AA$5:$AK$6,2,0)","v":"1."},{"$f":"HLOOKUP(M150,Hilfstabelle!$AA$5:$AK$6,2,0)","v":"7."},{"$f":"HLOOKUP(N150,Hilfstabelle!$AA$5:$AK$6,2,0)","v":"8."},{"$f":"HLOOKUP(O150,Hilfstabelle!$AA$5:$AK$6,2,0)","v":"4."},{"$f":"HLOOKUP(P150,Hilfstabelle!$AA$5:$AK$6,2,0)","v":"5."},{"$f":"HLOOKUP(Q150,Hilfstabelle!$AA$5:$AK$6,2,0)","v":"6."}]
[null,null,null,null,1]
[null,null,null,null,2]
[null,null,null,null,"1 + 2",null,{"$f":"+G153+G152","v":0},0,0,0,0,0,0,0,0,0,{"$f":"+Q153+Q152","v":0}]
[null,null,null,null,3]
[null,null,null,null,"Pins\nGesamt",null,{"$f":"+G155+G154","v":0},0,0,0,0,0,0,0,0,0,0]
[null,null,null,null,"Punkte\nAntritt",null,{"$f":"IF(G162=\"1\",+G161+0.5,+G161)","v":0.5},{"$f":"IF(H162=\"1\",+H161+0.5,+H161)","v":0.5},0.5,0.5,0.5,0.5,0.5,0.5,0.5,0.5,0.5]
[null,null,null,null,"Punkte\nA L T",null,{"$f":"+G136","v":" "}," "," "," "," "," "," "," "," "," "," "]
[null,null,null,null,"Punkte\nN E U",null,{"$f":"IF(G152>0,+G158+G157,\" \")","v":" "},{"$f":"IF(H152>0,+H158+H157,\" \")","v":" "}," "," "," "," "," "," "," "," "," "]
[null,null,null,null,"Gesamt Pins",null,{"$f":"+G156+G137","v":8859},7877,9487,8054,9425,9634,8772,8223,9100,8727,541]
[null,null,null,null,null,null,{"$f":"IF(G152>0,RANK(G156,$G$156:$P$156,10),\"0\")","v":"0"},"0","0","0","0","0","0","0","0","0","0"]
[null,null,null,null,null,null,{"$f":"IF(COUNTIF($G$161:$P$161,G161)>1,\"1\",\"\")","v":"1"},"1","1","1","1","1","1","1","1","1","1"]
[null,null,null,null,"Anhang zum Spielbericht  B O W L I N G"]
[null,null,null,null,null,null,null,null,null,null,null,null,null,null,null,null,"Punktspielserie"]
[null,null,null,null,"alle Felder sind unbedingt auszufüllen und mit dem Original-Spielbericht einzusenden."]
[]
[null,null,null,null,null,null,"Klasse:",{"$f":"+Hilfstabelle!$G$5","v":"B2"},null,"Antritt-Nr. :",8,"Datum :",{"$f":"VLOOKUP(K167,Hilfstabelle!$I$5:$J$18,2,0)","v":"2026-01-27"},"Halle :",{"$f":"VLOOKUP(K167,Hilfstabelle!$I$5:$L$18,3,0)","v":"Wandsbek"}]
[]
[null,null,null,null,null,null,"Ausrichter BSG:",null,{"$f":"+VLOOKUP(K167,Hilfstabelle!$I$5:$L$18,4,0)&\"\"","v":"Finanzamt 3"},null,null,"Mannschaftsführer: Michael Wetzel      -     Telefon: 0172/412 45 69"]
[null,null,null,null,null,null,"Bahn:","Bahn:","Bahn:","Bahn:","Bahn:","Bahn:","Bahn:","Bahn:","Bahn:","Bahn:","Bahn:"]
[null,null,null,null,"Durch-\ngänge",null,"BSG","BSG","BSG","BSG","BSG","BSG","BSG","BSG","BSG","BSG","BSG"]
[null,null,null,null,null,null,{"$f":"VLOOKUP(G173,Hilfstabelle!$L$5:$M$16,2,0)","v":"EAG 1"},{"$f":"VLOOKUP(H173,Hilfstabelle!$L$5:$M$16,2,0)","v":"ESV 2"},{"$f":"VLOOKUP(I173,Hilfstabelle!$L$5:$M$16,2,0)","v":"AXA 1"},{"$f":"VLOOKUP(J173,Hilfstabelle!$L$5:$M$16,2,0)","v":"ERG 3"},{"$f":"VLOOKUP(K173,Hilfstabelle!$L$5:$M$16,2,0)","v":"DAT 2"},{"$f":"VLOOKUP(L173,Hilfstabelle!$L$5:$M$16,2,0)","v":"PAN 1"},{"$f":"VLOOKUP(M173,Hilfstabelle!$L$5:$M$16,2,0)","v":"GEN 3"},{"$f":"VLOOKUP(N173,Hilfstabelle!$L$5:$M$16,2,0)","v":"FAH 3"},{"$f":"VLOOKUP(O173,Hilfstabelle!$L$5:$M$16,2,0)","v":"HAS 5"},{"$f":"VLOOKUP(P173,Hilfstabelle!$L$5:$M$16,2,0)","v":"BWV 5"},{"$f":"VLOOKUP(Q173,Hilfstabelle!$L$5:$M$16,2,0)","v":"EAG 1"}]
[null,null,null,null,null,null,{"$f":"+Hilfstabelle!$L$5","v":"Eppendorf AG 1"},{"$f":"+Hilfstabelle!$L$6","v":"Energie Sportvereinigung 2"},{"$f":"+Hilfstabelle!$L$7","v":"AXA 1"},{"$f":"+Hilfstabelle!$L$8","v":"ERGO Sports 3"},{"$f":"+Hilfstabelle!$L$9","v":"Dataport 2"},{"$f":"+Hilfstabelle!$L$10","v":"Panasonic 1"},{"$f":"+Hilfstabelle!$L$11","v":"Generali 3"},{"$f":"+Hilfstabelle!$L$12","v":"Finanzamt 3"},{"$f":"+Hilfstabelle!$L$13","v":"HASPA 5"},{"$f":"+Hilfstabelle!$L$14","v":"BWVL 5"},{"$f":"+Hilfstabelle!$L$15","v":"Eppendorf AG 1"}]
[null,null,null,null,"Platz",null,{"$f":"HLOOKUP(G173,Hilfstabelle!$AA$5:$AK$6,2,0)","v":"6."},{"$f":"HLOOKUP(H173,Hilfstabelle!$AA$5:$AK$6,2,0)","v":"10."},{"$f":"HLOOKUP(I173,Hilfstabelle!$AA$5:$AK$6,2,0)","v":"2."},{"$f":"HLOOKUP(J173,Hilfstabelle!$AA$5:$AK$6,2,0)","v":"9."},{"$f":"HLOOKUP(K173,Hilfstabelle!$AA$5:$AK$6,2,0)","v":"3."},{"$f":"HLOOKUP(L173,Hilfstabelle!$AA$5:$AK$6,2,0)","v":"1."},{"$f":"HLOOKUP(M173,Hilfstabelle!$AA$5:$AK$6,2,0)","v":"7."},{"$f":"HLOOKUP(N173,Hilfstabelle!$AA$5:$AK$6,2,0)","v":"8."},{"$f":"HLOOKUP(O173,Hilfstabelle!$AA$5:$AK$6,2,0)","v":"4."},{"$f":"HLOOKUP(P173,Hilfstabelle!$AA$5:$AK$6,2,0)","v":"5."},{"$f":"HLOOKUP(Q173,Hilfstabelle!$AA$5:$AK$6,2,0)","v":"6."}]
[null,null,null,null,1]
[null,null,null,null,2]
[null,null,null,null,"1 + 2",null,{"$f":"+G176+G175","v":0},0,0,0,0,0,0,0,0,0,{"$f":"+Q176+Q175","v":0}]
[null,null,null,null,3]
[null,null,null,null,"Pins\nGesamt",null,{"$f":"+G178+G177","v":0},0,0,0,0,0,0,0,0,0,0]
[null,null,null,null,"Punkte\nAntritt",null,{"$f":"IF(G185=\"1\",+G184+0.5,+G184)","v":0.5},{"$f":"IF(H185=\"1\",+H184+0.5,+H184)","v":0.5},0.5,0.5,0.5,0.5,0.5,0.5,0.5,0.5,0.5]
[null,null,null,null,"Punkte\nA L T",null,{"$f":"+G159","v":" "}," "," "," "," "," "," "," "," "," "," "]
[null,null,null,null,"Punkte\nN E U",null,{"$f":"IF(G175>0,+G181+G180,\" \")","v":" "},{"$f":"IF(H175>0,+H181+H180,\" \")","v":" "}," "," "," "," "," "," "," "," "," "]
[null,null,null,null,"Gesamt Pins",null,{"$f":"+G179+G160","v":8859},7877,9487,8054,9425,9634,8772,8223,9100,8727,541]
[null,null,null,null,null,null,{"$f":"IF(G175>0,RANK(G179,$G$179:$P$179,10),\"0\")","v":"0"},"0","0","0","0","0","0","0","0","0","0"]
[null,null,null,null,null,null,{"$f":"IF(COUNTIF($G$184:$P$184,G184)>1,\"1\",\"\")","v":"1"},"1","1","1","1","1","1","1","1","1","1"]
[null,null,null,null,"Anhang zum Spielbericht  B O W L I N G"]
[null,null,null,null,null,null,null,null,null,null,null,null,null,null,null,null,"Punktspielserie"]
[null,null,null,null,"alle Felder sind unbedingt auszufüllen und mit dem Original-Spielbericht einzusenden."]
[]
[null,null,null,null,null,null,"Klasse:",{"$f":"+Hilfstabelle!$G$5","v":"B2"},null,"Antritt-Nr. :",9,"Datum :",{"$f":"VLOOKUP(K190,Hilfstabelle!$I$5:$J$18,2,0)","v":"2026-02-10"},"Halle :",{"$f":"VLOOKUP(K190,Hilfstabelle!$I$5:$L$18,3,0)","v":"Othmarschen"}]
[]
[null,null,null,null,null,null,"Ausrichter BSG:",null,{"$f":"+VLOOKUP(K190,Hilfstabelle!$I$5:$L$18,4,0)&\"\"","v":"HASPA 5"},null,null,"Mannschaftsführer: Michael Wetzel      -     Telefon: 0172/412 45 69"]
[null,null,null,null,null,null,"Bahn:","Bahn:","Bahn:","Bahn:","Bahn:","Bahn:","Bahn:","Bahn:","Bahn:","Bahn:","Bahn:"]
[null,null,null,null,"Durch-\ngänge",null,"BSG","BSG","BSG","BSG","BSG","BSG","BSG","BSG","BSG","BSG","BSG"]
[null,null,null,null,null,null,{"$f":"VLOOKUP(G196,Hilfstabelle!$L$5:$M$16,2,0)","v":"EAG 1"},{"$f":"VLOOKUP(H196,Hilfstabelle!$L$5:$M$16,2,0)","v":"ESV 2"},{"$f":"VLOOKUP(I196,Hilfstabelle!$L$5:$M$16,2,0)","v":"AXA 1"},{"$f":"VLOOKUP(J196,Hilfstabelle!$L$5:$M$16,2,0)","v":"ERG 3"},{"$f":"VLOOKUP(K196,Hilfstabelle!$L$5:$M$16,2,0)","v":"DAT 2"},{"$f":"VLOOKUP(L196,Hilfstabelle!$L$5:$M$16,2,0)","v":"PAN 1"},{"$f":"VLOOKUP(M196,Hilfstabelle!$L$5:$M$16,2,0)","v":"GEN 3"},{"$f":"VLOOKUP(N196,Hilfstabelle!$L$5:$M$16,2,0)","v":"FAH 3"},{"$f":"VLOOKUP(O196,Hilfstabelle!$L$5:$M$16,2,0)","v":"HAS 5"},{"$f":"VLOOKUP(P196,Hilfstabelle!$L$5:$M$16,2,0)","v":"BWV 5"},{"$f":"VLOOKUP(Q196,Hilfstabelle!$L$5:$M$16,2,0)","v":"EAG 1"}]
[null,null,null,null,null,null,{"$f":"+Hilfstabelle!$L$5","v":"Eppendorf AG 1"},{"$f":"+Hilfstabelle!$L$6","v":"Energie Sportvereinigung 2"},{"$f":"+Hilfstabelle!$L$7","v":"AXA 1"},{"$f":"+Hilfstabelle!$L$8","v":"ERGO Sports 3"},{"$f":"+Hilfstabelle!$L$9","v":"Dataport 2"},{"$f":"+Hilfstabelle!$L$10","v":"Panasonic 1"},{"$f":"+Hilfstabelle!$L$11","v":"Generali 3"},{"$f":"+Hilfstabelle!$L$12","v":"Finanzamt 3"},{"$f":"+Hilfstabelle!$L$13","v":"HASPA 5"},{"$f":"+Hilfstabelle!$L$14","v":"BWVL 5"},{"$f":"+Hilfstabelle!$L$15","v":"Eppendorf AG 1"}]
[null,null,null,null,"Platz",null,{"$f":"HLOOKUP(G196,Hilfstabelle!$AA$5:$AK$6,2,0)","v":"6."},{"$f":"HLOOKUP(H196,Hilfstabelle!$AA$5:$AK$6,2,0)","v":"10."},{"$f":"HLOOKUP(I196,Hilfstabelle!$AA$5:$AK$6,2,0)","v":"2."},{"$f":"HLOOKUP(J196,Hilfstabelle!$AA$5:$AK$6,2,0)","v":"9."},{"$f":"HLOOKUP(K196,Hilfstabelle!$AA$5:$AK$6,2,0)","v":"3."},{"$f":"HLOOKUP(L196,Hilfstabelle!$AA$5:$AK$6,2,0)","v":"1."},{"$f":"HLOOKUP(M196,Hilfstabelle!$AA$5:$AK$6,2,0)","v":"7."},{"$f":"HLOOKUP(N196,Hilfstabelle!$AA$5:$AK$6,2,0)","v":"8."},{"$f":"HLOOKUP(O196,Hilfstabelle!$AA$5:$AK$6,2,0)","v":"4."},{"$f":"HLOOKUP(P196,Hilfstabelle!$AA$5:$AK$6,2,0)","v":"5."},{"$f":"HLOOKUP(Q196,Hilfstabelle!$AA$5:$AK$6,2,0)","v":"6."}]
[null,null,null,null,1]
[null,null,null,null,2]
[null,null,null,null,"1 + 2",null,{"$f":"+G199+G198","v":0},0,0,0,0,0,0,0,0,0,{"$f":"+Q199+Q198","v":0}]
[null,null,null,null,3]
[null,null,null,null,"Pins\nGesamt",null,{"$f":"+G201+G200","v":0},0,0,0,0,0,0,0,0,0,0]
[null,null,null,null,"Punkte\nAntritt",null,{"$f":"IF(G208=\"1\",+G207+0.5,+G207)","v":0.5},{"$f":"IF(H208=\"1\",+H207+0.5,+H207)","v":0.5},0.5,0.5,0.5,0.5,0.5,0.5,0.5,0.5,0.5]
[null,null,null,null,"Punkte\nA L T",null,{"$f":"+G182","v":" "}," "," "," "," "," "," "," "," "," "," "]
[null,null,null,null,"Punkte\nN E U",null,{"$f":"IF(G198>0,+G204+G203,\" \")","v":" "},{"$f":"IF(H198>0,+H204+H203,\" \")","v":" "}," "," "," "," "," "," "," "," "," "]
[null,null,null,null,"Gesamt Pins",null,{"$f":"+G202+G183","v":8859},7877,9487,8054,9425,9634,8772,8223,9100,8727,541]
[null,null,null,null,null,null,{"$f":"IF(G198>0,RANK(G202,$G$202:$P$202,10),\"0\")","v":"0"},"0","0","0","0","0","0","0","0","0","0"]
[null,null,null,null,null,null,{"$f":"IF(COUNTIF($G$207:$P$207,G207)>1,\"1\",\"\")","v":"1"},"1","1","1","1","1","1","1","1","1","1"]
[null,null,null,null,"Anhang zum Spielbericht  B O W L I N G"]
[null,null,null,null,null,null,null,null,null,null,null,null,null,null,null,null,"Punktspielserie"]
[null,null,null,null,"alle Felder sind unbedingt auszufüllen und mit dem Original-Spielbericht einzusenden."]
[]
[null,null,null,null,null,null,"Klasse:",{"$f":"+Hilfstabelle!$G$5","v":"B2"},null,"Antritt-Nr. :",10,"Datum :",{"$f":"VLOOKUP(K213,Hilfstabelle!$I$5:$J$18,2,0)","v":"2026-02-24"},"Halle :",{"$f":"VLOOKUP(K213,Hilfstabelle!$I$5:$L$18,3,0)","v":"Wandsbek"}]
[]
[null,null,null,null,null,null,"Ausrichter BSG:",null,{"$f":"+VLOOKUP(K213,Hilfstabelle!$I$5:$L$18,4,0)&\"\"","v":"BWVL 5"},null,null,"Mannschaftsführer: Michael Wetzel      -     Telefon: 0172/412 45 69"]
[null,null,null,null,null,null,"Bahn:","Bahn:","Bahn:","Bahn:","Bahn:","Bahn:","Bahn:","Bahn:","Bahn:","Bahn:","Bahn:"]
[null,null,null,null,"Durch-\ngänge",null,"BSG","BSG","BSG","BSG","BSG","BSG","BSG","BSG","BSG","BSG","BSG"]
[null,null,null,null,null,null,{"$f":"VLOOKUP(G219,Hilfstabelle!$L$5:$M$16,2,0)","v":"EAG 1"},{"$f":"VLOOKUP(H219,Hilfstabelle!$L$5:$M$16,2,0)","v":"ESV 2"},{"$f":"VLOOKUP(I219,Hilfstabelle!$L$5:$M$16,2,0)","v":"AXA 1"},{"$f":"VLOOKUP(J219,Hilfstabelle!$L$5:$M$16,2,0)","v":"ERG 3"},{"$f":"VLOOKUP(K219,Hilfstabelle!$L$5:$M$16,2,0)","v":"DAT 2"},{"$f":"VLOOKUP(L219,Hilfstabelle!$L$5:$M$16,2,0)","v":"PAN 1"},{"$f":"VLOOKUP(M219,Hilfstabelle!$L$5:$M$16,2,0)","v":"GEN 3"},{"$f":"VLOOKUP(N219,Hilfstabelle!$L$5:$M$16,2,0)","v":"FAH 3"},{"$f":"VLOOKUP(O219,Hilfstabelle!$L$5:$M$16,2,0)","v":"HAS 5"},{"$f":"VLOOKUP(P219,Hilfstabelle!$L$5:$M$16,2,0)","v":"BWV 5"},{"$f":"VLOOKUP(Q219,Hilfstabelle!$L$5:$M$16,2,0)","v":"EAG 1"}]
[null,null,null,null,null,null,{"$f":"+Hilfstabelle!$L$5","v":"Eppendorf AG 1"},{"$f":"+Hilfstabelle!$L$6","v":"Energie Sportvereinigung 2"},{"$f":"+Hilfstabelle!$L$7","v":"AXA 1"},{"$f":"+Hilfstabelle!$L$8","v":"ERGO Sports 3"},{"$f":"+Hilfstabelle!$L$9","v":"Dataport 2"},{"$f":"+Hilfstabelle!$L$10","v":"Panasonic 1"},{"$f":"+Hilfstabelle!$L$11","v":"Generali 3"},{"$f":"+Hilfstabelle!$L$12","v":"Finanzamt 3"},{"$f":"+Hilfstabelle!$L$13","v":"HASPA 5"},{"$f":"+Hilfstabelle!$L$14","v":"BWVL 5"},{"$f":"+Hilfstabelle!$L$15","v":"Eppendorf AG 1"}]
[null,null,null,null,"Platz",null,{"$f":"HLOOKUP(G219,Hilfstabelle!$AA$5:$AK$6,2,0)","v":"6."},{"$f":"HLOOKUP(H219,Hilfstabelle!$AA$5:$AK$6,2,0)","v":"10."},{"$f":"HLOOKUP(I219,Hilfstabelle!$AA$5:$AK$6,2,0)","v":"2."},{"$f":"HLOOKUP(J219,Hilfstabelle!$AA$5:$AK$6,2,0)","v":"9."},{"$f":"HLOOKUP(K219,Hilfstabelle!$AA$5:$AK$6,2,0)","v":"3."},{"$f":"HLOOKUP(L219,Hilfstabelle!$AA$5:$AK$6,2,0)","v":"1."},{"$f":"HLOOKUP(M219,Hilfstabelle!$AA$5:$AK$6,2,0)","v":"7."},{"$f":"HLOOKUP(N219,Hilfstabelle!$AA$5:$AK$6,2,0)","v":"8."},{"$f":"HLOOKUP(O219,Hilfstabelle!$AA$5:$AK$6,2,0)","v":"4."},{"$f":"HLOOKUP(P219,Hilfstabelle!$AA$5:$AK$6,2,0)","v":"5."},{"$f":"HLOOKUP(Q219,Hilfstabelle!$AA$5:$AK$6,2,0)","v":"6."}]
[null,null,null,null,1]
[null,null,null,null,2]
[null,null,null,null,"1 + 2",null,{"$f":"+G222+G221","v":0},0,0,0,0,0,0,0,0,0,{"$f":"+Q222+Q221","v":0}]
[null,null,null,null,3]
[null,null,null,null,"Pins\nGesamt",null,{"$f":"+G224+G223","v":0},0,0,0,0,0,0,0,0,0,0]
[null,null,null,null,"Punkte\nAntritt",null,{"$f":"IF(G231=\"1\",+G230+0.5,+G230)","v":0.5},{"$f":"IF(H231=\"1\",+H230+0.5,+H230)","v":0.5},0.5,0.5,0.5,0.5,0.5,0.5,0.5,0.5,0.5]
[null,null,null,null,"Punkte\nA L T",null,{"$f":"+G205","v":" "}," "," "," "," "," "," "," "," "," "," "]
[null,null,null,null,"Punkte\nN E U",null,{"$f":"IF(G221>0,+G227+G226,\" \")","v":" "},{"$f":"IF(H221>0,+H227+H226,\" \")","v":" "}," "," "," "," "," "," "," "," "," "]
[null,null,null,null,"Gesamt Pins",null,{"$f":"+G225+G206","v":8859},7877,9487,8054,9425,9634,8772,8223,9100,8727,541]
[null,null,null,null,null,null,{"$f":"IF(G221>0,RANK(G225,$G$225:$P$225,10),\"0\")","v":"0"},"0","0","0","0","0","0","0","0","0","0"]
[null,null,null,null,null,null,{"$f":"IF(COUNTIF($G$230:$P$230,G230)>1,\"1\",\"\")","v":"1"},"1","1","1","1","1","1","1","1","1","1"]
[null,null,null,null,"Anhang zum Spielbericht  B O W L I N G"]
[null,null,null,null,null,null,null,null,null,null,null,null,null,null,null,null,"Punktspielserie"]
[null,null,null,null,"alle Felder sind unbedingt auszufüllen und mit dem Original-Spielbericht einzusenden."]
[]
[null,null,null,null,null,null,"Klasse:",{"$f":"+Hilfstabelle!$G$5","v":"B2"},null,"Antritt-Nr. :",11,"Datum :",{"$f":"VLOOKUP(K236,Hilfstabelle!$I$5:$J$18,2,0)","v":"2026-03-10"},"Halle :",{"$f":"VLOOKUP(K236,Hilfstabelle!$I$5:$L$18,3,0)","v":"Othmarschen"}]
[]
[null,null,null,null,null,null,"Ausrichter BSG:",null,{"$f":"+VLOOKUP(K236,Hilfstabelle!$I$5:$L$18,4,0)&\"\"","v":"Eppendorf AG 1"},null,null,"Mannschaftsführer: Michael Wetzel      -     Telefon: 0172/412 45 69"]
[null,null,null,null,null,null,"Bahn:","Bahn:","Bahn:","Bahn:","Bahn:","Bahn:","Bahn:","Bahn:","Bahn:","Bahn:","Bahn:"]
[null,null,null,null,"Durch-\ngänge",null,"BSG","BSG","BSG","BSG","BSG","BSG","BSG","BSG","BSG","BSG","BSG"]
[null,null,null,null,null,null,{"$f":"VLOOKUP(G242,Hilfstabelle!$L$5:$M$16,2,0)","v":"EAG 1"},{"$f":"VLOOKUP(H242,Hilfstabelle!$L$5:$M$16,2,0)","v":"ESV 2"},{"$f":"VLOOKUP(I242,Hilfstabelle!$L$5:$M$16,2,0)","v":"AXA 1"},{"$f":"VLOOKUP(J242,Hilfstabelle!$L$5:$M$16,2,0)","v":"ERG 3"},{"$f":"VLOOKUP(K242,Hilfstabelle!$L$5:$M$16,2,0)","v":"DAT 2"},{"$f":"VLOOKUP(L242,Hilfstabelle!$L$5:$M$16,2,0)","v":"PAN 1"},{"$f":"VLOOKUP(M242,Hilfstabelle!$L$5:$M$16,2,0)","v":"GEN 3"},{"$f":"VLOOKUP(N242,Hilfstabelle!$L$5:$M$16,2,0)","v":"FAH 3"},{"$f":"VLOOKUP(O242,Hilfstabelle!$L$5:$M$16,2,0)","v":"HAS 5"},{"$f":"VLOOKUP(P242,Hilfstabelle!$L$5:$M$16,2,0)","v":"BWV 5"},{"$f":"VLOOKUP(Q242,Hilfstabelle!$L$5:$M$16,2,0)","v":"EAG 1"}]
[null,null,null,null,null,null,{"$f":"+Hilfstabelle!$L$5","v":"Eppendorf AG 1"},{"$f":"+Hilfstabelle!$L$6","v":"Energie Sportvereinigung 2"},{"$f":"+Hilfstabelle!$L$7","v":"AXA 1"},{"$f":"+Hilfstabelle!$L$8","v":"ERGO Sports 3"},{"$f":"+Hilfstabelle!$L$9","v":"Dataport 2"},{"$f":"+Hilfstabelle!$L$10","v":"Panasonic 1"},{"$f":"+Hilfstabelle!$L$11","v":"Generali 3"},{"$f":"+Hilfstabelle!$L$12","v":"Finanzamt 3"},{"$f":"+Hilfstabelle!$L$13","v":"HASPA 5"},{"$f":"+Hilfstabelle!$L$14","v":"BWVL 5"},{"$f":"+Hilfstabelle!$L$15","v":"Eppendorf AG 1"}]
[null,null,null,null,"Platz",null,{"$f":"HLOOKUP(G242,Hilfstabelle!$AA$5:$AK$6,2,0)","v":"6."},{"$f":"HLOOKUP(H242,Hilfstabelle!$AA$5:$AK$6,2,0)","v":"10."},{"$f":"HLOOKUP(I242,Hilfstabelle!$AA$5:$AK$6,2,0)","v":"2."},{"$f":"HLOOKUP(J242,Hilfstabelle!$AA$5:$AK$6,2,0)","v":"9."},{"$f":"HLOOKUP(K242,Hilfstabelle!$AA$5:$AK$6,2,0)","v":"3."},{"$f":"HLOOKUP(L242,Hilfstabelle!$AA$5:$AK$6,2,0)","v":"1."},{"$f":"HLOOKUP(M242,Hilfstabelle!$AA$5:$AK$6,2,0)","v":"7."},{"$f":"HLOOKUP(N242,Hilfstabelle!$AA$5:$AK$6,2,0)","v":"8."},{"$f":"HLOOKUP(O242,Hilfstabelle!$AA$5:$AK$6,2,0)","v":"4."},{"$f":"HLOOKUP(P242,Hilfstabelle!$AA$5:$AK$6,2,0)","v":"5."},{"$f":"HLOOKUP(Q242,Hilfstabelle!$AA$5:$AK$6,2,0)","v":"6."}]
[null,null,null,null,1]
[null,null,null,null,2]
[null,null,null,null,"1 + 2",null,{"$f":"+G245+G244","v":0},0,0,0,0,0,0,0,0,0,{"$f":"+Q245+Q244","v":0}]
[null,null,null,null,3]
[null,null,null,null,"Pins\nGesamt",null,{"$f":"+G247+G246","v":0},0,0,0,0,0,0,0,0,0,0]
[null,null,null,null,"Punkte\nAntritt",null,{"$f":"IF(G254=\"1\",+G253+0.5,+G253)","v":0.5},{"$f":"IF(H254=\"1\",+H253+0.5,+H253)","v":0.5},0.5,0.5,0.5,0.5,0.5,0.5,0.5,0.5,0.5]
[null,null,null,null,"Punkte\nA L T",null,{"$f":"+G228","v":" "}," "," "," "," "," "," "," "," "," "," "]
[null,null,null,null,"Punkte\nN E U",null,{"$f":"IF(G244>0,+G250+G249,\" \")","v":" "},{"$f":"IF(H244>0,+H250+H249,\" \")","v":" "}," "," "," "," "," "," "," "," "," "]
[null,null,null,null,"Gesamt Pins",null,{"$f":"+G248+G229","v":8859},7877,9487,8054,9425,9634,8772,8223,9100,8727,541]
[null,null,null,null,null,null,{"$f":"IF(G244>0,RANK(G248,$G$248:$P$248,10),\"0\")","v":"0"},"0","0","0","0","0","0","0","0","0","0"]
[null,null,null,null,null,null,{"$f":"IF(COUNTIF($G$253:$P$253,G253)>1,\"1\",\"\")","v":"1"},"1","1","1","1","1","1","1","1","1","1"]
[null,null,null,null,"Anhang zum Spielbericht  B O W L I N G"]
[null,null,null,null,null,null,null,null,null,null,null,null,null,null,null,null,"Punktspielserie"]
[null,null,null,null,"alle Felder sind unbedingt auszufüllen und mit dem Original-Spielbericht einzusenden."]
[]
[null,null,null,null,null,null,"Klasse:",{"$f":"+Hilfstabelle!$G$5","v":"B2"},null,"Antritt-Nr. :",12,"Datum :",{"$f":"VLOOKUP(K259,Hilfstabelle!$I$5:$J$18,2,0)","v":"2026-03-24"},"Halle :",{"$f":"VLOOKUP(K259,Hilfstabelle!$I$5:$L$18,3,0)","v":"Wandsbek"}]
[]
[null,null,null,null,null,null,"Ausrichter BSG:",null,{"$f":"+VLOOKUP(K259,Hilfstabelle!$I$5:$L$18,4,0)&\"\"","v":"Energie Sportvereinigung 2"},null,null,"Mannschaftsführer: Michael Wetzel      -     Telefon: 0172/412 45 69"]
[null,null,null,null,null,null,"Bahn:","Bahn:","Bahn:","Bahn:","Bahn:","Bahn:","Bahn:","Bahn:","Bahn:","Bahn:","Bahn:"]
[null,null,null,null,"Durch-\ngänge",null,"BSG","BSG","BSG","BSG","BSG","BSG","BSG","BSG","BSG","BSG","BSG"]
[null,null,null,null,null,null,{"$f":"VLOOKUP(G265,Hilfstabelle!$L$5:$M$16,2,0)","v":"EAG 1"},{"$f":"VLOOKUP(H265,Hilfstabelle!$L$5:$M$16,2,0)","v":"ESV 2"},{"$f":"VLOOKUP(I265,Hilfstabelle!$L$5:$M$16,2,0)","v":"AXA 1"},{"$f":"VLOOKUP(J265,Hilfstabelle!$L$5:$M$16,2,0)","v":"ERG 3"},{"$f":"VLOOKUP(K265,Hilfstabelle!$L$5:$M$16,2,0)","v":"DAT 2"},{"$f":"VLOOKUP(L265,Hilfstabelle!$L$5:$M$16,2,0)","v":"PAN 1"},{"$f":"VLOOKUP(M265,Hilfstabelle!$L$5:$M$16,2,0)","v":"GEN 3"},{"$f":"VLOOKUP(N265,Hilfstabelle!$L$5:$M$16,2,0)","v":"FAH 3"},{"$f":"VLOOKUP(O265,Hilfstabelle!$L$5:$M$16,2,0)","v":"HAS 5"},{"$f":"VLOOKUP(P265,Hilfstabelle!$L$5:$M$16,2,0)","v":"BWV 5"},{"$f":"VLOOKUP(Q265,Hilfstabelle!$L$5:$M$16,2,0)","v":"EAG 1"}]
[null,null,null,null,null,null,{"$f":"+Hilfstabelle!$L$5","v":"Eppendorf AG 1"},{"$f":"+Hilfstabelle!$L$6","v":"Energie Sportvereinigung 2"},{"$f":"+Hilfstabelle!$L$7","v":"AXA 1"},{"$f":"+Hilfstabelle!$L$8","v":"ERGO Sports 3"},{"$f":"+Hilfstabelle!$L$9","v":"Dataport 2"},{"$f":"+Hilfstabelle!$L$10","v":"Panasonic 1"},{"$f":"+Hilfstabelle!$L$11","v":"Generali 3"},{"$f":"+Hilfstabelle!$L$12","v":"Finanzamt 3"},{"$f":"+Hilfstabelle!$L$13","v":"HASPA 5"},{"$f":"+Hilfstabelle!$L$14","v":"BWVL 5"},{"$f":"+Hilfstabelle!$L$15","v":"Eppendorf AG 1"}]
[null,null,null,null,"Platz",null,{"$f":"HLOOKUP(G265,Hilfstabelle!$AA$5:$AK$6,2,0)","v":"6."},{"$f":"HLOOKUP(H265,Hilfstabelle!$AA$5:$AK$6,2,0)","v":"10."},{"$f":"HLOOKUP(I265,Hilfstabelle!$AA$5:$AK$6,2,0)","v":"2."},{"$f":"HLOOKUP(J265,Hilfstabelle!$AA$5:$AK$6,2,0)","v":"9."},{"$f":"HLOOKUP(K265,Hilfstabelle!$AA$5:$AK$6,2,0)","v":"3."},{"$f":"HLOOKUP(L265,Hilfstabelle!$AA$5:$AK$6,2,0)","v":"1."},{"$f":"HLOOKUP(M265,Hilfstabelle!$AA$5:$AK$6,2,0)","v":"7."},{"$f":"HLOOKUP(N265,Hilfstabelle!$AA$5:$AK$6,2,0)","v":"8."},{"$f":"HLOOKUP(O265,Hilfstabelle!$AA$5:$AK$6,2,0)","v":"4."},{"$f":"HLOOKUP(P265,Hilfstabelle!$AA$5:$AK$6,2,0)","v":"5."},{"$f":"HLOOKUP(Q265,Hilfstabelle!$AA$5:$AK$6,2,0)","v":"6."}]
[null,null,null,null,1]
[null,null,null,null,2]
[null,null,null,null,"1 + 2",null,{"$f":"+G268+G267","v":0},0,0,0,0,0,0,0,0,0,{"$f":"+Q268+Q267","v":0}]
[null,null,null,null,3]
[null,null,null,null,"Pins\nGesamt",null,{"$f":"+G270+G269","v":0},0,0,0,0,0,0,0,0,0,0]
[null,null,null,null,"Punkte\nAntritt",null,{"$f":"IF(G277=\"1\",+G276+0.5,+G276)","v":0.5},{"$f":"IF(H277=\"1\",+H276+0.5,+H276)","v":0.5},0.5,0.5,0.5,0.5,0.5,0.5,0.5,0.5,0.5]
[null,null,null,null,"Punkte\nA L T",null,{"$f":"+G251","v":" "}," "," "," "," "," "," "," "," "," "," "]
[null,null,null,null,"Punkte\nN E U",null,{"$f":"IF(G267>0,+G273+G272,\" \")","v":" "},{"$f":"IF(H267>0,+H273+H272,\" \")","v":" "}," "," "," "," "," "," "," "," "," "]
[null,null,null,null,"Gesamt Pins",null,{"$f":"+G271+G252","v":8859},7877,9487,8054,9425,9634,8772,8223,9100,8727,541]
[null,null,null,null,null,null,{"$f":"IF(G267>0,RANK(G271,$G$271:$P$271,10),\"0\")","v":"0"},"0","0","0","0","0","0","0","0","0","0"]
[null,null,null,null,null,null,{"$f":"IF(COUNTIF($G$276:$P$276,G276)>1,\"1\",\"\")","v":"1"},"1","1","1","1","1","1","1","1","1","1"]
[null,null,null,null,"Anhang zum Spielbericht  B O W L I N G"]
[null,null,null,null,null,null,null,null,null,null,null,null,null,null,null,null,"Punktspielserie"]
[null,null,null,null,"alle Felder sind unbedingt auszufüllen und mit dem Original-Spielbericht einzusenden."]
[]
[null,null,null,null,null,null,"Klasse:",{"$f":"+Hilfstabelle!$G$5","v":"B2"},null,"Antritt-Nr. :",13,"Datum :",{"$f":"VLOOKUP(K282,Hilfstabelle!$I$5:$J$18,2,0)","v":"2026-04-07"},"Halle :",{"$f":"VLOOKUP(K282,Hilfstabelle!$I$5:$L$18,3,0)","v":"Othmarschen"}]
[]
[null,null,null,null,null,null,"Ausrichter BSG:",null,{"$f":"+VLOOKUP(K282,Hilfstabelle!$I$5:$L$18,4,0)&\"\"","v":"AXA 1"},null,null,"Mannschaftsführer: Michael Wetzel      -     Telefon: 0172/412 45 69"]
[null,null,null,null,null,null,"Bahn:","Bahn:","Bahn:","Bahn:","Bahn:","Bahn:","Bahn:","Bahn:","Bahn:","Bahn:","Bahn:"]
[null,null,null,null,"Durch-\ngänge",null,"BSG","BSG","BSG","BSG","BSG","BSG","BSG","BSG","BSG","BSG","BSG"]
[null,null,null,null,null,null,{"$f":"VLOOKUP(G288,Hilfstabelle!$L$5:$M$16,2,0)","v":"EAG 1"},{"$f":"VLOOKUP(H288,Hilfstabelle!$L$5:$M$16,2,0)","v":"ESV 2"},{"$f":"VLOOKUP(I288,Hilfstabelle!$L$5:$M$16,2,0)","v":"AXA 1"},{"$f":"VLOOKUP(J288,Hilfstabelle!$L$5:$M$16,2,0)","v":"ERG 3"},{"$f":"VLOOKUP(K288,Hilfstabelle!$L$5:$M$16,2,0)","v":"DAT 2"},{"$f":"VLOOKUP(L288,Hilfstabelle!$L$5:$M$16,2,0)","v":"PAN 1"},{"$f":"VLOOKUP(M288,Hilfstabelle!$L$5:$M$16,2,0)","v":"GEN 3"},{"$f":"VLOOKUP(N288,Hilfstabelle!$L$5:$M$16,2,0)","v":"FAH 3"},{"$f":"VLOOKUP(O288,Hilfstabelle!$L$5:$M$16,2,0)","v":"HAS 5"},{"$f":"VLOOKUP(P288,Hilfstabelle!$L$5:$M$16,2,0)","v":"BWV 5"},{"$f":"VLOOKUP(Q288,Hilfstabelle!$L$5:$M$16,2,0)","v":"EAG 1"}]
[null,null,null,null,null,null,{"$f":"+Hilfstabelle!$L$5","v":"Eppendorf AG 1"},{"$f":"+Hilfstabelle!$L$6","v":"Energie Sportvereinigung 2"},{"$f":"+Hilfstabelle!$L$7","v":"AXA 1"},{"$f":"+Hilfstabelle!$L$8","v":"ERGO Sports 3"},{"$f":"+Hilfstabelle!$L$9","v":"Dataport 2"},{"$f":"+Hilfstabelle!$L$10","v":"Panasonic 1"},{"$f":"+Hilfstabelle!$L$11","v":"Generali 3"},{"$f":"+Hilfstabelle!$L$12","v":"Finanzamt 3"},{"$f":"+Hilfstabelle!$L$13","v":"HASPA 5"},{"$f":"+Hilfstabelle!$L$14","v":"BWVL 5"},{"$f":"+Hilfstabelle!$L$15","v":"Eppendorf AG 1"}]
[null,null,null,null,"Platz",null,{"$f":"HLOOKUP(G288,Hilfstabelle!$AA$5:$AK$6,2,0)","v":"6."},{"$f":"HLOOKUP(H288,Hilfstabelle!$AA$5:$AK$6,2,0)","v":"10."},{"$f":"HLOOKUP(I288,Hilfstabelle!$AA$5:$AK$6,2,0)","v":"2."},{"$f":"HLOOKUP(J288,Hilfstabelle!$AA$5:$AK$6,2,0)","v":"9."},{"$f":"HLOOKUP(K288,Hilfstabelle!$AA$5:$AK$6,2,0)","v":"3."},{"$f":"HLOOKUP(L288,Hilfstabelle!$AA$5:$AK$6,2,0)","v":"1."},{"$f":"HLOOKUP(M288,Hilfstabelle!$AA$5:$AK$6,2,0)","v":"7."},{"$f":"HLOOKUP(N288,Hilfstabelle!$AA$5:$AK$6,2,0)","v":"8."},{"$f":"HLOOKUP(O288,Hilfstabelle!$AA$5:$AK$6,2,0)","v":"4."},{"$f":"HLOOKUP(P288,Hilfstabelle!$AA$5:$AK$6,2,0)","v":"5."},{"$f":"HLOOKUP(Q288,Hilfstabelle!$AA$5:$AK$6,2,0)","v":"6."}]
[null,null,null,null,1]
[null,null,null,null,2]
[null,null,null,null,"1 + 2",null,{"$f":"+G291+G290","v":0},0,0,0,0,0,0,0,0,0,{"$f":"+Q291+Q290","v":0}]
[null,null,null,null,3]
[null,null,null,null,"Pins\nGesamt",null,{"$f":"+G293+G292","v":0},0,0,0,0,0,0,0,0,0,0]
[null,null,null,null,"Punkte\nAntritt",null,{"$f":"IF(G300=\"1\",+G299+0.5,+G299)","v":0.5},{"$f":"IF(H300=\"1\",+H299+0.5,+H299)","v":0.5},0.5,0.5,0.5,0.5,0.5,0.5,0.5,0.5,0.5]
[null,null,null,null,"Punkte\nA L T",null,{"$f":"+G274","v":" "}," "," "," "," "," "," "," "," "," "," "]
[null,null,null,null,"Punkte\nN E U",null,{"$f":"IF(G290>0,+G296+G295,\" \")","v":" "},{"$f":"IF(H290>0,+H296+H295,\" \")","v":" "}," "," "," "," "," "," "," "," "," "]
[null,null,null,null,"Gesamt Pins",null,{"$f":"+G294+G275","v":8859},7877,9487,8054,9425,9634,8772,8223,9100,8727,541]
[null,null,null,null,null,null,{"$f":"IF(G290>0,RANK(G294,$G$294:$P$294,10),\"0\")","v":"0"},"0","0","0","0","0","0","0","0","0","0"]
[null,null,null,null,null,null,{"$f":"IF(COUNTIF($G$299:$P$299,G299)>1,\"1\",\"\")","v":"1"},"1","1","1","1","1","1","1","1","1","1"]
[null,null,null,null,"Anhang zum Spielbericht  B O W L I N G"]
[null,null,null,null,null,null,null,null,null,null,null,null,null,null,null,null,"Punktspielserie"]
[null,null,null,null,"alle Felder sind unbedingt auszufüllen und mit dem Original-Spielbericht einzusenden."]
[]
[null,null,null,null,null,null,"Klasse:",{"$f":"+Hilfstabelle!$G$5","v":"B2"},null,"Antritt-Nr. :",14,"Datum :",{"$f":"VLOOKUP(K305,Hilfstabelle!$I$5:$J$18,2,0)","v":"2026-04-21"},"Halle :",{"$f":"VLOOKUP(K305,Hilfstabelle!$I$5:$L$18,3,0)","v":"Wandsbek"}]
[]
[null,null,null,null,null,null,"Ausrichter BSG:",null,{"$f":"+VLOOKUP(K305,Hilfstabelle!$I$5:$L$18,4,0)&\"\"","v":"ERGO Sports 3"},null,null,"Mannschaftsführer: Michael Wetzel      -     Telefon: 0172/412 45 69"]
[null,null,null,null,null,null,"Bahn:","Bahn:","Bahn:","Bahn:","Bahn:","Bahn:","Bahn:","Bahn:","Bahn:","Bahn:","Bahn:"]
[null,null,null,null,"Durch-\ngänge",null,"BSG","BSG","BSG","BSG","BSG","BSG","BSG","BSG","BSG","BSG","BSG"]
[null,null,null,null,null,null,{"$f":"VLOOKUP(G311,Hilfstabelle!$L$5:$M$16,2,0)","v":"EAG 1"},{"$f":"VLOOKUP(H311,Hilfstabelle!$L$5:$M$16,2,0)","v":"ESV 2"},{"$f":"VLOOKUP(I311,Hilfstabelle!$L$5:$M$16,2,0)","v":"AXA 1"},{"$f":"VLOOKUP(J311,Hilfstabelle!$L$5:$M$16,2,0)","v":"ERG 3"},{"$f":"VLOOKUP(K311,Hilfstabelle!$L$5:$M$16,2,0)","v":"DAT 2"},{"$f":"VLOOKUP(L311,Hilfstabelle!$L$5:$M$16,2,0)","v":"PAN 1"},{"$f":"VLOOKUP(M311,Hilfstabelle!$L$5:$M$16,2,0)","v":"GEN 3"},{"$f":"VLOOKUP(N311,Hilfstabelle!$L$5:$M$16,2,0)","v":"FAH 3"},{"$f":"VLOOKUP(O311,Hilfstabelle!$L$5:$M$16,2,0)","v":"HAS 5"},{"$f":"VLOOKUP(P311,Hilfstabelle!$L$5:$M$16,2,0)","v":"BWV 5"},{"$f":"VLOOKUP(Q311,Hilfstabelle!$L$5:$M$16,2,0)","v":"EAG 1"}]
[null,null,null,null,null,null,{"$f":"+Hilfstabelle!$L$5","v":"Eppendorf AG 1"},{"$f":"+Hilfstabelle!$L$6","v":"Energie Sportvereinigung 2"},{"$f":"+Hilfstabelle!$L$7","v":"AXA 1"},{"$f":"+Hilfstabelle!$L$8","v":"ERGO Sports 3"},{"$f":"+Hilfstabelle!$L$9","v":"Dataport 2"},{"$f":"+Hilfstabelle!$L$10","v":"Panasonic 1"},{"$f":"+Hilfstabelle!$L$11","v":"Generali 3"},{"$f":"+Hilfstabelle!$L$12","v":"Finanzamt 3"},{"$f":"+Hilfstabelle!$L$13","v":"HASPA 5"},{"$f":"+Hilfstabelle!$L$14","v":"BWVL 5"},{"$f":"+Hilfstabelle!$L$15","v":"Eppendorf AG 1"}]
[null,null,null,null,"Platz",null,{"$f":"HLOOKUP(G311,Hilfstabelle!$AA$5:$AK$6,2,0)","v":"6."},{"$f":"HLOOKUP(H311,Hilfstabelle!$AA$5:$AK$6,2,0)","v":"10."},{"$f":"HLOOKUP(I311,Hilfstabelle!$AA$5:$AK$6,2,0)","v":"2."},{"$f":"HLOOKUP(J311,Hilfstabelle!$AA$5:$AK$6,2,0)","v":"9."},{"$f":"HLOOKUP(K311,Hilfstabelle!$AA$5:$AK$6,2,0)","v":"3."},{"$f":"HLOOKUP(L311,Hilfstabelle!$AA$5:$AK$6,2,0)","v":"1."},{"$f":"HLOOKUP(M311,Hilfstabelle!$AA$5:$AK$6,2,0)","v":"7."},{"$f":"HLOOKUP(N311,Hilfstabelle!$AA$5:$AK$6,2,0)","v":"8."},{"$f":"HLOOKUP(O311,Hilfstabelle!$AA$5:$AK$6,2,0)","v":"4."},{"$f":"HLOOKUP(P311,Hilfstabelle!$AA$5:$AK$6,2,0)","v":"5."},{"$f":"HLOOKUP(Q311,Hilfstabelle!$AA$5:$AK$6,2,0)","v":"6."}]
[null,null,null,null,1]
[null,null,null,null,2]
[null,null,null,null,"1 + 2",null,{"$f":"+G314+G313","v":0},0,0,0,0,0,0,0,0,0,{"$f":"+Q314+Q313","v":0}]
[null,null,null,null,3]
[null,null,null,null,"Pins\nGesamt",null,{"$f":"+G316+G315","v":0},0,0,0,0,0,0,0,0,0,0]
[null,null,null,null,"Punkte\nAntritt",null,{"$f":"IF(G323=\"1\",+G322+0.5,+G322)","v":0.5},{"$f":"IF(H323=\"1\",+H322+0.5,+H322)","v":0.5},0.5,0.5,0.5,0.5,0.5,0.5,0.5,0.5,0.5]
[null,null,null,null,"Punkte\nA L T",null,{"$f":"+G297","v":" "}," "," "," "," "," "," "," "," "," "," "]
[null,null,null,null,"Punkte\nN E U",null,{"$f":"IF(G313>0,+G319+G318,\" \")","v":" "},{"$f":"IF(H313>0,+H319+H318,\" \")","v":" "}," "," "," "," "," "," "," "," "," "]
[null,null,null,null,"Gesamt Pins",null,{"$f":"+G317+G298","v":8859},7877,9487,8054,9425,9634,8772,8223,9100,8727,541]
[null,null,null,null,null,null,{"$f":"IF(G313>0,RANK(G317,$G$317:$P$317,10),\"0\")","v":"0"},"0","0","0","0","0","0","0","0","0","0"]
[null,null,null,null,null,null,{"$f":"IF(COUNTIF($G$322:$P$322,G322)>1,\"1\",\"\")","v":"1"},"1","1","1","1","1","1","1","1","1","1"]

{"sheet":"Spielberichte","index":21,"n_rows":501,"n_cols":16,"rows_kept":501,"cut":false,"hidden":false,"merged":[[0,0,0,1],[1,0,1,1],[189,8,189,11],[168,8,168,11],[153,8,153,11],[132,8,132,11],[7,0,7,4],[12,0,12,4],[9,8,9,11],[24,8,24,11],[45,8,45,11],[117,8,117,11],[96,8,96,11],[60,8,60,11],[81,8,81,11],[493,8,493,11],[405,8,405,11],[384,8,384,11],[369,8,369,11],[348,8,348,11],[478,8,478,11],[441,8,441,11],[420,8,420,11],[456,8,456,11],[240,8,240,11],[225,8,225,11],[204,8,204,11],[333,8,333,11],[312,8,312,11],[297,8,297,11],[276,8,276,11],[261,8,261,11]]}
["Start"]
["Rangliste"]
[]
[null,null,null,null,null," Spielbericht BOWLING"]
[null,null,null,null,null,"Betriebssportverband Hamburg e.V.",null,null,null,null,null,null,null,null,null,"Punktspielserie"]
[null,null,null,null,null,"alle Felder sind unbedingt auszufüllen,da sonst der Spielbericht ungültig ist "]
[]
["Spielberichte drucken",null,null,null,null,"Klasse","Herren",{"$f":"+Hilfstabelle!G5","v":"B2"},"     Antritt     Nr.",1,null,"Datum",{"$f":"+Hilfstabelle!B5","v":"2025-09-09"},"BSG","PAN 1"]
[]
[null,null,null,null,null,null,"X)","Pass-Nr.","Vor-und Zuname",null,null,null,"I","II","III","Gesamt"]
[null,null,null,null,null,1,null,{"$f":"IF(I11>0,VLOOKUP(I11,Tabelle2[#Data],2,0),\"\")","v":19221},{"$f":"+Spielereinteilung!B14","v":"Jörg Frahm"},null,null,null,null,null,null,{"$f":"+O11+N11+M11","v":0}]
[null,null,null,null,null,2,null,{"$f":"IF(I12>0,VLOOKUP(I12,Tabelle2[#Data],2,0),\"\")","v":22115},{"$f":"+Spielereinteilung!B16","v":"Ilona Wetzel"},null,null,null,null,null,null,{"$f":"+O12+N12+M12","v":0}]
["Spielberichte anzeigen",null,null,null,null,3,null,{"$f":"IF(I13>0,VLOOKUP(I13,Tabelle2[#Data],2,0),\"\")","v":22113},{"$f":"+Spielereinteilung!B18","v":"Michael Wetzel"},null,null,null,null,null,null,0]
[null,null,null,null,null,4,null,{"$f":"IF(I14>0,VLOOKUP(I14,Tabelle2[#Data],2,0),\"\")","v":21889},{"$f":"+Spielereinteilung!B20","v":"Kai Roßberg"},null,null,null,null,null,null,0]
[null,null,null,null,null,5]
[null,null,null,null,null,"Bitte mit einem x) versehen",null,null,"     Unterschrift des Spiel-",null,null,null,{"$f":"SUM(M11:M15)","v":0},0,0,{"$f":"SUM(P11:P15)","v":0}]
[null,null,null,null,null,"wenn Ersatzspieler/in",null,null,"     partners"]
[]
[null,null,null,null,null," Spielbericht BOWLING"]
[null,null,null,null,null,"Betriebssportverband Hamburg e.V.",null,null,null,null,null,null,null,null,null,"Punktspielserie"]
[null,null,null,null,null,"alle Felder sind unbedingt auszufüllen,da sonst der Spielbericht ungültig ist "]
[]
[null,null,null,null,null,"Klasse","  Herren",{"$f":"+H8","v":"B2"},"     Antritt     Nr.",{"$f":"J8","v":1},null,"Datum",{"$f":"+M8","v":"2025-09-09"},"BSG",{"$f":"+O8","v":"PAN 1"}]
[]
[null,null,null,null,null,null,"X)","Pass-Nr.","Vor-und Zuname",null,null,null,"I","II","III","Gesamt"]
[null,null,null,null,null,1,{"$f":"G11","v":0},{"$f":"+H11","v":19221},"Jörg Frahm",null,null,null,null,null,null,{"$f":"+O26+N26+M26","v":0}]
[null,null,null,null,null,2,{"$f":"G12","v":0},22115,"Ilona Wetzel",null,null,null,null,null,null,{"$f":"+O27+N27+M27","v":0}]
[null,null,null,null,null,3,{"$f":"G13","v":0},22113,"Michael Wetzel",null,null,null,null,null,null,0]
[null,null,null,null,null,4,{"$f":"G14","v":0},21889,"Kai Roßberg",null,null,null,null,null,null,0]
[null,null,null,null,null,5,{"$f":"G15","v":0},0,0]
[null,null,null,null,null,"Bitte mit einem x) versehen",null,null,"     Unterschrift des Spiel-",null,null,null,null,null,null,{"$f":"+P29+P27+P26+P28","v":0}]
[null,null,null,null,null,"wenn Ersatzspieler/in",null,null,"     partners"]
[]
[]
[]
[]
[]
[]
[]
[null,null,null,null,null," Spielbericht BOWLING"]
[null,null,null,null,null,"Betriebssportverband Hamburg e.V.",null,null,null,null,null,null,null,null,null,"Punktspielserie"]
[null,null,null,null,null,"alle Felder sind unbedingt auszufüllen,da sonst der Spielbericht ungültig ist "]
[]
[null,null,null,null,null,"Klasse","Herren",{"$f":"+H8","v":"B2"},"     Antritt     Nr.",2,null,"Datum",{"$f":"+Hilfstabelle!B6","v":"2025-09-23"},"BSG","PAN 1"]
[]
[null,null,null,null,null,null,"X)","Pass-Nr.","Vor-und Zuname",null,null,null,"I","II","III","Gesamt"]
[null,null,null,null,null,1,null,{"$f":"IF(I47>0,VLOOKUP(I47,Tabelle2[#Data],2,0),\"\")","v":24774},{"$f":"+Spielereinteilung!K14","v":"Frank Nijholt"}]
[null,null,null,null,null,2,null,{"$f":"IF(I48>0,VLOOKUP(I48,Tabelle2[#Data],2,0),\"\")","v":19222},{"$f":"+Spielereinteilung!K16","v":"Annegret Schmidt"}]
[null,null,null,null,null,3,null,{"$f":"IF(I49>0,VLOOKUP(I49,Tabelle2[#Data],2,0),\"\")","v":19221},{"$f":"+Spielereinteilung!K18","v":"Jörg Frahm"}]
[null,null,null,null,null,4,null,{"$f":"IF(I50>0,VLOOKUP(I50,Tabelle2[#Data],2,0),\"\")","v":21889},{"$f":"+Spielereinteilung!K20","v":"Kai Roßberg"}]
[null,null,null,null,null,5]
[null,null,null,null,null,"Bitte mit einem x) versehen",null,null,"     Unterschrift des Spiel-"]
[null,null,null,null,null,"wenn Ersatzspieler/in",null,null,"     partners"]
[]
[null,null,null,null,null," Spielbericht BOWLING"]
[null,null,null,null,null,"Betriebssportverband Hamburg e.V.",null,null,null,null,null,null,null,null,null,"Punktspielserie"]
[null,null,null,null,null,"alle Felder sind unbedingt auszufüllen,da sonst der Spielbericht ungültig ist "]
[]
[null,null,null,null,null,"Klasse","  Herren",{"$f":"+H44","v":"B2"},"     Antritt     Nr.",{"$f":"J44","v":2},null,"Datum",{"$f":"+M44","v":"2025-09-23"},"BSG",{"$f":"+O44","v":"PAN 1"}]
[]
[null,null,null,null,null,null,"X)","Pass-Nr.","Vor-und Zuname",null,null,null,"I","II","III","Gesamt"]
[null,null,null,null,null,1,{"$f":"G47","v":0},{"$f":"+H47","v":24774},"Frank Nijholt"]
[null,null,null,null,null,2,{"$f":"G48","v":0},19222,"Annegret Schmidt"]
[null,null,null,null,null,3,{"$f":"G49","v":0},19221,"Jörg Frahm"]
[null,null,null,null,null,4,{"$f":"G50","v":0},21889,"Kai Roßberg"]
[null,null,null,null,null,5,{"$f":"G51","v":0},0,0]
[null,null,null,null,null,"Bitte mit einem x) versehen",null,null,"     Unterschrift des Spiel-"]
[null,null,null,null,null,"wenn Ersatzspieler/in",null,null,"     partners"]
[]
[]
[]
[]
[]
[]
[]
[null,null,null,null,null," Spielbericht BOWLING"]
[null,null,null,null,null,"Betriebssportverband Hamburg e.V.",null,null,null,null,null,null,null,null,null,"Punktspielserie"]
[null,null,null,null,null,"alle Felder sind unbedingt auszufüllen,da sonst der Spielbericht ungültig ist "]
[]
[null,null,null,null,null,"Klasse","Herren",{"$f":"+H44","v":"B2"},"     Antritt     Nr.",3,null,"Datum",{"$f":"+Hilfstabelle!B7","v":"2025-10-07"},"BSG","PAN 1"]
[]
[null,null,null,null,null,null,"X)","Pass-Nr.","Vor-und Zuname",null,null,null,"I","II","III","Gesamt"]
[null,null,null,null,null,1,null,{"$f":"IF(I83>0,VLOOKUP(I83,Tabelle2[#Data],2,0),\"\")","v":20137},{"$f":"+Spielereinteilung!T14","v":"Matthias Nolte"}]
[null,null,null,null,null,2,null,{"$f":"IF(I84>0,VLOOKUP(I84,Tabelle2[#Data],2,0),\"\")","v":22115},{"$f":"+Spielereinteilung!T16","v":"Ilona Wetzel"}]
[null,null,null,null,null,3,null,{"$f":"IF(I85>0,VLOOKUP(I85,Tabelle2[#Data],2,0),\"\")","v":19222},{"$f":"+Spielereinteilung!T18","v":"Annegret Schmidt"}]
[null,null,null,null,null,4,null,{"$f":"IF(I86>0,VLOOKUP(I86,Tabelle2[#Data],2,0),\"\")","v":21889},{"$f":"+Spielereinteilung!T20","v":"Kai Roßberg"}]
[null,null,null,null,null,5]
[null,null,null,null,null,"Bitte mit einem x) versehen",null,null,"     Unterschrift des Spiel-"]
[null,null,null,null,null,"wenn Ersatzspieler/in",null,null,"     partners"]
[]
[null,null,null,null,null," Spielbericht BOWLING"]
[null,null,null,null,null,"Betriebssportverband Hamburg e.V.",null,null,null,null,null,null,null,null,null,"Punktspielserie"]
[null,null,null,null,null,"alle Felder sind unbedingt auszufüllen,da sonst der Spielbericht ungültig ist "]
[]
[null,null,null,null,null,"Klasse","  Herren",{"$f":"+H80","v":"B2"},"     Antritt     Nr.",{"$f":"J80","v":3},null,"Datum",{"$f":"+M80","v":"2025-10-07"},"BSG",{"$f":"+O80","v":"PAN 1"}]
[]
[null,null,null,null,null,null,"X)","Pass-Nr.","Vor-und Zuname",null,null,null,"I","II","III","Gesamt"]
[null,null,null,null,null,1,{"$f":"G83","v":0},{"$f":"+H83","v":20137},"Matthias Nolte"]
[null,null,null,null,null,2,{"$f":"G84","v":0},22115,"Ilona Wetzel"]
[null,null,null,null,null,3,{"$f":"G85","v":0},19222,"Annegret Schmidt"]
[null,null,null,null,null,4,{"$f":"G86","v":0},21889,"Kai Roßberg"]
[null,null,null,null,null,5,{"$f":"G87","v":0},0,0]
[null,null,null,null,null,"Bitte mit einem x) versehen",null,null,"     Unterschrift des Spiel-"]
[null,null,null,null,null,"wenn Ersatzspieler/in",null,null,"     partners"]
[]
[]
[]
[]
[]
[]
[]
[null,null,null,null,null," Spielbericht BOWLING"]
[null,null,null,null,null,"Betriebssportverband Hamburg e.V.",null,null,null,null,null,null,null,null,null,"Punktspielserie"]
[null,null,null,null,null,"alle Felder sind unbedingt auszufüllen,da sonst der Spielbericht ungültig ist "]
[]
[null,null,null,null,null,"Klasse","Herren",{"$f":"+H80","v":"B2"},"     Antritt     Nr.",4,null,"Datum",{"$f":"+Hilfstabelle!B8","v":"2025-10-21"},"BSG","PAN 1"]
[]
[null,null,null,null,null,null,"X)","Pass-Nr.","Vor-und Zuname",null,null,null,"I","II","III","Gesamt"]
[null,null,null,null,null,1,null,{"$f":"IF(I119>0,VLOOKUP(I119,Tabelle2[#Data],2,0),\"\")","v":24774},{"$f":"+Spielereinteilung!AC14","v":"Frank Nijholt"}]
[null,null,null,null,null,2,null,{"$f":"IF(I120>0,VLOOKUP(I120,Tabelle2[#Data],2,0),\"\")","v":24775},{"$f":"+Spielereinteilung!AC16","v":"Deniz Hagelstein"}]
[null,null,null,null,null,3,null,{"$f":"IF(I121>0,VLOOKUP(I121,Tabelle2[#Data],2,0),\"\")","v":22113},{"$f":"+Spielereinteilung!AC18","v":"Michael Wetzel"}]
[null,null,null,null,null,4,null,{"$f":"IF(I122>0,VLOOKUP(I122,Tabelle2[#Data],2,0),\"\")","v":23302},{"$f":"+Spielereinteilung!AC20","v":"Mario Jurk"}]
[null,null,null,null,null,5]
[null,null,null,null,null,"Bitte mit einem x) versehen",null,null,"     Unterschrift des Spiel-"]
[null,null,null,null,null,"wenn Ersatzspieler/in",null,null,"     partners"]
[]
[null,null,null,null,null," Spielbericht BOWLING"]
[null,null,null,null,null,"Betriebssportverband Hamburg e.V.",null,null,null,null,null,null,null,null,null,"Punktspielserie"]
[null,null,null,null,null,"alle Felder sind unbedingt auszufüllen,da sonst der Spielbericht ungültig ist "]
[]
[null,null,null,null,null,"Klasse","  Herren",{"$f":"+H116","v":"B2"},"     Antritt     Nr.",{"$f":"J116","v":4},null,"Datum",{"$f":"+M116","v":"2025-10-21"},"BSG",{"$f":"+O116","v":"PAN 1"}]
[]
[null,null,null,null,null,null,"X)","Pass-Nr.","Vor-und Zuname",null,null,null,"I","II","III","Gesamt"]
[null,null,null,null,null,1,{"$f":"G119","v":0},{"$f":"+H119","v":24774},"Frank Nijholt"]
[null,null,null,null,null,2,{"$f":"G120","v":0},24775,"Deniz Hagelstein"]
[null,null,null,null,null,3,{"$f":"G121","v":0},22113,"Michael Wetzel"]
[null,null,null,null,null,4,{"$f":"G122","v":0},23302,"Mario Jurk"]
[null,null,null,null,null,5,{"$f":"G123","v":0},0,0]
[null,null,null,null,null,"Bitte mit einem x) versehen",null,null,"     Unterschrift des Spiel-"]
[null,null,null,null,null,"wenn Ersatzspieler/in",null,null,"     partners"]
[]
[]
[]
[]
[]
[]
[]
[null,null,null,null,null," Spielbericht BOWLING"]
[null,null,null,null,null,"Betriebssportverband Hamburg e.V.",null,null,null,null,null,null,null,null,null,"Punktspielserie"]
[null,null,null,null,null,"alle Felder sind unbedingt auszufüllen,da sonst der Spielbericht ungültig ist "]
[]
[null,null,null,null,null,"Klasse","Herren",{"$f":"+H116","v":"B2"},"     Antritt     Nr.",5,null,"Datum",{"$f":"+Hilfstabelle!B9","v":"2025-11-04"},"BSG","PAN 1"]
[]
[null,null,null,null,null,null,"X)","Pass-Nr.","Vor-und Zuname",null,null,null,"I","II","III","Gesamt"]
[null,null,null,null,null,1,null,{"$f":"IF(I155>0,VLOOKUP(I155,Tabelle2[#Data],2,0),\"\")","v":20137},{"$f":"+Spielereinteilung!AL14","v":"Matthias Nolte"}]
[null,null,null,null,null,2,null,{"$f":"IF(I156>0,VLOOKUP(I156,Tabelle2[#Data],2,0),\"\")","v":24775},{"$f":"+Spielereinteilung!AL16","v":"Deniz Hagelstein"}]
[null,null,null,null,null,3,null,{"$f":"IF(I157>0,VLOOKUP(I157,Tabelle2[#Data],2,0),\"\")","v":22115},{"$f":"+Spielereinteilung!AL18","v":"Ilona Wetzel"}]
[null,null,null,null,null,4,null,{"$f":"IF(I158>0,VLOOKUP(I158,Tabelle2[#Data],2,0),\"\")","v":21889},{"$f":"+Spielereinteilung!AL20","v":"Kai Roßberg"}]
[null,null,null,null,null,5]
[null,null,null,null,null,"Bitte mit einem x) versehen",null,null,"     Unterschrift des Spiel-"]
[null,null,null,null,null,"wenn Ersatzspieler/in",null,null,"     partners"]
[]
[null,null,null,null,null," Spielbericht BOWLING"]
[null,null,null,null,null,"Betriebssportverband Hamburg e.V.",null,null,null,null,null,null,null,null,null,"Punktspielserie"]
[null,null,null,null,null,"alle Felder sind unbedingt auszufüllen,da sonst der Spielbericht ungültig ist "]
[]
[null,null,null,null,null,"Klasse","  Herren",{"$f":"+H152","v":"B2"},"     Antritt     Nr.",{"$f":"J152","v":5},null,"Datum",{"$f":"+M152","v":"2025-11-04"},"BSG",{"$f":"+O152","v":"PAN 1"}]
[]
[null,null,null,null,null,null,"X)","Pass-Nr.","Vor-und Zuname",null,null,null,"I","II","III","Gesamt"]
[null,null,null,null,null,1,{"$f":"G155","v":0},{"$f":"+H155","v":20137},"Matthias Nolte"]
[null,null,null,null,null,2,{"$f":"G156","v":0},24775,"Deniz Hagelstein"]
[null,null,null,null,null,3,{"$f":"G157","v":0},22115,"Ilona Wetzel"]
[null,null,null,null,null,4,{"$f":"G158","v":0},21889,"Kai Roßberg"]
[null,null,null,null,null,5,{"$f":"G159","v":0},0,0]
[null,null,null,null,null,"Bitte mit einem x) versehen",null,null,"     Unterschrift des Spiel-"]
[null,null,null,null,null,"wenn Ersatzspieler/in",null,null,"     partners"]
[]
[]
[]
[]
[]
[]
[]
[null,null,null,null,null," Spielbericht BOWLING"]
[null,null,null,null,null,"Betriebssportverband Hamburg e.V.",null,null,null,null,null,null,null,null,null,"Punktspielserie"]
[null,null,null,null,null,"alle Felder sind unbedingt auszufüllen,da sonst der Spielbericht ungültig ist "]
[]
[null,null,null,null,null,"Klasse","Herren",{"$f":"+H152","v":"B2"},"     Antritt     Nr.",6,null,"Datum",{"$f":"+Hilfstabelle!B10","v":"2025-11-18"},"BSG","PAN 1"]
[]
[null,null,null,null,null,null,"X)","Pass-Nr.","Vor-und Zuname",null,null,null,"I","II","III","Gesamt"]
[null,null,null,null,null,1,null,{"$f":"IF(I191>0,VLOOKUP(I191,Tabelle2[#Data],2,0),\"\")","v":24774},{"$f":"+Spielereinteilung!B40","v":"Frank Nijholt"}]
[null,null,null,null,null,2,null,{"$f":"IF(I192>0,VLOOKUP(I192,Tabelle2[#Data],2,0),\"\")","v":22115},{"$f":"+Spielereinteilung!B42","v":"Ilona Wetzel"}]
[null,null,null,null,null,3,null,{"$f":"IF(I193>0,VLOOKUP(I193,Tabelle2[#Data],2,0),\"\")","v":22113},{"$f":"+Spielereinteilung!B44","v":"Michael Wetzel"}]
[null,null,null,null,null,4,null,{"$f":"IF(I194>0,VLOOKUP(I194,Tabelle2[#Data],2,0),\"\")","v":23302},{"$f":"+Spielereinteilung!B46","v":"Mario Jurk"}]
[null,null,null,null,null,5]
[null,null,null,null,null,"Bitte mit einem x) versehen",null,null,"     Unterschrift des Spiel-"]
[null,null,null,null,null,"wenn Ersatzspieler/in",null,null,"     partners"]
[]
[null,null,null,null,null," Spielbericht BOWLING"]
[null,null,null,null,null,"Betriebssportverband Hamburg e.V.",null,null,null,null,null,null,null,null,null,"Punktspielserie"]
[null,null,null,null,null,"alle Felder sind unbedingt auszufüllen,da sonst der Spielbericht ungültig ist "]
[]
[null,null,null,null,null,"Klasse","  Herren",{"$f":"+H188","v":"B2"},"     Antritt     Nr.",{"$f":"J188","v":6},null,"Datum",{"$f":"+M188","v":"2025-11-18"},"BSG",{"$f":"+O188","v":"PAN 1"}]
[]
[null,null,null,null,null,null,"X)","Pass-Nr.","Vor-und Zuname",null,null,null,"I","II","III","Gesamt"]
[null,null,null,null,null,1,{"$f":"G191","v":0},{"$f":"+H191","v":24774},"Frank Nijholt"]
[null,null,null,null,null,2,{"$f":"G192","v":0},22115,"Ilona Wetzel"]
[null,null,null,null,null,3,{"$f":"G193","v":0},22113,"Michael Wetzel"]
[null,null,null,null,null,4,{"$f":"G194","v":0},23302,"Mario Jurk"]
[null,null,null,null,null,5,{"$f":"G195","v":0},0,0]
[null,null,null,null,null,"Bitte mit einem x) versehen",null,null,"     Unterschrift des Spiel-"]
[null,null,null,null,null,"wenn Ersatzspieler/in",null,null,"     partners"]
[]
[]
[]
[]
[]
[]
[]
[null,null,null,null,null," Spielbericht BOWLING"]
[null,null,null,null,null,"Betriebssportverband Hamburg e.V.",null,null,null,null,null,null,null,null,null,"Punktspielserie"]
[null,null,null,null,null,"alle Felder sind unbedingt auszufüllen,da sonst der Spielbericht ungültig ist "]
[]
[null,null,null,null,null,"Klasse","Herren",{"$f":"+H188","v":"B2"},"     Antritt     Nr.",7,null,"Datum",{"$f":"+Hilfstabelle!B11","v":"2026-01-13"},"BSG","PAN 1"]
[]
[null,null,null,null,null,null,"X)","Pass-Nr.","Vor-und Zuname",null,null,null,"I","II","III","Gesamt"]
[null,null,null,null,null,1,null,{"$f":"IF(I227>0,VLOOKUP(I227,Tabelle2[#Data],2,0),\"\")","v":20137},{"$f":"+Spielereinteilung!K40","v":"Matthias Nolte"}]
[null,null,null,null,null,2,null,{"$f":"IF(I228>0,VLOOKUP(I228,Tabelle2[#Data],2,0),\"\")","v":24774},{"$f":"+Spielereinteilung!K42","v":"Frank Nijholt"}]
[null,null,null,null,null,3,null,{"$f":"IF(I229>0,VLOOKUP(I229,Tabelle2[#Data],2,0),\"\")","v":19222},{"$f":"+Spielereinteilung!K44","v":"Annegret Schmidt"}]
[null,null,null,null,null,4,null,{"$f":"IF(I230>0,VLOOKUP(I230,Tabelle2[#Data],2,0),\"\")","v":23302},{"$f":"+Spielereinteilung!K46","v":"Mario Jurk"}]
[null,null,null,null,null,5]
[null,null,null,null,null,"Bitte mit einem x) versehen",null,null,"     Unterschrift des Spiel-"]
[null,null,null,null,null,"wenn Ersatzspieler/in",null,null,"     partners"]
[]
[null,null,null,null,null," Spielbericht BOWLING"]
[null,null,null,null,null,"Betriebssportverband Hamburg e.V.",null,null,null,null,null,null,null,null,null,"Punktspielserie"]
[null,null,null,null,null,"alle Felder sind unbedingt auszufüllen,da sonst der Spielbericht ungültig ist "]
[]
[null,null,null,null,null,"Klasse","  Herren",{"$f":"+H224","v":"B2"},"     Antritt     Nr.",{"$f":"J224","v":7},null,"Datum",{"$f":"+M224","v":"2026-01-13"},"BSG",{"$f":"+O224","v":"PAN 1"}]
[]
[null,null,null,null,null,null,"X)","Pass-Nr.","Vor-und Zuname",null,null,null,"I","II","III","Gesamt"]
[null,null,null,null,null,1,{"$f":"G227","v":0},{"$f":"+H227","v":20137},{"$f":"+I227","v":"Matthias Nolte"}]
[null,null,null,null,null,2,{"$f":"G228","v":0},{"$f":"+H228","v":24774},{"$f":"+I228","v":"Frank Nijholt"}]
[null,null,null,null,null,3,{"$f":"G229","v":0},{"$f":"+H229","v":19222},{"$f":"+I229","v":"Annegret Schmidt"}]
[null,null,null,null,null,4,{"$f":"G230","v":0},{"$f":"+H230","v":23302},{"$f":"+I230","v":"Mario Jurk"}]
[null,null,null,null,null,5,{"$f":"G231","v":0},{"$f":"+Spielberichte!H195","v":0},{"$f":"+I231","v":0}]
[null,null,null,null,null,"Bitte mit einem x) versehen",null,null,"     Unterschrift des Spiel-"]
[null,null,null,null,null,"wenn Ersatzspieler/in",null,null,"     partners"]
[]
[]
[]
[]
[]
[]
[]
[null,null,null,null,null," Spielbericht BOWLING"]
[null,null,null,null,null,"Betriebssportverband Hamburg e.V.",null,null,null,null,null,null,null,null,null,"Punktspielserie"]
[null,null,null,null,null,"alle Felder sind unbedingt auszufüllen,da sonst der Spielbericht ungültig ist "]
[]
[null,null,null,null,null,"Klasse","Herren",{"$f":"+H224","v":"B2"},"     Antritt     Nr.",8,null,"Datum",{"$f":"+Hilfstabelle!B12","v":"2026-01-27"},"BSG","PAN 1"]
[]
[null,null,null,null,null,null,"X)","Pass-Nr.","Vor-und Zuname",null,null,null,"I","II","III","Gesamt"]
[null,null,null,null,null,1,null,{"$f":"IF(I263>0,VLOOKUP(I263,Tabelle2[#Data],2,0),\"\")","v":22115},{"$f":"+Spielereinteilung!T40","v":"Ilona Wetzel"}]
[null,null,null,null,null,2,null,{"$f":"IF(I264>0,VLOOKUP(I264,Tabelle2[#Data],2,0),\"\")","v":19221},{"$f":"+Spielereinteilung!T42","v":"Jörg Frahm"}]
[null,null,null,null,null,3,null,{"$f":"IF(I265>0,VLOOKUP(I265,Tabelle2[#Data],2,0),\"\")","v":21889},{"$f":"+Spielereinteilung!T44","v":"Kai Roßberg"}]
[null,null,null,null,null,4,null,{"$f":"IF(I266>0,VLOOKUP(I266,Tabelle2[#Data],2,0),\"\")","v":23302},{"$f":"+Spielereinteilung!T46","v":"Mario Jurk"}]
[null,null,null,null,null,5]
[null,null,null,null,null,"Bitte mit einem x) versehen",null,null,"     Unterschrift des Spiel-"]
[null,null,null,null,null,"wenn Ersatzspieler/in",null,null,"     partners"]
[]
[null,null,null,null,null," Spielbericht BOWLING"]
[null,null,null,null,null,"Betriebssportverband Hamburg e.V.",null,null,null,null,null,null,null,null,null,"Punktspielserie"]
[null,null,null,null,null,"alle Felder sind unbedingt auszufüllen,da sonst der Spielbericht ungültig ist "]
[]
[null,null,null,null,null,"Klasse","  Herren",{"$f":"+H260","v":"B2"},"     Antritt     Nr.",{"$f":"J260","v":8},null,"Datum",{"$f":"+M260","v":"2026-01-27"},"BSG",{"$f":"+O260","v":"PAN 1"}]
[]
[null,null,null,null,null,null,"X)","Pass-Nr.","Vor-und Zuname",null,null,null,"I","II","III","Gesamt"]
[null,null,null,null,null,1,{"$f":"G263","v":0},{"$f":"+H263","v":22115},"Ilona Wetzel"]
[null,null,null,null,null,2,{"$f":"G264","v":0},19221,"Jörg Frahm"]
[null,null,null,null,null,3,{"$f":"G265","v":0},21889,"Kai Roßberg"]
[null,null,null,null,null,4,{"$f":"G266","v":0},23302,"Mario Jurk"]
[null,null,null,null,null,5,{"$f":"G267","v":0},0,0]
[null,null,null,null,null,"Bitte mit einem x) versehen",null,null,"     Unterschrift des Spiel-"]
[null,null,null,null,null,"wenn Ersatzspieler/in",null,null,"     partners"]
[]
[]
[]
[]
[]
[]
[]
[null,null,null,null,null," Spielbericht BOWLING"]
[null,null,null,null,null,"Betriebssportverband Hamburg e.V.",null,null,null,null,null,null,null,null,null,"Punktspielserie"]
[null,null,null,null,null,"alle Felder sind unbedingt auszufüllen,da sonst der Spielbericht ungültig ist "]
[]
[null,null,null,null,null,"Klasse","Herren",{"$f":"+H260","v":"B2"},"     Antritt     Nr.",9,null,"Datum",{"$f":"+Hilfstabelle!B13","v":"2026-02-10"},"BSG","PAN 1"]
[]
[null,null,null,null,null,null,"X)","Pass-Nr.","Vor-und Zuname",null,null,null,"I","II","III","Gesamt"]
[null,null,null,null,null,1,null,{"$f":"IF(I299>0,VLOOKUP(I299,Tabelle2[#Data],2,0),\"\")","v":19222},{"$f":"+Spielereinteilung!AC40","v":"Annegret Schmidt"}]
[null,null,null,null,null,2,null,{"$f":"IF(I300>0,VLOOKUP(I300,Tabelle2[#Data],2,0),\"\")","v":22115},{"$f":"+Spielereinteilung!AC42","v":"Ilona Wetzel"}]
[null,null,null,null,null,3,null,{"$f":"IF(I301>0,VLOOKUP(I301,Tabelle2[#Data],2,0),\"\")","v":19221},{"$f":"+Spielereinteilung!AC44","v":"Jörg Frahm"}]
[null,null,null,null,null,4,null,{"$f":"IF(I302>0,VLOOKUP(I302,Tabelle2[#Data],2,0),\"\")","v":22113},{"$f":"+Spielereinteilung!AC46","v":"Michael Wetzel"}]
[null,null,null,null,null,5]
[null,null,null,null,null,"Bitte mit einem x) versehen",null,null,"     Unterschrift des Spiel-"]
[null,null,null,null,null,"wenn Ersatzspieler/in",null,null,"     partners"]
[]
[null,null,null,null,null," Spielbericht BOWLING"]
[null,null,null,null,null,"Betriebssportverband Hamburg e.V.",null,null,null,null,null,null,null,null,null,"Punktspielserie"]
[null,null,null,null,null,"alle Felder sind unbedingt auszufüllen,da sonst der Spielbericht ungültig ist "]
[]
[null,null,null,null,null,"Klasse","  Herren",{"$f":"+H296","v":"B2"},"     Antritt     Nr.",{"$f":"J296","v":9},null,"Datum",{"$f":"+M296","v":"2026-02-10"},"BSG",{"$f":"+O296","v":"PAN 1"}]
[]
[null,null,null,null,null,null,"X)","Pass-Nr.","Vor-und Zuname",null,null,null,"I","II","III","Gesamt"]
[null,null,null,null,null,1,{"$f":"G299","v":0},{"$f":"+H299","v":19222},"Annegret Schmidt"]
[null,null,null,null,null,2,{"$f":"G300","v":0},22115,"Ilona Wetzel"]
[null,null,null,null,null,3,{"$f":"G301","v":0},19221,"Jörg Frahm"]
[null,null,null,null,null,4,{"$f":"G302","v":0},22113,"Michael Wetzel"]
[null,null,null,null,null,5,{"$f":"G303","v":0},0,0]
[null,null,null,null,null,"Bitte mit einem x) versehen",null,null,"     Unterschrift des Spiel-"]
[null,null,null,null,null,"wenn Ersatzspieler/in",null,null,"     partners"]
[]
[]
[]
[]
[]
[]
[]
[null,null,null,null,null," Spielbericht BOWLING"]
[null,null,null,null,null,"Betriebssportverband Hamburg e.V.",null,null,null,null,null,null,null,null,null,"Punktspielserie"]
[null,null,null,null,null,"alle Felder sind unbedingt auszufüllen,da sonst der Spielbericht ungültig ist "]
[]
[null,null,null,null,null,"Klasse","Herren",{"$f":"+H296","v":"B2"},"     Antritt     Nr.",10,null,"Datum",{"$f":"+Hilfstabelle!B14","v":"2026-02-24"},"BSG","PAN 1"]
[]
[null,null,null,null,null,null,"X)","Pass-Nr.","Vor-und Zuname",null,null,null,"I","II","III","Gesamt"]
[null,null,null,null,null,1,null,{"$f":"IF(I335>0,VLOOKUP(I335,Tabelle2[#Data],2,0),\"\")","v":24774},{"$f":"+Spielereinteilung!AL40","v":"Frank Nijholt"}]
[null,null,null,null,null,2,null,{"$f":"IF(I336>0,VLOOKUP(I336,Tabelle2[#Data],2,0),\"\")","v":19222},{"$f":"+Spielereinteilung!AL42","v":"Annegret Schmidt"}]
[null,null,null,null,null,3,null,{"$f":"IF(I337>0,VLOOKUP(I337,Tabelle2[#Data],2,0),\"\")","v":24775},{"$f":"+Spielereinteilung!AL44","v":"Deniz Hagelstein"}]
[null,null,null,null,null,4,null,{"$f":"IF(I338>0,VLOOKUP(I338,Tabelle2[#Data],2,0),\"\")","v":22113},{"$f":"+Spielereinteilung!AL46","v":"Michael Wetzel"}]
[null,null,null,null,null,5]
[null,null,null,null,null,"Bitte mit einem x) versehen",null,null,"     Unterschrift des Spiel-"]
[null,null,null,null,null,"wenn Ersatzspieler/in",null,null,"     partners"]
[]
[null,null,null,null,null," Spielbericht BOWLING"]
[null,null,null,null,null,"Betriebssportverband Hamburg e.V.",null,null,null,null,null,null,null,null,null,"Punktspielserie"]
[null,null,null,null,null,"alle Felder sind unbedingt auszufüllen,da sonst der Spielbericht ungültig ist "]
[]
[null,null,null,null,null,"Klasse","  Herren",{"$f":"+H332","v":"B2"},"     Antritt     Nr.",{"$f":"J332","v":10},null,"Datum",{"$f":"+M332","v":"2026-02-24"},"BSG",{"$f":"+O332","v":"PAN 1"}]
[]
[null,null,null,null,null,null,"X)","Pass-Nr.","Vor-und Zuname",null,null,null,"I","II","III","Gesamt"]
[null,null,null,null,null,1,{"$f":"G335","v":0},{"$f":"+H335","v":24774},"Frank Nijholt"]
[null,null,null,null,null,2,{"$f":"G336","v":0},19222,"Annegret Schmidt"]
[null,null,null,null,null,3,{"$f":"G337","v":0},24775,"Deniz Hagelstein"]
[null,null,null,null,null,4,{"$f":"G338","v":0},22113,"Michael Wetzel"]
[null,null,null,null,null,5,{"$f":"G339","v":0},0,0]
[null,null,null,null,null,"Bitte mit einem x) versehen",null,null,"     Unterschrift des Spiel-"]
[null,null,null,null,null,"wenn Ersatzspieler/in",null,null,"     partners"]
[]
[]
[]
[]
[]
[]
[]
[null,null,null,null,null," Spielbericht BOWLING"]
[null,null,null,null,null,"Betriebssportverband Hamburg e.V.",null,null,null,null,null,null,null,null,null,"Punktspielserie"]
[null,null,null,null,null,"alle Felder sind unbedingt auszufüllen,da sonst der Spielbericht ungültig ist "]
[]
[null,null,null,null,null,"Klasse","Herren",{"$f":"+H332","v":"B2"},"     Antritt     Nr.",11,null,"Datum",{"$f":"+Hilfstabelle!B15","v":"2026-03-10"},"BSG","PAN 1"]
[]
[null,null,null,null,null,null,"X)","Pass-Nr.","Vor-und Zuname",null,null,null,"I","II","III","Gesamt"]
[null,null,null,null,null,1,null,{"$f":"IF(I371>0,VLOOKUP(I371,Tabelle2[#Data],2,0),\"\")","v":20137},{"$f":"+Spielereinteilung!AU40","v":"Matthias Nolte"}]
[null,null,null,null,null,2,null,{"$f":"IF(I372>0,VLOOKUP(I372,Tabelle2[#Data],2,0),\"\")","v":24775},{"$f":"+Spielereinteilung!AU42","v":"Deniz Hagelstein"}]
[null,null,null,null,null,3,null,{"$f":"IF(I373>0,VLOOKUP(I373,Tabelle2[#Data],2,0),\"\")","v":24774},{"$f":"+Spielereinteilung!AU44","v":"Frank Nijholt"}]
[null,null,null,null,null,4,null,{"$f":"IF(I374>0,VLOOKUP(I374,Tabelle2[#Data],2,0),\"\")","v":23302},{"$f":"+Spielereinteilung!AU46","v":"Mario Jurk"}]
[null,null,null,null,null,5]
[null,null,null,null,null,"Bitte mit einem x) versehen",null,null,"     Unterschrift des Spiel-"]
[null,null,null,null,null,"wenn Ersatzspieler/in",null,null,"     partners"]
[]
[null,null,null,null,null," Spielbericht BOWLING"]
[null,null,null,null,null,"Betriebssportverband Hamburg e.V.",null,null,null,null,null,null,null,null,null,"Punktspielserie"]
[null,null,null,null,null,"alle Felder sind unbedingt auszufüllen,da sonst der Spielbericht ungültig ist "]
[]
[null,null,null,null,null,"Klasse","  Herren",{"$f":"+H368","v":"B2"},"     Antritt     Nr.",{"$f":"J368","v":11},null,"Datum",{"$f":"+M368","v":"2026-03-10"},"BSG",{"$f":"+O368","v":"PAN 1"}]
[]
[null,null,null,null,null,null,"X)","Pass-Nr.","Vor-und Zuname",null,null,null,"I","II","III","Gesamt"]
[null,null,null,null,null,1,{"$f":"G371","v":0},{"$f":"+H371","v":20137},"Matthias Nolte"]
[null,null,null,null,null,2,{"$f":"G372","v":0},24775,"Deniz Hagelstein"]
[null,null,null,null,null,3,{"$f":"G373","v":0},24774,"Frank Nijholt"]
[null,null,null,null,null,4,{"$f":"G374","v":0},23302,"Mario Jurk"]
[null,null,null,null,null,5,{"$f":"G375","v":0},0,0]
[null,null,null,null,null,"Bitte mit einem x) versehen",null,null,"     Unterschrift des Spiel-"]
[null,null,null,null,null,"wenn Ersatzspieler/in",null,null,"     partners"]
[]
[]
[]
[]
[]
[]
[]
[null,null,null,null,null," Spielbericht BOWLING"]
[null,null,null,null,null,"Betriebssportverband Hamburg e.V.",null,null,null,null,null,null,null,null,null,"Punktspielserie"]
[null,null,null,null,null,"alle Felder sind unbedingt auszufüllen,da sonst der Spielbericht ungültig ist "]
[]
[null,null,null,null,null,"Klasse","Herren",{"$f":"+H368","v":"B2"},"     Antritt     Nr.",12,null,"Datum",{"$f":"+Hilfstabelle!B16","v":"2026-03-24"},"BSG","PAN 1"]
[]
[null,null,null,null,null,null,"X)","Pass-Nr.","Vor-und Zuname",null,null,null,"I","II","III","Gesamt"]
[null,null,null,null,null,1,null,{"$f":"IF(I407>0,VLOOKUP(I407,Tabelle2[#Data],2,0),\"\")","v":24775},{"$f":"+Spielereinteilung!B64","v":"Deniz Hagelstein"}]
[null,null,null,null,null,2,null,{"$f":"IF(I408>0,VLOOKUP(I408,Tabelle2[#Data],2,0),\"\")","v":19222},{"$f":"+Spielereinteilung!B66","v":"Annegret Schmidt"}]
[null,null,null,null,null,3,null,{"$f":"IF(I409>0,VLOOKUP(I409,Tabelle2[#Data],2,0),\"\")","v":21889},{"$f":"+Spielereinteilung!B68","v":"Kai Roßberg"}]
[null,null,null,null,null,4,null,{"$f":"IF(I410>0,VLOOKUP(I410,Tabelle2[#Data],2,0),\"\")","v":23302},{"$f":"+Spielereinteilung!B70","v":"Mario Jurk"}]
[null,null,null,null,null,5]
[null,null,null,null,null,"Bitte mit einem x) versehen",null,null,"     Unterschrift des Spiel-"]
[null,null,null,null,null,"wenn Ersatzspieler/in",null,null,"     partners"]
[]
[null,null,null,null,null," Spielbericht BOWLING"]
[null,null,null,null,null,"Betriebssportverband Hamburg e.V.",null,null,null,null,null,null,null,null,null,"Punktspielserie"]
[null,null,null,null,null,"alle Felder sind unbedingt auszufüllen,da sonst der Spielbericht ungültig ist "]
[]
[null,null,null,null,null,"Klasse","  Herren",{"$f":"+H404","v":"B2"},"     Antritt     Nr.",{"$f":"J404","v":12},null,"Datum",{"$f":"+M404","v":"2026-03-24"},"BSG",{"$f":"+O404","v":"PAN 1"}]
[]
[null,null,null,null,null,null,"X)","Pass-Nr.","Vor-und Zuname",null,null,null,"I","II","III","Gesamt"]
[null,null,null,null,null,1,{"$f":"G407","v":0},{"$f":"+H407","v":24775},"Deniz Hagelstein"]
[null,null,null,null,null,2,{"$f":"G408","v":0},19222,"Annegret Schmidt"]
[null,null,null,null,null,3,{"$f":"G409","v":0},21889,"Kai Roßberg"]
[null,null,null,null,null,4,{"$f":"G410","v":0},23302,"Mario Jurk"]
[null,null,null,null,null,5,{"$f":"G411","v":0},0,0]
[null,null,null,null,null,"Bitte mit einem x) versehen",null,null,"     Unterschrift des Spiel-"]
[null,null,null,null,null,"wenn Ersatzspieler/in",null,null,"     partners"]
[]
[]
[]
[]
[]
[]
[]
[null,null,null,null,null," Spielbericht BOWLING"]
[null,null,null,null,null,"Betriebssportverband Hamburg e.V.",null,null,null,null,null,null,null,null,null,"Punktspielserie"]
[null,null,null,null,null,"alle Felder sind unbedingt auszufüllen,da sonst der Spielbericht ungültig ist "]
[]
[null,null,null,null,null,"Klasse","Herren",{"$f":"+H404","v":"B2"},"     Antritt     Nr.",13,null,"Datum",{"$f":"+Hilfstabelle!B17","v":"2026-04-07"},"BSG","PAN 1"]
[]
[null,null,null,null,null,null,"X)","Pass-Nr.","Vor-und Zuname",null,null,null,"I","II","III","Gesamt"]
[null,null,null,null,null,1,null,{"$f":"IF(I443>0,VLOOKUP(I443,Tabelle2[#Data],2,0),\"\")","v":20137},{"$f":"+Spielereinteilung!K64","v":"Matthias Nolte"}]
[null,null,null,null,null,2,null,{"$f":"IF(I444>0,VLOOKUP(I444,Tabelle2[#Data],2,0),\"\")","v":19221},{"$f":"+Spielereinteilung!K66","v":"Jörg Frahm"}]
[null,null,null,null,null,3,null,{"$f":"IF(I445>0,VLOOKUP(I445,Tabelle2[#Data],2,0),\"\")","v":22113},{"$f":"+Spielereinteilung!K68","v":"Michael Wetzel"}]
[null,null,null,null,null,4,null,{"$f":"IF(I446>0,VLOOKUP(I446,Tabelle2[#Data],2,0),\"\")","v":23302},{"$f":"+Spielereinteilung!K70","v":"Mario Jurk"}]
[null,null,null,null,null,5]
[null,null,null,null,null,"Bitte mit einem x) versehen",null,null,"     Unterschrift des Spiel-"]
[null,null,null,null,null,"wenn Ersatzspieler/in",null,null,"     partners"]
[]
[null,null,null,null,null," Spielbericht BOWLING"]
[null,null,null,null,null,"Betriebssportverband Hamburg e.V.",null,null,null,null,null,null,null,null,null,"Punktspielserie"]
[null,null,null,null,null,"alle Felder sind unbedingt auszufüllen,da sonst der Spielbericht ungültig ist "]
[]
[null,null,null,null,null,"Klasse","  Herren",{"$f":"+H440","v":"B2"},"     Antritt     Nr.",{"$f":"J440","v":13},null,"Datum",{"$f":"+M440","v":"2026-04-07"},"BSG",{"$f":"+O440","v":"PAN 1"}]
[]
[null,null,null,null,null,null,"X)","Pass-Nr.","Vor-und Zuname",null,null,null,"I","II","III","Gesamt"]
[null,null,null,null,null,1,{"$f":"G443","v":0},{"$f":"+H443","v":20137},"Matthias Nolte"]
[null,null,null,null,null,2,{"$f":"G444","v":0},{"$f":"+H444","v":19221},"Jörg Frahm"]
[null,null,null,null,null,3,{"$f":"G445","v":0},{"$f":"+H445","v":22113},"Michael Wetzel"]
[null,null,null,null,null,4,{"$f":"G446","v":0},{"$f":"+H446","v":23302},"Mario Jurk"]
[null,null,null,null,null,5,{"$f":"G447","v":0},{"$f":"+H447","v":0},0]
[null,null,null,null,null,"Bitte mit einem x) versehen",null,null,"     Unterschrift des Spiel-"]
[null,null,null,null,null,"wenn Ersatzspieler/in",null,null,"     partners"]
[]
[]
[]
[]
[]
[]
[]
[]
[null,null,null,null,null," Spielbericht BOWLING"]
[null,null,null,null,null,"Betriebssportverband Hamburg e.V.",null,null,null,null,null,null,null,null,null,"Punktspielserie"]
[null,null,null,null,null,"alle Felder sind unbedingt auszufüllen,da sonst der Spielbericht ungültig ist "]
[]
[null,null,null,null,null,"Klasse","Herren",{"$f":"+H440","v":"B2"},"     Antritt     Nr.",14,null,"Datum",{"$f":"+Hilfstabelle!B18","v":"2026-04-21"},"BSG","PAN 1"]
[]
[null,null,null,null,null,null,"X)","Pass-Nr.","Vor-und Zuname",null,null,null,"I","II","III","Gesamt"]
[null,null,null,null,null,1,null,{"$f":"IF(I480>0,VLOOKUP(I480,Tabelle2[#Data],2,0),\"\")","v":24775},{"$f":"+Spielereinteilung!T64","v":"Deniz Hagelstein"}]
[null,null,null,null,null,2,null,{"$f":"IF(I481>0,VLOOKUP(I481,Tabelle2[#Data],2,0),\"\")","v":22115},{"$f":"+Spielereinteilung!T66","v":"Ilona Wetzel"}]
[null,null,null,null,null,3,null,{"$f":"IF(I482>0,VLOOKUP(I482,Tabelle2[#Data],2,0),\"\")","v":19221},{"$f":"+Spielereinteilung!T68","v":"Jörg Frahm"}]
[null,null,null,null,null,4,null,{"$f":"IF(I483>0,VLOOKUP(I483,Tabelle2[#Data],2,0),\"\")","v":22113},{"$f":"+Spielereinteilung!T70","v":"Michael Wetzel"}]
[null,null,null,null,null,5]
[null,null,null,null,null,"Bitte mit einem x) versehen",null,null,"     Unterschrift des Spiel-"]
[null,null,null,null,null,"wenn Ersatzspieler/in",null,null,"     partners"]
[]
[null,null,null,null,null," Spielbericht BOWLING"]
[null,null,null,null,null,"Betriebssportverband Hamburg e.V.",null,null,null,null,null,null,null,null,null,"Punktspielserie"]
[null,null,null,null,null,"alle Felder sind unbedingt auszufüllen,da sonst der Spielbericht ungültig ist "]
[]
[null,null,null,null,null,"Klasse","  Herren",{"$f":"+H477","v":"B2"},"     Antritt     Nr.",{"$f":"J477","v":14},null,"Datum",{"$f":"+M477","v":"2026-04-21"},"BSG",{"$f":"+O477","v":"PAN 1"}]
[]
[null,null,null,null,null,null,"X)","Pass-Nr.","Vor-und Zuname",null,null,null,"I","II","III","Gesamt"]
[null,null,null,null,null,1,{"$f":"G480","v":0},{"$f":"+H480","v":24775},"Deniz Hagelstein"]
[null,null,null,null,null,2,{"$f":"G481","v":0},{"$f":"+H481","v":22115},"Ilona Wetzel"]
[null,null,null,null,null,3,{"$f":"G482","v":0},{"$f":"+H482","v":19221},"Jörg Frahm"]
[null,null,null,null,null,4,{"$f":"G483","v":0},{"$f":"+H483","v":22113},"Michael Wetzel"]
[null,null,null,null,null,5,{"$f":"G484","v":0},{"$f":"+H484","v":0},0]
[null,null,null,null,null,"Bitte mit einem x) versehen",null,null,"     Unterschrift des Spiel-"]
[null,null,null,null,null,"wenn Ersatzspieler/in",null,null,"     partners"]

{"sheet":"Spielereinteilung","index":22,"n_rows":142,"n_cols":54,"rows_kept":142,"cut":false,"hidden":false,"merged":[[12,29,12,31],[12,38,12,40],[38,11,38,13],[38,20,38,22],[38,29,38,31],[14,42,14,44],[16,42,16,44],[18,42,18,44],[20,42,20,44],[13,33,13,35],[13,19,13,23],[15,19,15,23],[14,24,14,26],[16,24,16,26],[18,24,18,26],[14,33,14,35],[16,33,16,35],[18,33,18,35],[17,28,17,32],[30,28,30,32],[15,28,15,32],[13,37,13,41],[15,37,15,41],[13,10,13,14],[42,6,42,8],[44,6,44,8],[40,33,40,35],[40,42,40,44],[42,33,42,35],[42,42,42,44],[44,33,44,35],[22,15,22,17],[22,10,23,14],[40,24,40,26],[42,24,42,26],[44,24,44,26],[39,42,39,44],[39,19,39,23],[36,16,36,17],[43,37,43,41],[22,42,22,44],[22,19,23,23],[22,28,23,32],[23,33,23,35],[28,24,28,26],[28,19,28,23],[29,33,29,35],[43,6,43,8],[45,6,45,8],[41,19,41,23],[0,0,0,2],[1,0,1,2],[12,2,12,4],[12,11,12,13],[12,20,12,22],[41,1,41,5],[43,1,43,5],[30,10,30,14],[39,6,39,8],[17,1,17,5],[34,1,35,53],[36,7,36,8],[38,47,38,49],[38,2,38,4],[38,38,38,40],[31,1,31,5],[32,1,32,5],[28,6,28,8],[38,41,38,44],[31,42,31,44],[40,6,40,8],[24,10,25,14],[23,6,23,8],[23,15,23,17],[20,6,20,8],[20,15,20,17],[40,15,40,17],[24,24,24,26],[32,28,32,32],[32,33,32,35],[20,24,20,26],[22,6,22,8],[30,33,30,35],[30,24,30,26],[36,34,36,35],[39,33,39,35],[38,23,38,26],[39,24,39,26],[39,1,39,5],[13,6,13,8],[30,15,30,17],[32,6,32,8],[28,10,28,14],[29,10,29,14],[25,6,25,8],[24,6,24,8],[24,15,24,17],[25,15,25,17],[19,1,19,5],[22,1,23,5],[29,15,29,17],[31,15,31,17],[32,15,32,17],[38,14,38,17],[31,6,31,8],[32,10,32,14],[15,6,15,8],[17,6,17,8],[19,6,19,8],[14,6,14,8],[16,6,16,8],[18,6,18,8],[125,33,125,35],[122,23,122,26],[122,32,122,35],[123,24,123,26],[123,33,123,35],[124,24,124,26],[124,28,124,32],[56,28,56,32],[50,28,51,32],[50,33,50,35],[54,28,54,32],[54,33,54,35],[54,24,54,26],[51,33,51,35],[50,19,51,23],[55,28,55,32],[55,33,55,35],[56,33,56,35],[115,24,115,26],[108,33,108,35],[72,24,72,26],[87,33,87,36],[78,19,78,23],[78,24,78,26],[110,33,110,35],[75,24,75,26],[68,15,68,17],[68,24,68,26],[55,15,55,17],[56,15,56,17],[56,19,56,23],[67,24,67,26],[67,19,67,23],[55,24,55,26],[57,24,57,26],[65,15,65,17],[67,15,67,17],[64,15,64,17],[66,15,66,17],[88,17,88,20],[88,21,88,24],[88,29,88,32],[88,33,88,36],[74,24,74,26],[73,15,73,17],[108,28,108,32],[82,24,82,26],[87,21,87,24],[87,25,87,28],[87,29,87,32],[81,24,81,26],[93,17,93,20],[93,21,93,24],[49,24,49,26],[48,19,49,23],[58,1,58,5],[58,19,58,23],[58,6,58,8],[58,10,58,14],[67,6,67,8],[65,1,65,5],[63,1,63,5],[67,1,67,5],[65,6,65,8],[67,10,67,14],[63,10,63,14],[64,6,64,8],[66,6,66,8],[63,6,63,8],[118,33,118,35],[110,42,110,44],[119,33,119,35],[126,6,126,8],[119,15,119,17],[118,15,118,17],[122,14,122,17],[114,1,114,5],[116,42,116,44],[117,42,117,44],[117,37,117,41],[116,37,116,41],[117,1,117,5],[116,1,116,5],[109,28,110,32],[110,24,110,26],[110,15,110,17],[124,33,124,35],[126,33,126,35],[125,19,125,23],[123,28,123,32],[125,28,125,32],[123,19,123,23],[125,24,125,26],[107,28,107,32],[93,25,93,28],[93,29,93,32],[106,28,106,32],[105,28,105,32],[88,25,88,28],[98,37,98,40],[98,41,98,44],[98,45,98,48],[106,33,106,35],[93,33,93,36],[107,33,107,35],[95,33,95,36],[107,24,107,26],[105,33,105,35],[81,32,81,34],[81,35,81,37],[87,37,87,40],[87,41,87,44],[87,45,87,48],[87,49,87,52],[86,29,86,32],[86,33,86,36],[90,45,90,48],[95,29,95,32],[42,15,42,17],[44,15,44,17],[46,15,46,17],[81,38,81,40],[86,49,86,52],[90,49,90,52],[94,49,94,52],[97,49,97,52],[98,49,98,52],[48,33,48,35],[49,33,49,35],[43,15,43,17],[45,19,45,23],[42,51,42,53],[46,24,46,26],[45,42,45,44],[46,42,46,44],[54,19,54,23],[45,51,45,53],[41,33,41,35],[39,15,39,17],[43,28,43,32],[49,6,49,8],[48,15,48,17],[41,15,41,17],[48,28,49,32],[41,6,41,8],[39,10,39,14],[39,28,39,32],[45,10,45,14],[41,10,41,14],[43,10,43,14],[45,15,45,17],[43,19,43,23],[49,15,49,17],[48,24,48,26],[44,42,44,44],[46,33,46,35],[46,6,46,8],[56,46,56,50],[56,51,56,53],[56,37,56,41],[56,42,56,44],[48,37,49,41],[48,51,48,53],[49,51,49,53],[54,42,54,44],[54,46,54,50],[54,51,54,53],[55,42,55,44],[55,37,55,41],[50,51,50,53],[51,51,51,53],[55,46,55,50],[48,46,49,50],[48,42,48,44],[49,42,49,44],[50,46,51,50],[50,42,50,44],[54,37,54,41],[51,42,51,44],[50,37,51,41],[55,51,55,53],[46,51,46,53],[28,1,28,5],[29,1,29,5],[30,1,30,5],[31,10,31,14],[39,37,39,41],[45,28,45,32],[38,50,38,53],[45,33,45,35],[45,46,45,50],[41,46,41,50],[41,24,41,26],[45,24,45,26],[43,24,43,26],[41,42,41,44],[38,32,38,35],[43,46,43,50],[43,51,43,53],[41,37,41,41],[43,33,43,35],[39,51,39,53],[41,51,41,53],[41,28,41,32],[36,52,36,53],[44,51,44,53],[29,42,29,44],[30,42,30,44],[31,37,31,41],[28,42,28,44],[24,19,25,23],[24,28,25,32],[24,37,25,41],[31,33,31,35],[24,42,24,44],[25,42,25,44],[29,37,29,41],[24,33,24,35],[25,33,25,35],[29,24,29,26],[29,19,29,23],[43,42,43,44],[40,51,40,53],[39,46,39,50],[32,37,32,41],[28,37,28,41],[30,37,30,41],[36,43,36,44],[13,15,13,17],[15,15,15,17],[14,15,14,17],[16,15,16,17],[18,15,18,17],[15,10,15,14],[17,10,17,14],[17,33,17,35],[17,24,17,26],[81,1,81,5],[78,10,78,14],[87,17,87,20],[17,42,17,44],[23,42,23,44],[22,37,23,41],[23,24,23,26],[19,10,19,14],[19,37,19,41],[19,33,19,35],[19,24,19,26],[20,33,20,35],[32,42,32,44],[31,19,31,23],[30,19,30,23],[28,28,28,32],[28,33,28,35],[29,28,29,32],[31,28,31,32],[22,24,22,26],[45,37,45,41],[55,6,55,8],[54,15,54,17],[55,19,55,23],[55,1,55,5],[45,1,45,5],[48,1,49,5],[56,1,56,5],[50,1,51,5],[56,6,56,8],[57,6,57,8],[55,10,55,14],[56,10,56,14],[57,10,57,14],[57,1,57,5],[54,1,54,5],[50,10,51,14],[106,42,106,44],[105,24,105,26],[108,24,108,26],[113,5,113,8],[113,14,113,17],[69,24,69,26],[72,1,73,5],[80,1,80,5],[109,15,109,17],[79,1,79,5],[79,6,79,8],[86,1,86,4],[86,5,86,8],[86,9,86,12],[86,13,86,16],[86,17,86,20],[86,21,86,24],[80,15,80,17],[80,24,80,26],[80,19,80,23],[81,10,81,14],[78,1,78,5],[78,6,78,8],[78,15,78,17],[107,37,107,41],[105,42,105,44],[106,37,106,41],[105,37,105,41],[109,37,110,41],[113,32,113,35],[69,19,69,23],[72,6,72,8],[72,15,72,17],[72,10,73,14],[72,19,73,23],[73,6,73,8],[80,6,80,8],[107,42,107,44],[88,13,88,16],[106,10,106,14],[105,10,105,14],[93,13,93,16],[107,6,107,8],[107,15,107,17],[109,6,109,8],[79,19,79,23],[79,24,79,26],[86,25,86,28],[134,8,134,10],[108,37,108,41],[131,11,131,13],[108,42,108,44],[115,33,115,35],[115,42,115,44],[124,6,124,8],[115,37,115,41],[114,37,114,41],[118,6,118,8],[117,6,117,8],[117,15,117,17],[123,6,123,8],[109,42,109,44],[119,6,119,8],[113,41,113,44],[117,33,117,35],[116,33,116,35],[114,33,114,35],[114,42,114,44],[109,33,109,35],[131,5,131,7],[132,5,132,7],[118,42,118,44],[126,10,126,14],[126,1,126,5],[126,24,126,26],[127,28,128,32],[127,19,128,23],[125,6,125,8],[114,6,114,8],[115,6,115,8],[115,15,115,17],[118,28,119,32],[127,24,127,26],[114,24,114,26],[136,5,136,7],[137,5,137,7],[123,1,123,5],[115,10,115,14],[114,10,114,14],[116,28,116,32],[115,28,115,32],[114,28,114,32],[118,19,119,23],[118,10,119,14],[116,19,116,23],[115,19,115,23],[114,19,114,23],[117,10,117,14],[116,10,116,14],[114,15,114,17],[118,1,119,5],[115,1,115,5],[122,5,122,8],[130,5,130,13],[132,11,132,13],[124,19,124,23],[126,19,126,23],[128,6,128,8],[22,33,22,35],[133,11,133,13],[133,5,133,7],[131,14,131,17],[132,14,132,17],[133,14,133,17],[134,14,134,17],[117,28,117,32],[108,1,108,5],[82,1,82,5],[82,6,82,8],[82,10,82,14],[82,15,82,17],[108,6,108,8],[108,15,108,17],[108,10,108,14],[105,6,105,8],[87,1,87,4],[87,5,87,8],[87,9,87,12],[87,13,87,16],[88,1,88,4],[88,5,88,8],[88,9,88,12],[13,42,13,44],[2,6,2,22],[19,15,19,17],[19,42,19,44],[17,15,17,17],[17,19,17,23],[19,19,19,23],[19,28,19,32],[17,37,17,41],[4,6,5,37],[4,39,5,42],[7,1,9,44],[12,41,12,44],[12,32,12,35],[12,5,12,8],[12,14,12,17],[12,23,12,26],[13,24,13,26],[15,24,15,26],[15,33,15,35],[15,42,15,44],[13,1,13,5],[15,1,15,5],[13,28,13,32],[56,24,56,26],[62,20,62,22],[54,6,54,8],[54,10,54,14],[62,14,62,17],[25,24,25,26],[50,6,50,8],[51,6,51,8],[50,15,50,17],[50,24,50,26],[51,15,51,17],[51,24,51,26],[48,6,48,8],[36,25,36,26],[31,24,31,26],[32,19,32,23],[32,24,32,26],[38,5,38,8],[48,10,49,14],[29,6,29,8],[30,6,30,8],[24,1,25,5],[28,15,28,17],[62,23,62,26],[57,51,57,53],[58,51,58,53],[60,7,60,8],[60,16,60,17],[60,25,60,26],[58,28,58,32],[57,28,57,32],[57,46,57,50],[58,46,58,50],[57,37,57,41],[57,42,57,44],[58,37,58,41],[58,42,58,44],[57,33,57,35],[57,19,57,23],[58,24,58,26],[58,33,58,35],[57,15,57,17],[58,15,58,17],[86,53,86,56],[86,45,86,48],[86,41,86,44],[86,37,86,40],[82,19,82,23],[81,6,81,8],[79,10,79,14],[79,15,79,17],[81,19,81,23],[80,10,80,14],[87,53,87,56],[89,37,89,40],[89,41,89,44],[89,45,89,48],[89,49,89,52],[89,53,89,56],[88,37,88,40],[88,49,88,52],[88,53,88,56],[88,41,88,44],[88,45,88,48],[92,25,92,28],[92,29,92,32],[92,33,92,36],[89,1,89,4],[89,5,89,8],[89,9,89,12],[89,13,89,16],[89,17,89,20],[89,21,89,24],[89,25,89,28],[89,29,89,32],[89,33,89,36],[90,25,90,28],[90,29,90,32],[90,33,90,36],[91,1,91,4],[91,5,91,8],[91,9,91,12],[91,13,91,16],[91,17,91,20],[91,21,91,24],[91,25,91,28],[91,29,91,32],[91,33,91,36],[90,53,90,56],[91,37,91,40],[91,41,91,44],[91,45,91,48],[91,49,91,52],[91,53,91,56],[93,37,93,40],[93,41,93,44],[93,45,93,48],[93,49,93,52],[93,53,93,56],[92,37,92,40],[92,49,92,52],[92,53,92,56],[92,41,92,44],[92,45,92,48],[90,37,90,40],[90,41,90,44],[94,1,94,4],[94,5,94,8],[94,9,94,12],[94,13,94,16],[94,17,94,20],[94,21,94,24],[94,25,94,28],[94,29,94,32],[94,33,94,36],[94,53,94,56],[95,37,95,40],[95,41,95,44],[95,45,95,48],[95,49,95,52],[95,53,95,56],[96,45,96,48],[96,49,96,52],[96,53,96,56],[96,41,96,44],[94,37,94,40],[94,41,94,44],[94,45,94,48],[97,53,97,56],[96,1,96,4],[96,5,96,8],[96,9,96,12],[96,13,96,16],[96,17,96,20],[97,1,97,4],[97,5,97,8],[97,9,97,12],[97,13,97,16],[97,17,97,20],[97,21,97,24],[97,25,97,28],[97,29,97,32],[97,33,97,36],[96,21,96,24],[96,25,96,28],[96,29,96,32],[96,33,96,36],[96,37,96,40],[97,37,97,40],[97,41,97,44],[97,45,97,48],[104,5,104,8],[104,14,104,17],[104,23,104,26],[104,32,104,35],[104,41,104,44],[98,1,98,4],[98,5,98,8],[98,9,98,12],[98,13,98,16],[98,17,98,20],[98,21,98,24],[98,25,98,28],[98,29,98,32],[98,33,98,36],[139,5,139,7],[106,6,106,8],[106,15,106,17],[106,24,106,26],[107,1,107,5],[106,1,106,5],[113,23,113,26],[105,15,105,17],[106,19,106,23],[105,1,105,5],[109,1,110,5],[107,19,107,23],[109,24,109,26],[105,19,105,23],[110,6,110,8],[134,1,134,4],[135,1,135,4],[136,1,136,4],[137,1,137,4],[134,11,134,13],[135,11,135,13],[136,11,136,13],[134,5,134,7],[135,5,135,7],[128,24,128,26],[98,53,98,56],[100,25,100,27],[123,15,123,17],[124,15,124,17],[109,19,110,23],[109,10,110,14],[140,1,140,4],[131,20,131,28],[132,20,132,24],[139,8,139,10],[137,11,137,13],[140,8,140,10],[138,5,138,7],[138,1,138,4],[139,1,139,4],[133,8,133,10],[117,24,117,26],[116,15,116,17],[116,24,116,26],[107,10,107,14],[117,19,117,23],[108,19,108,23],[132,25,132,28],[136,14,136,17],[140,5,140,7],[119,42,119,44],[118,37,119,41],[136,8,136,10],[137,8,137,10],[138,8,138,10],[128,15,128,17],[126,15,126,17],[132,8,132,10],[131,8,131,10],[127,15,127,17],[127,6,127,8],[119,24,119,26],[118,24,118,26],[127,10,128,14],[125,15,125,17],[125,10,125,14],[124,10,124,14],[123,10,123,14],[125,1,125,5],[124,1,124,5],[128,33,128,35],[127,33,127,35],[141,5,141,7],[127,1,128,5],[132,1,132,4],[133,1,133,4],[126,28,126,32],[116,6,116,8],[95,1,95,4],[95,5,95,8],[95,9,95,12],[95,13,95,16],[95,17,95,20],[95,21,95,24],[95,25,95,28],[141,8,141,10],[140,14,140,17],[140,11,140,13],[141,11,141,13],[139,11,139,13],[139,14,139,17],[137,14,137,17],[138,14,138,17],[135,14,135,17],[135,8,135,10],[138,11,138,13],[93,1,93,4],[93,5,93,8],[93,9,93,12],[74,1,75,5],[74,10,75,14],[74,19,75,23],[74,6,74,8],[75,6,75,8],[74,15,74,17],[75,15,75,17],[90,1,90,4],[90,5,90,8],[90,9,90,12],[90,13,90,16],[90,17,90,20],[90,21,90,24],[92,1,92,4],[92,5,92,8],[92,9,92,12],[92,13,92,16],[92,17,92,20],[92,21,92,24],[81,15,81,17],[84,1,85,56],[73,24,73,26],[70,6,70,8],[69,6,69,8],[69,15,69,17],[69,10,69,14],[69,1,69,5],[70,24,70,26],[70,15,70,17],[62,5,62,8],[66,24,66,26],[63,24,63,26],[64,24,64,26],[65,19,65,23],[62,2,62,4],[62,11,62,13],[63,19,63,23],[65,10,65,14],[68,6,68,8],[65,24,65,26],[63,15,63,17]]}
["Start"]
["Rangliste"]
[null,null,null,null,null,null,{"$f":"+\"Spielplan  1. Mannschaft, Saison \"&+Hilfstabelle!D5","v":"Spielplan  1. Mannschaft, Saison 2025/2026"}]
[]
[null,null,null,null,null,null,{"$f":"\"Mannschaftsschnitt Saison: \"&Hilfstabelle!BF4&\" - Schnitt Mannschaft: \"&Hilfstabelle!BH5&\" Schnitt Spieler: \"&Hilfstabelle!BI5","v":"Mannschaftsschnitt Saison: 24/25 - Schnitt Mannschaft: 1875 Schnitt Spieler: 156,27"},null,null,null,null,null,null,null,null,null,null,null,null,null,null,null,null,null,null,null,null,null,null,null,null,null,null,null,null,null,null,null,null,"Übersicht"]
[]
[]
[null,"2025 / 1. - 5. Antritt"]
[]
[]
[]
[null,"Bahn:",null,{"$f":"VLOOKUP(F13,Hilfstabelle!$BC$3:$BD$16,2,0)","v":"Othmarschen - (OT)"},null,null,null,null,null,null,"Bahn:",null,{"$f":"VLOOKUP(O13,Hilfstabelle!$BC$3:$BD$16,2,0)","v":"Wandsbek - (WB)"},null,null,null,null,null,null,"Bahn:",null,{"$f":"VLOOKUP(X13,Hilfstabelle!$BC$3:$BD$16,2,0)","v":"Othmarschen - (OT)"},null,null,null,null,null,null,"Bahn:",null,{"$f":"VLOOKUP(AG13,Hilfstabelle!$BC$3:$BD$16,2,0)","v":"Wandsbek - (WB)"},null,null,null,null,null,null,"Bahn:",null,{"$f":"VLOOKUP(AP13,Hilfstabelle!$BC$3:$BD$16,2,0)","v":"Othmarschen - (OT)"}]
[null,"1.","Antritt",null,null,{"$f":"VLOOKUP(B13,Hilfstabelle!$A$5:$B$18,2,0)","v":"2025-09-09"},null,null,null,null,"2.","Antritt",null,null,{"$f":"VLOOKUP(K13,Hilfstabelle!$A$5:$B$18,2,0)","v":"2025-09-23"},null,null,null,null,"3.","Antritt",null,null,{"$f":"VLOOKUP(T13,Hilfstabelle!$A$5:$B$18,2,0)","v":"2025-10-07"},null,null,null,null,"4.","Antritt",null,null,{"$f":"VLOOKUP(AC13,Hilfstabelle!$A$5:$B$18,2,0)","v":"2025-10-21"},null,null,null,null,"5.","Antritt",null,null,{"$f":"VLOOKUP(AL13,Hilfstabelle!$A$5:$B$18,2,0)","v":"2025-11-04"}]
[null,{"$f":"+B106","v":"Jörg Frahm"},null,null,null,null,{"$f":"IFERROR(VLOOKUP(B14,Hilfstabelle!$AZ$3:$BA$11,2,0),\"\")","v":170.96774193548387},null,null,null,{"$f":"+K106","v":"Frank Nijholt"},null,null,null,null,{"$f":"IFERROR(VLOOKUP(K14,Hilfstabelle!$AZ$3:$BA$11,2,0),\"\")","v":136.73333333333332},null,null,null,{"$f":"+T106","v":"Matthias Nolte"},null,null,null,null,{"$f":"IFERROR(VLOOKUP(T14,Hilfstabelle!$AZ$3:$BA$11,2,0),\"\")","v":133.33333333333334},null,null,null,{"$f":"+AC106","v":"Frank Nijholt"},null,null,null,null,{"$f":"IFERROR(VLOOKUP(AC14,Hilfstabelle!$AZ$3:$BA$11,2,0),\"\")","v":136.73333333333332},null,null,null,{"$f":"+AL106","v":"Matthias Nolte"},null,null,null,null,{"$f":"IFERROR(VLOOKUP(AL14,Hilfstabelle!$AZ$3:$BA$11,2,0),\"\")","v":133.33333333333334}]
[null,"Heute gespielt:",null,null,null,null,{"$f":"IFERROR(VLOOKUP(B14,'Hilfstabelle Spieler'!$O$4:$P$12,2,0),\"\")/3","v":143.66666666666666},null,null,null,"Heute gespielt:",null,null,null,null,{"$f":"IFERROR(VLOOKUP(K14,'Hilfstabelle Spieler'!$O$4:$AC$12,3,0),\"\")/3","v":166.66666666666666},null,null,null,"Heute gespielt:",null,null,null,null,{"$f":"IFERROR(VLOOKUP(T14,'Hilfstabelle Spieler'!$O$4:$AC$12,4,0),\"\")/3","v":142.66666666666666},null,null,null,"Heute gespielt:",null,null,null,null,{"$f":"IFERROR(VLOOKUP(AC14,'Hilfstabelle Spieler'!$O$4:$AC$12,5,0),\"\")/3","v":143.66666666666666},null,null,null,"Heute gespielt:",null,null,null,null,{"$f":"IFERROR(VLOOKUP(AL14,'Hilfstabelle Spieler'!$O$4:$AC$12,6,0),\"\")/3","v":131}]
[null,{"$f":"+B107","v":"Ilona Wetzel"},null,null,null,null,{"$f":"IFERROR(VLOOKUP(B16,Hilfstabelle!$AZ$3:$BA$11,2,0),\"\")","v":153.75510204081633},null,null,null,{"$f":"+K107","v":"Annegret Schmidt"},null,null,null,null,{"$f":"IFERROR(VLOOKUP(K16,Hilfstabelle!$AZ$3:$BA$11,2,0),\"\")","v":137.50793650793651},null,null,null,{"$f":"+T107","v":"Ilona Wetzel"},null,null,null,null,{"$f":"IFERROR(VLOOKUP(T16,Hilfstabelle!$AZ$3:$BA$11,2,0),\"\")","v":153.75510204081633},null,null,null,{"$f":"+AC107","v":"Deniz Hagelstein"},null,null,null,null,{"$f":"IFERROR(VLOOKUP(AC16,Hilfstabelle!$AZ$3:$BA$11,2,0),\"\")","v":134.1904761904762},null,null,null,{"$f":"+AL107","v":"Deniz Hagelstein"},null,null,null,null,{"$f":"IFERROR(VLOOKUP(AL16,Hilfstabelle!$AZ$3:$BA$11,2,0),\"\")","v":134.1904761904762}]
[null,"Heute gespielt:",null,null,null,null,{"$f":"IFERROR(VLOOKUP(B16,'Hilfstabelle Spieler'!$O$4:$P$12,2,0),\"\")/3","v":140},null,null,null,"Heute gespielt:",null,null,null,null,{"$f":"IFERROR(VLOOKUP(K16,'Hilfstabelle Spieler'!$O$4:$AC$12,3,0),\"\")/3","v":137.66666666666666},null,null,null,"Heute gespielt:",null,null,null,null,{"$f":"IFERROR(VLOOKUP(T16,'Hilfstabelle Spieler'!$O$4:$AC$12,4,0),\"\")/3","v":141.33333333333334},null,null,null,"Heute gespielt:",null,null,null,null,{"$f":"IFERROR(VLOOKUP(AC16,'Hilfstabelle Spieler'!$O$4:$AC$12,5,0),\"\")/3","v":161.66666666666666},null,null,null,"Heute gespielt:",null,null,null,null,{"$f":"IFERROR(VLOOKUP(AL16,'Hilfstabelle Spieler'!$O$4:$AC$12,6,0),\"\")/3","v":{"$error":"#VALUE!"}}]
[null,{"$f":"+B108","v":"Michael Wetzel"},null,null,null,null,{"$f":"IFERROR(VLOOKUP(B18,Hilfstabelle!$AZ$3:$BA$11,2,0),\"\")","v":176.78571428571428},null,null,null,{"$f":"+K108","v":"Jörg Frahm"},null,null,null,null,{"$f":"IFERROR(VLOOKUP(K18,Hilfstabelle!$AZ$3:$BA$11,2,0),\"\")","v":170.96774193548387},null,null,null,{"$f":"+T108","v":"Annegret Schmidt"},null,null,null,null,{"$f":"IFERROR(VLOOKUP(T18,Hilfstabelle!$AZ$3:$BA$11,2,0),\"\")","v":137.50793650793651},null,null,null,{"$f":"+AC108","v":"Michael Wetzel"},null,null,null,null,{"$f":"IFERROR(VLOOKUP(AC18,Hilfstabelle!$AZ$3:$BA$11,2,0),\"\")","v":176.78571428571428},null,null,null,{"$f":"+AL108","v":"Ilona Wetzel"},null,null,null,null,{"$f":"IFERROR(VLOOKUP(AL18,Hilfstabelle!$AZ$3:$BA$11,2,0),\"\")","v":153.75510204081633}]
[null,"Heute gespielt:",null,null,null,null,{"$f":"IFERROR(VLOOKUP(B18,'Hilfstabelle Spieler'!$O$4:$P$12,2,0),\"\")/3","v":174.66666666666666},null,null,null,"Heute gespielt:",null,null,null,null,{"$f":"IFERROR(VLOOKUP(K18,'Hilfstabelle Spieler'!$O$4:$AC$12,3,0),\"\")/3","v":165.33333333333334},null,null,null,"Heute gespielt:",null,null,null,null,{"$f":"IFERROR(VLOOKUP(T18,'Hilfstabelle Spieler'!$O$4:$AC$12,4,0),\"\")/3","v":147.66666666666666},null,null,null,"Heute gespielt:",null,null,null,null,{"$f":"IFERROR(VLOOKUP(AC18,'Hilfstabelle Spieler'!$O$4:$AC$12,5,0),\"\")/3","v":162.66666666666666},null,null,null,"Heute gespielt:",null,null,null,null,{"$f":"IFERROR(VLOOKUP(AL18,'Hilfstabelle Spieler'!$O$4:$AC$12,6,0),\"\")/3","v":158.33333333333334}]
[null,{"$f":"+B109","v":"Kai Roßberg"},null,null,null,null,{"$f":"IFERROR(VLOOKUP(B20,Hilfstabelle!$AZ$3:$BA$11,2,0),\"\")","v":179.41666666666666},null,null,null,{"$f":"+K109","v":"Kai Roßberg"},null,null,null,null,{"$f":"IFERROR(VLOOKUP(K20,Hilfstabelle!$AZ$3:$BA$11,2,0),\"\")","v":179.41666666666666},null,null,null,{"$f":"+T109","v":"Kai Roßberg"},null,null,null,null,{"$f":"IFERROR(VLOOKUP(T20,Hilfstabelle!$AZ$3:$BA$11,2,0),\"\")","v":179.41666666666666},null,null,null,{"$f":"+AC109","v":"Mario Jurk"},null,null,null,null,{"$f":"IFERROR(VLOOKUP(AC20,Hilfstabelle!$AZ$3:$BA$11,2,0),\"\")","v":180.27777777777777},null,null,null,{"$f":"+AL109","v":"Kai Roßberg"},null,null,null,null,{"$f":"IFERROR(VLOOKUP(AL20,Hilfstabelle!$AZ$3:$BA$11,2,0),\"\")","v":179.41666666666666}]
[null,"Heute gespielt:",null,null,null,null,{"$f":"IFERROR(VLOOKUP(B20,'Hilfstabelle Spieler'!$O$4:$P$12,2,0),\"\")/3","v":182},null,null,null,"Heute gespielt:",null,null,null,null,{"$f":"IFERROR(VLOOKUP(K20,'Hilfstabelle Spieler'!$O$4:$AC$12,3,0),\"\")/3","v":182},null,null,null,"Heute gespielt:",null,null,null,null,{"$f":"IFERROR(VLOOKUP(T20,'Hilfstabelle Spieler'!$O$4:$AC$12,4,0),\"\")/3","v":184},null,null,null,"Heute gespielt:",null,null,null,null,{"$f":"IFERROR(VLOOKUP(AC20,'Hilfstabelle Spieler'!$O$4:$AC$12,5,0),\"\")/3","v":209.33333333333334},null,null,null,"Heute gespielt:",null,null,null,null,{"$f":"IFERROR(VLOOKUP(AL20,'Hilfstabelle Spieler'!$O$4:$AC$12,6,0),\"\")/3","v":157.33333333333334}]
[]
[null,"Zu erwartender \nMannschaftsschnitt:",null,null,null,null,{"$f":"SUM(G14+G16+G18+G20)/4","v":170.23130623217028},null,null,null,"Zu erwartender \nMannschaftsschnitt:",null,null,null,null,{"$f":"SUM(P14+P16+P18+P20)/4","v":156.1564196108551},null,null,null,"Zu erwartender \nMannschaftsschnitt:",null,null,null,null,{"$f":"SUM(Y14+Y16+Y18+Y20)/4","v":151.00325963718819},null,null,null,"Zu erwartender \nMannschaftsschnitt:",null,null,null,null,{"$f":"SUM(AH14+AH16+AH18+AH20)/4","v":156.99682539682539},null,null,null,"Zu erwartender \nMannschaftsschnitt:",null,null,null,null,{"$f":"SUM(AQ14+AQ16+AQ18+AQ20)/4","v":150.17389455782313}]
[null,null,null,null,null,null,{"$f":"SUM(G23*12)","v":2042.7756747860435},null,null,null,null,null,null,null,null,{"$f":"SUM(P23*12)","v":1873.8770353302612},null,null,null,null,null,null,null,null,{"$f":"SUM(Y23*12)","v":1812.0391156462583},null,null,null,null,null,null,null,null,{"$f":"SUM(AH23*12)","v":1883.9619047619046},null,null,null,null,null,null,null,null,{"$f":"SUM(AQ23*12)","v":1802.0867346938776}]
[null,"Tatsächliches\nErgebnis:",null,null,null,null,{"$f":"+G26/12","v":160.08333333333334},null,null,null,"Tatsächliches\nErgebnis:",null,null,null,null,{"$f":"+P26/12","v":162.91666666666666},null,null,null,"Tatsächliches\nErgebnis:",null,null,null,null,{"$f":"+Y26/12","v":153.91666666666666},null,null,null,"Tatsächliches\nErgebnis:",null,null,null,null,{"$f":"+AH26/12","v":169.33333333333334},null,null,null,"Tatsächliches\nErgebnis:",null,null,null,null,{"$f":"+AQ26/12","v":156.58333333333334}]
[null,null,null,null,null,null,{"$f":"+'Übersicht der Klasse B4'!H18","v":1921},null,null,null,null,null,null,null,null,{"$f":"+'Übersicht der Klasse B4'!I18","v":1955},null,null,null,null,null,null,null,null,{"$f":"+'Übersicht der Klasse B4'!J18","v":1847},null,null,null,null,null,null,null,null,{"$f":"+'Übersicht der Klasse B4'!K18","v":2032},null,null,null,null,null,null,null,null,{"$f":"+'Übersicht der Klasse B4'!L18","v":1879}]
[]
[null,"Reserve",null,null,null,null,null,null,null,null,"Reserve",null,null,null,null,null,null,null,null,"Reserve",null,null,null,null,null,null,null,null,"Reserve",null,null,null,null,null,null,null,null,"Reserve"]
[null,"Annegret Schmidt",null,null,null,null,{"$f":"IFERROR(VLOOKUP(B29,Hilfstabelle!$AZ$3:$BA$11,2,0),\"\")","v":137.50793650793651},null,null,null,"Mario Jurk",null,null,null,null,{"$f":"IFERROR(VLOOKUP(K29,Hilfstabelle!$AZ$3:$BA$11,2,0),\"\")","v":180.27777777777777},null,null,null,"Jörg Frahm",null,null,null,null,{"$f":"IFERROR(VLOOKUP(T29,Hilfstabelle!$AZ$3:$BA$11,2,0),\"\")","v":170.96774193548387},null,null,null,"Ilona Wetzel",null,null,null,null,{"$f":"IFERROR(VLOOKUP(AC29,Hilfstabelle!$AZ$3:$BA$11,2,0),\"\")","v":153.75510204081633},null,null,null,"Annegret Schmidt",null,null,null,null,{"$f":"IFERROR(VLOOKUP(AL29,Hilfstabelle!$AZ$3:$BA$11,2,0),\"\")","v":137.50793650793651}]
[null,"Matthias Nolte",null,null,null,null,{"$f":"IFERROR(VLOOKUP(B30,Hilfstabelle!$AZ$3:$BA$11,2,0),\"\")","v":133.33333333333334},null,null,null,"Deniz Hagelstein",null,null,null,null,{"$f":"IFERROR(VLOOKUP(K30,Hilfstabelle!$AZ$3:$BA$11,2,0),\"\")","v":134.1904761904762},null,null,null,"Mario Jurk",null,null,null,null,{"$f":"IFERROR(VLOOKUP(T30,Hilfstabelle!$AZ$3:$BA$11,2,0),\"\")","v":180.27777777777777},null,null,null,"Matthias Nolte",null,null,null,null,{"$f":"IFERROR(VLOOKUP(AC30,Hilfstabelle!$AZ$3:$BA$11,2,0),\"\")","v":133.33333333333334},null,null,null,"Mario Jurk",null,null,null,null,{"$f":"IFERROR(VLOOKUP(AL30,Hilfstabelle!$AZ$3:$BA$11,2,0),\"\")","v":180.27777777777777}]
[null,"Frank Nijholt",null,null,null,null,{"$f":"IFERROR(VLOOKUP(B31,Hilfstabelle!$AZ$3:$BA$11,2,0),\"\")","v":136.73333333333332},null,null,null,"Matthias Nolte",null,null,null,null,{"$f":"IFERROR(VLOOKUP(K31,Hilfstabelle!$AZ$3:$BA$11,2,0),\"\")","v":133.33333333333334},null,null,null,"Frank Nijholt",null,null,null,null,{"$f":"IFERROR(VLOOKUP(T31,Hilfstabelle!$AZ$3:$BA$11,2,0),\"\")","v":136.73333333333332},null,null,null,"Annegret Schmidt",null,null,null,null,{"$f":"IFERROR(VLOOKUP(AC31,Hilfstabelle!$AZ$3:$BA$11,2,0),\"\")","v":137.50793650793651},null,null,null,"Frank Nijholt",null,null,null,null,{"$f":"IFERROR(VLOOKUP(AL31,Hilfstabelle!$AZ$3:$BA$11,2,0),\"\")","v":136.73333333333332}]
[null,"Mario Jurk",null,null,null,null,{"$f":"IFERROR(VLOOKUP(B32,Hilfstabelle!$AZ$3:$BA$11,2,0),\"\")","v":180.27777777777777},null,null,null,"Michael Wetzel",null,null,null,null,{"$f":"IFERROR(VLOOKUP(K32,Hilfstabelle!$AZ$3:$BA$11,2,0),\"\")","v":176.78571428571428},null,null,null,"Deniz Hagelstein",null,null,null,null,{"$f":"IFERROR(VLOOKUP(T32,Hilfstabelle!$AZ$3:$BA$11,2,0),\"\")","v":134.1904761904762},null,null,null,"Kai Roßberg",null,null,null,null,{"$f":"IFERROR(VLOOKUP(AC32,Hilfstabelle!$AZ$3:$BA$11,2,0),\"\")","v":179.41666666666666},null,null,null,"Jörg Frahm",null,null,null,null,{"$f":"IFERROR(VLOOKUP(AL32,Hilfstabelle!$AZ$3:$BA$11,2,0),\"\")","v":170.96774193548387}]
[null,"Deniz Hagelstein",null,null,null,null,{"$f":"IFERROR(VLOOKUP(B33,Hilfstabelle!$AZ$3:$BA$11,2,0),\"\")","v":134.1904761904762},null,null,null,"Ilona Wetzel",null,null,null,null,{"$f":"IFERROR(VLOOKUP(K33,Hilfstabelle!$AZ$3:$BA$11,2,0),\"\")","v":153.75510204081633},null,null,null,"Michael Wetzel",null,null,null,null,{"$f":"IFERROR(VLOOKUP(T33,Hilfstabelle!$AZ$3:$BA$11,2,0),\"\")","v":176.78571428571428},null,null,null,"Jörg Frahm",null,null,null,null,{"$f":"IFERROR(VLOOKUP(AC33,Hilfstabelle!$AZ$3:$BA$11,2,0),\"\")","v":170.96774193548387},null,null,null,"Michael Wetzel",null,null,null,null,{"$f":"IFERROR(VLOOKUP(AL33,Hilfstabelle!$AZ$3:$BA$11,2,0),\"\")","v":176.78571428571428}]
[]
[null,"2026 / 6. - 14. Antritt"]
[]
[]
[null,"Bahn:",null,{"$f":"VLOOKUP(F39,Hilfstabelle!$BC$3:$BD$16,2,0)","v":"Wandsbek - (WB)"},null,null,null,null,null,null,"Bahn:",null,{"$f":"VLOOKUP(O39,Hilfstabelle!$BC$3:$BD$16,2,0)","v":"Othmarschen - (OT)"},null,null,null,null,null,null,"Bahn:",null,{"$f":"VLOOKUP(X39,Hilfstabelle!$BC$3:$BD$16,2,0)","v":"Wandsbek - (WB)"},null,null,null,null,null,null,"Bahn:",null,{"$f":"VLOOKUP(AG39,Hilfstabelle!$BC$3:$BD$16,2,0)","v":"Othmarschen - (OT)"},null,null,null,null,null,null,"Bahn:",null,{"$f":"VLOOKUP(AP39,Hilfstabelle!$BC$3:$BD$16,2,0)","v":"Wandsbek - (WB)"},null,null,null,null,null,null,"Bahn:",null,{"$f":"VLOOKUP(AY39,Hilfstabelle!$BC$3:$BD$16,2,0)","v":"Othmarschen - (OT)"}]
[null,"6.","Antritt",null,null,{"$f":"VLOOKUP(B39,Hilfstabelle!$A$5:$B$18,2,0)","v":"2025-11-18"},null,null,null,null,"7.","Antritt",null,null,{"$f":"VLOOKUP(K39,Hilfstabelle!$A$5:$B$18,2,0)","v":"2026-01-13"},null,null,null,null,"8.","Antritt",null,null,{"$f":"VLOOKUP(T39,Hilfstabelle!$A$5:$B$18,2,0)","v":"2026-01-27"},null,null,null,null,"9.","Antritt",null,null,{"$f":"VLOOKUP(AC39,Hilfstabelle!$A$5:$B$18,2,0)","v":"2026-02-10"},null,null,null,null,"10.","Antritt",null,null,{"$f":"VLOOKUP(AL39,Hilfstabelle!$A$5:$B$18,2,0)","v":"2026-02-24"},null,null,null,null,"11.","Antritt",null,null,{"$f":"VLOOKUP(AU39,Hilfstabelle!$A$5:$B$18,2,0)","v":"2026-03-10"}]
[null,{"$f":"+B115","v":"Frank Nijholt"},null,null,null,null,{"$f":"IFERROR(VLOOKUP(B40,Hilfstabelle!$AZ$3:$BA$11,2,0),\"\")","v":136.73333333333332},null,null,null,{"$f":"+K115","v":"Matthias Nolte"},null,null,null,null,{"$f":"IFERROR(VLOOKUP(K40,Hilfstabelle!$AZ$3:$BA$11,2,0),\"\")","v":133.33333333333334},null,null,null,{"$f":"+T115","v":"Ilona Wetzel"},null,null,null,null,{"$f":"IFERROR(VLOOKUP(T40,Hilfstabelle!$AZ$3:$BA$11,2,0),\"\")","v":153.75510204081633},null,null,null,{"$f":"+AC115","v":"Annegret Schmidt"},null,null,null,null,{"$f":"IFERROR(VLOOKUP(AC40,Hilfstabelle!$AZ$3:$BA$11,2,0),\"\")","v":137.50793650793651},null,null,null,{"$f":"+AL115","v":"Frank Nijholt"},null,null,null,null,{"$f":"IFERROR(VLOOKUP(AL40,Hilfstabelle!$AZ$3:$BA$11,2,0),\"\")","v":136.73333333333332},null,null,null,{"$f":"+B124","v":"Matthias Nolte"},null,null,null,null,{"$f":"IFERROR(VLOOKUP(AU40,Hilfstabelle!$AZ$3:$BA$11,2,0),\"\")","v":133.33333333333334}]
[null,"Heute gespielt:",null,null,null,null,{"$f":"IFERROR(VLOOKUP(B40,'Hilfstabelle Spieler'!$O$4:$AC$12,7,0),\"\")/3","v":{"$error":"#VALUE!"}},null,null,null,"Heute gespielt:",null,null,null,null,{"$f":"IFERROR(VLOOKUP(K40,'Hilfstabelle Spieler'!$O$4:$AC$12,8,0),\"\")/3","v":{"$error":"#VALUE!"}},null,null,null,"Heute gespielt:",null,null,null,null,{"$f":"IFERROR(VLOOKUP(T40,'Hilfstabelle Spieler'!$O$4:$AC$12,9,0),\"\")/3","v":{"$error":"#VALUE!"}},null,null,null,"Heute gespielt:",null,null,null,null,{"$f":"IFERROR(VLOOKUP(AC40,'Hilfstabelle Spieler'!$O$4:$AC$12,10,0),\"\")/3","v":{"$error":"#VALUE!"}},null,null,null,"Heute gespielt:",null,null,null,null,{"$f":"IFERROR(VLOOKUP(AL40,'Hilfstabelle Spieler'!$O$4:$AC$12,11,0),\"\")/3","v":{"$error":"#VALUE!"}},null,null,null,"Heute gespielt:",null,null,null,null,{"$f":"IFERROR(VLOOKUP(AU40,'Hilfstabelle Spieler'!$O$4:$AC$12,12,0),\"\")/3","v":{"$error":"#VALUE!"}}]
[null,{"$f":"+B116","v":"Ilona Wetzel"},null,null,null,null,{"$f":"IFERROR(VLOOKUP(B42,Hilfstabelle!$AZ$3:$BA$11,2,0),\"\")","v":153.75510204081633},null,null,null,{"$f":"+K116","v":"Frank Nijholt"},null,null,null,null,{"$f":"IFERROR(VLOOKUP(K42,Hilfstabelle!$AZ$3:$BA$11,2,0),\"\")","v":136.73333333333332},null,null,null,{"$f":"+T116","v":"Jörg Frahm"},null,null,null,null,{"$f":"IFERROR(VLOOKUP(T42,Hilfstabelle!$AZ$3:$BA$11,2,0),\"\")","v":170.96774193548387},null,null,null,{"$f":"+AC116","v":"Ilona Wetzel"},null,null,null,null,{"$f":"IFERROR(VLOOKUP(AC42,Hilfstabelle!$AZ$3:$BA$11,2,0),\"\")","v":153.75510204081633},null,null,null,{"$f":"+AL116","v":"Annegret Schmidt"},null,null,null,null,{"$f":"IFERROR(VLOOKUP(AL42,Hilfstabelle!$AZ$3:$BA$11,2,0),\"\")","v":137.50793650793651},null,null,null,{"$f":"+B125","v":"Deniz Hagelstein"},null,null,null,null,{"$f":"IFERROR(VLOOKUP(AU42,Hilfstabelle!$AZ$3:$BA$11,2,0),\"\")","v":134.1904761904762}]
[null,"Heute gespielt:",null,null,null,null,{"$f":"IFERROR(VLOOKUP(B42,'Hilfstabelle Spieler'!$O$4:$AC$12,7,0),\"\")/3","v":{"$error":"#VALUE!"}},null,null,null,"Heute gespielt:",null,null,null,null,{"$f":"IFERROR(VLOOKUP(K42,'Hilfstabelle Spieler'!$O$4:$AC$12,8,0),\"\")/3","v":{"$error":"#VALUE!"}},null,null,null,"Heute gespielt:",null,null,null,null,{"$f":"IFERROR(VLOOKUP(T42,'Hilfstabelle Spieler'!$O$4:$AC$12,9,0),\"\")/3","v":{"$error":"#VALUE!"}},null,null,null,"Heute gespielt:",null,null,null,null,{"$f":"IFERROR(VLOOKUP(AC42,'Hilfstabelle Spieler'!$O$4:$AC$12,10,0),\"\")/3","v":{"$error":"#VALUE!"}},null,null,null,"Heute gespielt:",null,null,null,null,{"$f":"IFERROR(VLOOKUP(AL42,'Hilfstabelle Spieler'!$O$4:$AC$12,11,0),\"\")/3","v":{"$error":"#VALUE!"}},null,null,null,"Heute gespielt:",null,null,null,null,{"$f":"IFERROR(VLOOKUP(AU42,'Hilfstabelle Spieler'!$O$4:$AC$12,12,0),\"\")/3","v":{"$error":"#VALUE!"}}]
[null,{"$f":"+B117","v":"Michael Wetzel"},null,null,null,null,{"$f":"IFERROR(VLOOKUP(B44,Hilfstabelle!$AZ$3:$BA$11,2,0),\"\")","v":176.78571428571428},null,null,null,{"$f":"+K117","v":"Annegret Schmidt"},null,null,null,null,{"$f":"IFERROR(VLOOKUP(K44,Hilfstabelle!$AZ$3:$BA$11,2,0),\"\")","v":137.50793650793651},null,null,null,{"$f":"+T117","v":"Kai Roßberg"},null,null,null,null,{"$f":"IFERROR(VLOOKUP(T44,Hilfstabelle!$AZ$3:$BA$11,2,0),\"\")","v":179.41666666666666},null,null,null,{"$f":"+AC117","v":"Jörg Frahm"},null,null,null,null,{"$f":"IFERROR(VLOOKUP(AC44,Hilfstabelle!$AZ$3:$BA$11,2,0),\"\")","v":170.96774193548387},null,null,null,{"$f":"+AL117","v":"Deniz Hagelstein"},null,null,null,null,{"$f":"IFERROR(VLOOKUP(AL44,Hilfstabelle!$AZ$3:$BA$11,2,0),\"\")","v":134.1904761904762},null,null,null,{"$f":"+B126","v":"Frank Nijholt"},null,null,null,null,{"$f":"IFERROR(VLOOKUP(AU44,Hilfstabelle!$AZ$3:$BA$11,2,0),\"\")","v":136.73333333333332}]
[null,"Heute gespielt:",null,null,null,null,{"$f":"IFERROR(VLOOKUP(B44,'Hilfstabelle Spieler'!$O$4:$AC$12,7,0),\"\")/3","v":{"$error":"#VALUE!"}},null,null,null,"Heute gespielt:",null,null,null,null,{"$f":"IFERROR(VLOOKUP(K44,'Hilfstabelle Spieler'!$O$4:$AC$12,8,0),\"\")/3","v":{"$error":"#VALUE!"}},null,null,null,"Heute gespielt:",null,null,null,null,{"$f":"IFERROR(VLOOKUP(T44,'Hilfstabelle Spieler'!$O$4:$AC$12,9,0),\"\")/3","v":{"$error":"#VALUE!"}},null,null,null,"Heute gespielt:",null,null,null,null,{"$f":"IFERROR(VLOOKUP(AC44,'Hilfstabelle Spieler'!$O$4:$AC$12,10,0),\"\")/3","v":{"$error":"#VALUE!"}},null,null,null,"Heute gespielt:",null,null,null,null,{"$f":"IFERROR(VLOOKUP(AL44,'Hilfstabelle Spieler'!$O$4:$AC$12,11,0),\"\")/3","v":{"$error":"#VALUE!"}},null,null,null,"Heute gespielt:",null,null,null,null,{"$f":"IFERROR(VLOOKUP(AU44,'Hilfstabelle Spieler'!$O$4:$AC$12,12,0),\"\")/3","v":{"$error":"#VALUE!"}}]
[null,{"$f":"+B118","v":"Mario Jurk"},null,null,null,null,{"$f":"IFERROR(VLOOKUP(B46,Hilfstabelle!$AZ$3:$BA$11,2,0),\"\")","v":180.27777777777777},null,null,null,{"$f":"+K118","v":"Mario Jurk"},null,null,null,null,{"$f":"IFERROR(VLOOKUP(K46,Hilfstabelle!$AZ$3:$BA$11,2,0),\"\")","v":180.27777777777777},null,null,null,{"$f":"+T118","v":"Mario Jurk"},null,null,null,null,{"$f":"IFERROR(VLOOKUP(T46,Hilfstabelle!$AZ$3:$BA$11,2,0),\"\")","v":180.27777777777777},null,null,null,{"$f":"+AC118","v":"Michael Wetzel"},null,null,null,null,{"$f":"IFERROR(VLOOKUP(AC46,Hilfstabelle!$AZ$3:$BA$11,2,0),\"\")","v":176.78571428571428},null,null,null,{"$f":"+AL118","v":"Michael Wetzel"},null,null,null,null,{"$f":"IFERROR(VLOOKUP(AL46,Hilfstabelle!$AZ$3:$BA$11,2,0),\"\")","v":176.78571428571428},null,null,null,{"$f":"+B127","v":"Mario Jurk"},null,null,null,null,{"$f":"IFERROR(VLOOKUP(AU46,Hilfstabelle!$AZ$3:$BA$11,2,0),\"\")","v":180.27777777777777}]
[null,"Heute gespielt:",null,null,null,null,{"$f":"IFERROR(VLOOKUP(B46,'Hilfstabelle Spieler'!$O$4:$AC$12,7,0),\"\")/3","v":{"$error":"#VALUE!"}},null,null,null,"Heute gespielt:",null,null,null,null,{"$f":"IFERROR(VLOOKUP(K46,'Hilfstabelle Spieler'!$O$4:$AC$12,8,0),\"\")/3","v":{"$error":"#VALUE!"}},null,null,null,"Heute gespielt:",null,null,null,null,{"$f":"IFERROR(VLOOKUP(T46,'Hilfstabelle Spieler'!$O$4:$AC$12,9,0),\"\")/3","v":{"$error":"#VALUE!"}},null,null,null,"Heute gespielt:",null,null,null,null,{"$f":"IFERROR(VLOOKUP(AC46,'Hilfstabelle Spieler'!$O$4:$AC$12,10,0),\"\")/3","v":{"$error":"#VALUE!"}},null,null,null,"Heute gespielt:",null,null,null,null,{"$f":"IFERROR(VLOOKUP(AL46,'Hilfstabelle Spieler'!$O$4:$AC$12,11,0),\"\")/3","v":{"$error":"#VALUE!"}},null,null,null,"Heute gespielt:",null,null,null,null,{"$f":"IFERROR(VLOOKUP(AU46,'Hilfstabelle Spieler'!$O$4:$AC$12,12,0),\"\")/3","v":{"$error":"#VALUE!"}}]
[]
[null,"Zu erwartender \nMannschaftsschnitt:",null,null,null,null,{"$f":"SUM(G40+G42+G44+G46)/4","v":161.88798185941042},null,null,null,"Zu erwartender \nMannschaftsschnitt:",null,null,null,null,{"$f":"SUM(P40+P42+P44+P46)/4","v":146.96309523809524},null,null,null,"Zu erwartender \nMannschaftsschnitt:",null,null,null,null,{"$f":"SUM(Y40+Y42+Y44+Y46)/4","v":171.10432210518616},null,null,null,"Zu erwartender \nMannschaftsschnitt:",null,null,null,null,{"$f":"SUM(AH40+AH42+AH44+AH46)/4","v":159.75412369248772},null,null,null,"Zu erwartender \nMannschaftsschnitt:",null,null,null,null,{"$f":"SUM(AQ40+AQ42+AQ44+AQ46)/4","v":146.30436507936508},null,null,null,"Zu erwartender \nMannschaftsschnitt:",null,null,null,null,{"$f":"SUM(AZ40+AZ42+AZ44+AZ46)/4","v":146.13373015873015}]
[null,null,null,null,null,null,{"$f":"SUM(G49*12)","v":1942.6557823129251},null,null,null,null,null,null,null,null,{"$f":"SUM(P49*12)","v":1763.5571428571429},null,null,null,null,null,null,null,null,{"$f":"SUM(Y49*12)","v":2053.2518652622339},null,null,null,null,null,null,null,null,{"$f":"SUM(AH49*12)","v":1917.0494843098527},null,null,null,null,null,null,null,null,{"$f":"SUM(AQ49*12)","v":1755.652380952381},null,null,null,null,null,null,null,null,{"$f":"SUM(AZ49*12)","v":1753.6047619047617}]
[null,"Tatsächliches\nErgebnis:",null,null,null,null,{"$f":"+G52/12","v":0},null,null,null,"Tatsächliches\nErgebnis:",null,null,null,null,{"$f":"+P52/12","v":0},null,null,null,"Tatsächliches\nErgebnis:",null,null,null,null,{"$f":"+Y52/12","v":0},null,null,null,"Tatsächliches\nErgebnis:",null,null,null,null,{"$f":"+AH52/12","v":0},null,null,null,"Tatsächliches\nErgebnis:",null,null,null,null,{"$f":"+AQ52/12","v":0},null,null,null,"Tatsächliches\nErgebnis:",null,null,null,null,{"$f":"+AZ52/12","v":0}]
[null,null,null,null,null,null,{"$f":"+'Übersicht der Klasse B4'!M18","v":0},null,null,null,null,null,null,null,null,{"$f":"+'Übersicht der Klasse B4'!N18","v":0},null,null,null,null,null,null,null,null,{"$f":"+'Übersicht der Klasse B4'!O18","v":0},null,null,null,null,null,null,null,null,{"$f":"+'Übersicht der Klasse B4'!P18","v":0},null,null,null,null,null,null,null,null,{"$f":"+'Übersicht der Klasse B4'!Q18","v":0},null,null,null,null,null,null,null,null,{"$f":"+'Übersicht der Klasse B4'!R18","v":0}]
[]
[null,"Reserve",null,null,null,null,null,null,null,null,"Reserve",null,null,null,null,null,null,null,null,"Reserve",null,null,null,null,null,null,null,null,"Reserve",null,null,null,null,null,null,null,null,"Reserve",null,null,null,null,null,null,null,null,"Reserve"]
[null,"Annegret Schmidt",null,null,null,null,{"$f":"IFERROR(VLOOKUP(B55,Hilfstabelle!$AZ$3:$BA$11,2,0),\"\")","v":137.50793650793651},null,null,null,"Deniz Hagelstein",null,null,null,null,{"$f":"IFERROR(VLOOKUP(K55,Hilfstabelle!$AZ$3:$BA$11,2,0),\"\")","v":134.1904761904762},null,null,null,"Annegret Schmidt",null,null,null,null,{"$f":"IFERROR(VLOOKUP(T55,Hilfstabelle!$AZ$3:$BA$11,2,0),\"\")","v":137.50793650793651},null,null,null,"Kai Roßberg",null,null,null,null,{"$f":"IFERROR(VLOOKUP(AC55,Hilfstabelle!$AZ$3:$BA$11,2,0),\"\")","v":179.41666666666666},null,null,null,"Kai Roßberg",null,null,null,null,{"$f":"IFERROR(VLOOKUP(AL55,Hilfstabelle!$AZ$3:$BA$11,2,0),\"\")","v":179.41666666666666},null,null,null,"Jörg Frahm",null,null,null,null,{"$f":"IFERROR(VLOOKUP(AU55,Hilfstabelle!$AZ$3:$BA$11,2,0),\"\")","v":170.96774193548387}]
[null,"Matthias Nolte",null,null,null,null,{"$f":"IFERROR(VLOOKUP(B56,Hilfstabelle!$AZ$3:$BA$11,2,0),\"\")","v":133.33333333333334},null,null,null,"Ilona Wetzel",null,null,null,null,{"$f":"IFERROR(VLOOKUP(K56,Hilfstabelle!$AZ$3:$BA$11,2,0),\"\")","v":153.75510204081633},null,null,null,"Deniz Hagelstein",null,null,null,null,{"$f":"IFERROR(VLOOKUP(T56,Hilfstabelle!$AZ$3:$BA$11,2,0),\"\")","v":134.1904761904762},null,null,null,"Frank Nijholt",null,null,null,null,{"$f":"IFERROR(VLOOKUP(AC56,Hilfstabelle!$AZ$3:$BA$11,2,0),\"\")","v":136.73333333333332},null,null,null,"Jörg Frahm",null,null,null,null,{"$f":"IFERROR(VLOOKUP(AL56,Hilfstabelle!$AZ$3:$BA$11,2,0),\"\")","v":170.96774193548387},null,null,null,"Michael Wetzel",null,null,null,null,{"$f":"IFERROR(VLOOKUP(AU56,Hilfstabelle!$AZ$3:$BA$11,2,0),\"\")","v":176.78571428571428}]
[null,"Deniz Hagelstein",null,null,null,null,{"$f":"IFERROR(VLOOKUP(B57,Hilfstabelle!$AZ$3:$BA$11,2,0),\"\")","v":134.1904761904762},null,null,null,"Jörg Frahm",null,null,null,null,{"$f":"IFERROR(VLOOKUP(K57,Hilfstabelle!$AZ$3:$BA$11,2,0),\"\")","v":170.96774193548387},null,null,null,"Frank Nijholt",null,null,null,null,{"$f":"IFERROR(VLOOKUP(T57,Hilfstabelle!$AZ$3:$BA$11,2,0),\"\")","v":136.73333333333332},null,null,null,"Mario Jurk",null,null,null,null,{"$f":"IFERROR(VLOOKUP(AC57,Hilfstabelle!$AZ$3:$BA$11,2,0),\"\")","v":180.27777777777777},null,null,null,"Mario Jurk",null,null,null,null,{"$f":"IFERROR(VLOOKUP(AL57,Hilfstabelle!$AZ$3:$BA$11,2,0),\"\")","v":180.27777777777777},null,null,null,"Ilona Wetzel",null,null,null,null,{"$f":"IFERROR(VLOOKUP(AU57,Hilfstabelle!$AZ$3:$BA$11,2,0),\"\")","v":153.75510204081633}]
[null,"Kai Roßberg",null,null,null,null,{"$f":"IFERROR(VLOOKUP(B58,Hilfstabelle!$AZ$3:$BA$11,2,0),\"\")","v":179.41666666666666},null,null,null,"Michael Wetzel",null,null,null,null,{"$f":"IFERROR(VLOOKUP(K58,Hilfstabelle!$AZ$3:$BA$11,2,0),\"\")","v":176.78571428571428},null,null,null,"Michael Wetzel",null,null,null,null,{"$f":"IFERROR(VLOOKUP(T58,Hilfstabelle!$AZ$3:$BA$11,2,0),\"\")","v":176.78571428571428},null,null,null,"Deniz Hagelstein",null,null,null,null,{"$f":"IFERROR(VLOOKUP(AC58,Hilfstabelle!$AZ$3:$BA$11,2,0),\"\")","v":134.1904761904762},null,null,null,"Ilona Wetzel",null,null,null,null,{"$f":"IFERROR(VLOOKUP(AL58,Hilfstabelle!$AZ$3:$BA$11,2,0),\"\")","v":153.75510204081633},null,null,null,"Annegret Schmidt",null,null,null,null,{"$f":"IFERROR(VLOOKUP(AU58,Hilfstabelle!$AZ$3:$BA$11,2,0),\"\")","v":137.50793650793651}]
[null,"Jörg Frahm",null,null,null,null,{"$f":"IFERROR(VLOOKUP(B59,Hilfstabelle!$AZ$3:$BA$11,2,0),\"\")","v":170.96774193548387},null,null,null,"Kai Roßberg",null,null,null,null,{"$f":"IFERROR(VLOOKUP(K59,Hilfstabelle!$AZ$3:$BA$11,2,0),\"\")","v":179.41666666666666},null,null,null,"Matthias Nolte",null,null,null,null,{"$f":"IFERROR(VLOOKUP(T59,Hilfstabelle!$AZ$3:$BA$11,2,0),\"\")","v":133.33333333333334},null,null,null,"Matthias Nolte",null,null,null,null,{"$f":"IFERROR(VLOOKUP(AC59,Hilfstabelle!$AZ$3:$BA$11,2,0),\"\")","v":133.33333333333334},null,null,null,"Matthias Nolte",null,null,null,null,{"$f":"IFERROR(VLOOKUP(AL59,Hilfstabelle!$AZ$3:$BA$11,2,0),\"\")","v":133.33333333333334},null,null,null,"Kai Roßberg",null,null,null,null,{"$f":"IFERROR(VLOOKUP(AU59,Hilfstabelle!$AZ$3:$BA$11,2,0),\"\")","v":179.41666666666666}]
[]
[]
[null,"Bahn:",null,{"$f":"VLOOKUP(F63,Hilfstabelle!$BC$3:$BD$16,2,0)","v":"Wandsbek - (WB)"},null,null,null,null,null,null,"Bahn:",null,{"$f":"VLOOKUP(O63,Hilfstabelle!$BC$3:$BD$16,2,0)","v":"Othmarschen - (OT)"},null,null,null,null,null,null,"Bahn:",null,{"$f":"VLOOKUP(X63,Hilfstabelle!$BC$3:$BD$16,2,0)","v":"Wandsbek - (WB)"}]
[null,"12.","Antritt",null,null,{"$f":"VLOOKUP(B63,Hilfstabelle!$A$5:$B$18,2,0)","v":"2026-03-24"},null,null,null,null,"13.","Antritt",null,null,{"$f":"VLOOKUP(K63,Hilfstabelle!$A$5:$B$18,2,0)","v":"2026-04-07"},null,null,null,null,"14.","Antritt",null,null,{"$f":"VLOOKUP(T63,Hilfstabelle!$A$5:$B$18,2,0)","v":"2026-04-21"}]
[null,{"$f":"+K124","v":"Deniz Hagelstein"},null,null,null,null,{"$f":"IFERROR(VLOOKUP(B64,Hilfstabelle!$AZ$3:$BA$11,2,0),\"\")","v":134.1904761904762},null,null,null,{"$f":"+T124","v":"Matthias Nolte"},null,null,null,null,{"$f":"IFERROR(VLOOKUP(K64,Hilfstabelle!$AZ$3:$BA$11,2,0),\"\")","v":133.33333333333334},null,null,null,{"$f":"+AC124","v":"Deniz Hagelstein"},null,null,null,null,{"$f":"IFERROR(VLOOKUP(T64,Hilfstabelle!$AZ$3:$BA$11,2,0),\"\")","v":134.1904761904762}]
[null,"Heute gespielt:",null,null,null,null,{"$f":"IFERROR(VLOOKUP(B64,'Hilfstabelle Spieler'!$O$4:$AC$12,13,0),\"\")/3","v":{"$error":"#VALUE!"}},null,null,null,"Heute gespielt:",null,null,null,null,{"$f":"IFERROR(VLOOKUP(K64,'Hilfstabelle Spieler'!$O$4:$AC$12,14,0),\"\")/3","v":{"$error":"#VALUE!"}},null,null,null,"Heute gespielt:",null,null,null,null,{"$f":"IFERROR(VLOOKUP(T64,'Hilfstabelle Spieler'!$O$4:$AC$12,15,0),\"\")/3","v":{"$error":"#VALUE!"}}]
[null,{"$f":"+K125","v":"Annegret Schmidt"},null,null,null,null,{"$f":"IFERROR(VLOOKUP(B66,Hilfstabelle!$AZ$3:$BA$11,2,0),\"\")","v":137.50793650793651},null,null,null,{"$f":"+T125","v":"Jörg Frahm"},null,null,null,null,{"$f":"IFERROR(VLOOKUP(K66,Hilfstabelle!$AZ$3:$BA$11,2,0),\"\")","v":170.96774193548387},null,null,null,{"$f":"+AC125","v":"Ilona Wetzel"},null,null,null,null,{"$f":"IFERROR(VLOOKUP(T66,Hilfstabelle!$AZ$3:$BA$11,2,0),\"\")","v":153.75510204081633}]
[null,"Heute gespielt:",null,null,null,null,{"$f":"IFERROR(VLOOKUP(B66,'Hilfstabelle Spieler'!$O$4:$AC$12,13,0),\"\")/3","v":{"$error":"#VALUE!"}},null,null,null,"Heute gespielt:",null,null,null,null,{"$f":"IFERROR(VLOOKUP(K66,'Hilfstabelle Spieler'!$O$4:$AC$12,14,0),\"\")/3","v":{"$error":"#VALUE!"}},null,null,null,"Heute gespielt:",null,null,null,null,{"$f":"IFERROR(VLOOKUP(T66,'Hilfstabelle Spieler'!$O$4:$AC$12,15,0),\"\")/3","v":{"$error":"#VALUE!"}}]
[null,{"$f":"+K126","v":"Kai Roßberg"},null,null,null,null,{"$f":"IFERROR(VLOOKUP(B68,Hilfstabelle!$AZ$3:$BA$11,2,0),\"\")","v":179.41666666666666},null,null,null,{"$f":"+T126","v":"Michael Wetzel"},null,null,null,null,{"$f":"IFERROR(VLOOKUP(K68,Hilfstabelle!$AZ$3:$BA$11,2,0),\"\")","v":176.78571428571428},null,null,null,{"$f":"+AC126","v":"Jörg Frahm"},null,null,null,null,{"$f":"IFERROR(VLOOKUP(T68,Hilfstabelle!$AZ$3:$BA$11,2,0),\"\")","v":170.96774193548387}]
[null,"Heute gespielt:",null,null,null,null,{"$f":"IFERROR(VLOOKUP(B68,'Hilfstabelle Spieler'!$O$4:$AC$12,13,0),\"\")/3","v":{"$error":"#VALUE!"}},null,null,null,"Heute gespielt:",null,null,null,null,{"$f":"IFERROR(VLOOKUP(K68,'Hilfstabelle Spieler'!$O$4:$AC$12,14,0),\"\")/3","v":{"$error":"#VALUE!"}},null,null,null,"Heute gespielt:",null,null,null,null,{"$f":"IFERROR(VLOOKUP(T68,'Hilfstabelle Spieler'!$O$4:$AC$12,15,0),\"\")/3","v":{"$error":"#VALUE!"}}]
[null,{"$f":"+K127","v":"Mario Jurk"},null,null,null,null,{"$f":"IFERROR(VLOOKUP(B70,Hilfstabelle!$AZ$3:$BA$11,2,0),\"\")","v":180.27777777777777},null,null,null,{"$f":"+T127","v":"Mario Jurk"},null,null,null,null,{"$f":"IFERROR(VLOOKUP(K70,Hilfstabelle!$AZ$3:$BA$11,2,0),\"\")","v":180.27777777777777},null,null,null,{"$f":"+AC127","v":"Michael Wetzel"},null,null,null,null,{"$f":"IFERROR(VLOOKUP(T70,Hilfstabelle!$AZ$3:$BA$11,2,0),\"\")","v":176.78571428571428}]
[null,"Heute gespielt:",null,null,null,null,{"$f":"IFERROR(VLOOKUP(B70,'Hilfstabelle Spieler'!$O$4:$AC$12,13,0),\"\")/3","v":{"$error":"#VALUE!"}},null,null,null,"Heute gespielt:",null,null,null,null,{"$f":"IFERROR(VLOOKUP(K70,'Hilfstabelle Spieler'!$O$4:$AC$12,14,0),\"\")/3","v":{"$error":"#VALUE!"}},null,null,null,"Heute gespielt:",null,null,null,null,{"$f":"IFERROR(VLOOKUP(T70,'Hilfstabelle Spieler'!$O$4:$AC$12,15,0),\"\")/3","v":{"$error":"#VALUE!"}}]
[]
[null,"Zu erwartender \nMannschaftsschnitt:",null,null,null,null,{"$f":"SUM(G64+G66+G68+G70)/4","v":157.84821428571428},null,null,null,"Zu erwartender \nMannschaftsschnitt:",null,null,null,null,{"$f":"SUM(P64+P66+P68+P70)/4","v":165.3411418330773},null,null,null,"Zu erwartender \nMannschaftsschnitt:",null,null,null,null,{"$f":"SUM(Y64+Y66+Y68+Y70)/4","v":158.92475861312266}]
[null,null,null,null,null,null,{"$f":"SUM(G73*12)","v":1894.1785714285713},null,null,null,null,null,null,null,null,{"$f":"SUM(P73*12)","v":1984.0937019969276},null,null,null,null,null,null,null,null,1907.097103357472]
[null,"Tatsächliches\nErgebnis:",null,null,null,null,{"$f":"+G76/12","v":0},null,null,null,"Tatsächliches\nErgebnis:",null,null,null,null,{"$f":"+P76/12","v":0},null,null,null,"Tatsächliches\nErgebnis:",null,null,null,null,{"$f":"+Y76/12","v":0}]
[null,null,null,null,null,null,{"$f":"+'Übersicht der Klasse B4'!S18","v":0},null,null,null,null,null,null,null,null,{"$f":"+'Übersicht der Klasse B4'!T18","v":0},null,null,null,null,null,null,null,null,{"$f":"+'Übersicht der Klasse B4'!U18","v":0}]
[]
[null,"Reserve",null,null,null,null,null,null,null,null,"Reserve",null,null,null,null,null,null,null,null,"Reserve"]
[null,"Frank Nijholt",null,null,null,null,{"$f":"IFERROR(VLOOKUP(B79,Hilfstabelle!$AZ$3:$BA$11,2,0),\"\")","v":136.73333333333332},null,null,null,"Annegret Schmidt",null,null,null,null,{"$f":"IFERROR(VLOOKUP(K79,Hilfstabelle!$AZ$3:$BA$11,2,0),\"\")","v":137.50793650793651},null,null,null,"Frank Nijholt",null,null,null,null,{"$f":"IFERROR(VLOOKUP(T79,Hilfstabelle!$AZ$3:$BA$11,2,0),\"\")","v":136.73333333333332}]
[null,"Ilona Wetzel",null,null,null,null,{"$f":"IFERROR(VLOOKUP(B80,Hilfstabelle!$AZ$3:$BA$11,2,0),\"\")","v":153.75510204081633},null,null,null,"Ilona Wetzel",null,null,null,null,{"$f":"IFERROR(VLOOKUP(K80,Hilfstabelle!$AZ$3:$BA$11,2,0),\"\")","v":153.75510204081633},null,null,null,"Annegret Schmidt",null,null,null,null,{"$f":"IFERROR(VLOOKUP(T80,Hilfstabelle!$AZ$3:$BA$11,2,0),\"\")","v":137.50793650793651}]
[null,"Michael Wetzel",null,null,null,null,{"$f":"IFERROR(VLOOKUP(B81,Hilfstabelle!$AZ$3:$BA$11,2,0),\"\")","v":176.78571428571428},null,null,null,"Frank Nijholt",null,null,null,null,{"$f":"IFERROR(VLOOKUP(K81,Hilfstabelle!$AZ$3:$BA$11,2,0),\"\")","v":136.73333333333332},null,null,null,"Kai Roßberg",null,null,null,null,{"$f":"IFERROR(VLOOKUP(T81,Hilfstabelle!$AZ$3:$BA$11,2,0),\"\")","v":179.41666666666666}]
[null,"Matthias Nolte",null,null,null,null,{"$f":"IFERROR(VLOOKUP(B82,Hilfstabelle!$AZ$3:$BA$11,2,0),\"\")","v":133.33333333333334},null,null,null,"Deniz Hagelstein",null,null,null,null,{"$f":"IFERROR(VLOOKUP(K82,Hilfstabelle!$AZ$3:$BA$11,2,0),\"\")","v":134.1904761904762},null,null,null,"Mario Jurk",null,null,null,null,{"$f":"IFERROR(VLOOKUP(T82,Hilfstabelle!$AZ$3:$BA$11,2,0),\"\")","v":180.27777777777777}]
[null,"Jörg Frahm",null,null,null,null,{"$f":"IFERROR(VLOOKUP(B83,Hilfstabelle!$AZ$3:$BA$11,2,0),\"\")","v":170.96774193548387},null,null,null,"Kai Roßberg",null,null,null,null,{"$f":"IFERROR(VLOOKUP(K83,Hilfstabelle!$AZ$3:$BA$11,2,0),\"\")","v":179.41666666666666},null,null,null,"Matthias Nolte",null,null,null,null,{"$f":"IFERROR(VLOOKUP(T83,Hilfstabelle!$AZ$3:$BA$11,2,0),\"\")","v":133.33333333333334}]
[]
[null,"Übersicht"]
[]
[null,{"$f":"+Hilfstabelle!S5","v":"OT"},null,null,null,{"$f":"+Hilfstabelle!S6","v":"WB"},null,null,null,{"$f":"+Hilfstabelle!S7","v":"OT"},null,null,null,{"$f":"+Hilfstabelle!S8","v":"WB"},null,null,null,{"$f":"+Hilfstabelle!S9","v":"OT"},null,null,null,{"$f":"+Hilfstabelle!S10","v":"WB"},null,null,null,{"$f":"+Hilfstabelle!S11","v":"OT"},null,null,null,{"$f":"+Hilfstabelle!S12","v":"WB"},null,null,null,{"$f":"+Hilfstabelle!S13","v":"OT"},null,null,null,{"$f":"+Hilfstabelle!S14","v":"WB"},null,null,null,{"$f":"+Hilfstabelle!S15","v":"OT"},null,null,null,{"$f":"+Hilfstabelle!S16","v":"WB"},null,null,null,{"$f":"+Hilfstabelle!S17","v":"OT"},null,null,null,{"$f":"+Hilfstabelle!S18","v":"WB"}]
[null,"1. Antritt",null,null,null,"2. Antritt",null,null,null,"3. Antritt",null,null,null,"4. Antritt",null,null,null,"5. Antritt",null,null,null,"6. Antritt",null,null,null,"7. Antritt",null,null,null,"8. Antritt",null,null,null,"9. Antritt",null,null,null,"10. Antritt",null,null,null,"11. Antritt",null,null,null,"12. Antritt",null,null,null,"13. Antritt",null,null,null,"14. Antritt"]
[null,{"$f":"+F13","v":"2025-09-09"},null,null,null,{"$f":"+O13","v":"2025-09-23"},null,null,null,{"$f":"+X13","v":"2025-10-07"},null,null,null,{"$f":"+AG13","v":"2025-10-21"},null,null,null,{"$f":"+AP13","v":"2025-11-04"},null,null,null,{"$f":"+F39","v":"2025-11-18"},null,null,null,{"$f":"+O39","v":"2026-01-13"},null,null,null,{"$f":"+X39","v":"2026-01-27"},null,null,null,{"$f":"+AG39","v":"2026-02-10"},null,null,null,{"$f":"+AP39","v":"2026-02-24"},null,null,null,{"$f":"+AY39","v":"2026-03-10"},null,null,null,{"$f":"+F63","v":"2026-03-24"},null,null,null,{"$f":"+O63","v":"2026-04-07"},null,null,null,{"$f":"+X63","v":"2026-04-21"}]
[null,{"$f":"IFERROR(_xlfn.IFS(B14=\"Annegret Schmidt\",\"Anne\",B14=\"Ilona Wetzel\",\"Ilona\",B14=\"Michael Wetzel\",\"Michael\",B14=\"Mario Jurk\",\"Mario\",B14=\"Kai Roßberg\",\"Kai\",B14=\"Deniz Hagelstein\",\"Deniz\",B14=\"Frank Nijholt\",\"Frank\",B14=\"Matthias Nolte\",\"Matthias\",B14=\"Jörg Frahm\",\"Jörg\"),\"\")","v":"Jörg"},null,null,null,{"$f":"_xlfn.IFS(K14=\"Annegret Schmidt\",\"Anne\",K14=\"Ilona Wetzel\",\"Ilona\",K14=\"Michael Wetzel\",\"Michael\",K14=\"Mario Jurk\",\"Mario\",K14=\"Kai Roßberg\",\"Kai\",K14=\"Deniz Hagelstein\",\"Deniz\",K14=\"Frank Nijholt\",\"Frank\",K14=\"Matthias Nolte\",\"Matthias\",K14=\"Jörg Frahm\",\"Jörg\")","v":"Frank"},null,null,null,{"$f":"_xlfn.IFS(T14=\"Annegret Schmidt\",\"Anne\",T14=\"Ilona Wetzel\",\"Ilona\",T14=\"Michael Wetzel\",\"Michael\",T14=\"Mario Jurk\",\"Mario\",T14=\"Kai Roßberg\",\"Kai\",T14=\"Deniz Hagelstein\",\"Deniz\",T14=\"Frank Nijholt\",\"Frank\",T14=\"Matthias Nolte\",\"Matthias\",T14=\"Jörg Frahm\",\"Jörg\")","v":"Matthias"},null,null,null,{"$f":"_xlfn.IFS(AC14=\"Annegret Schmidt\",\"Anne\",AC14=\"Ilona Wetzel\",\"Ilona\",AC14=\"Michael Wetzel\",\"Michael\",AC14=\"Mario Jurk\",\"Mario\",AC14=\"Kai Roßberg\",\"Kai\",AC14=\"Deniz Hagelstein\",\"Deniz\",AC14=\"Frank Nijholt\",\"Frank\",AC14=\"Matthias Nolte\",\"Matthias\",AC14=\"Jörg Frahm\",\"Jörg\")","v":"Frank"},null,null,null,{"$f":"_xlfn.IFS(AL14=\"Annegret Schmidt\",\"Anne\",AL14=\"Ilona Wetzel\",\"Ilona\",AL14=\"Michael Wetzel\",\"Michael\",AL14=\"Mario Jurk\",\"Mario\",AL14=\"Kai Roßberg\",\"Kai\",AL14=\"Deniz Hagelstein\",\"Deniz\",AL14=\"Frank Nijholt\",\"Frank\",AL14=\"Matthias Nolte\",\"Matthias\",AL14=\"Jörg Frahm\",\"Jörg\")","v":"Matthias"},null,null,null,{"$f":"_xlfn.IFS(B40=\"Annegret Schmidt\",\"Anne\",B40=\"Ilona Wetzel\",\"Ilona\",B40=\"Michael Wetzel\",\"Michael\",B40=\"Mario Jurk\",\"Mario\",B40=\"Kai Roßberg\",\"Kai\",B40=\"Deniz Hagelstein\",\"Deniz\",B40=\"Frank Nijholt\",\"Frank\",B40=\"Matthias Nolte\",\"Matthias\",B40=\"Jörg Frahm\",\"Jörg\")","v":"Frank"},null,null,null,{"$f":"_xlfn.IFS(K40=\"Annegret Schmidt\",\"Anne\",K40=\"Ilona Wetzel\",\"Ilona\",K40=\"Michael Wetzel\",\"Michael\",K40=\"Mario Jurk\",\"Mario\",K40=\"Kai Roßberg\",\"Kai\",K40=\"Deniz Hagelstein\",\"Deniz\",K40=\"Frank Nijholt\",\"Frank\",K40=\"Matthias Nolte\",\"Matthias\",K40=\"Jörg Frahm\",\"Jörg\")","v":"Matthias"},null,null,null,{"$f":"_xlfn.IFS(T40=\"Annegret Schmidt\",\"Anne\",T40=\"Ilona Wetzel\",\"Ilona\",T40=\"Michael Wetzel\",\"Michael\",T40=\"Mario Jurk\",\"Mario\",T40=\"Kai Roßberg\",\"Kai\",T40=\"Deniz Hagelstein\",\"Deniz\",T40=\"Frank Nijholt\",\"Frank\",T40=\"Matthias Nolte\",\"Matthias\",T40=\"Jörg Frahm\",\"Jörg\")","v":"Ilona"},null,null,null,{"$f":"_xlfn.IFS(AC40=\"Annegret Schmidt\",\"Anne\",AC40=\"Ilona Wetzel\",\"Ilona\",AC40=\"Michael Wetzel\",\"Michael\",AC40=\"Mario Jurk\",\"Mario\",AC40=\"Kai Roßberg\",\"Kai\",AC40=\"Deniz Hagelstein\",\"Deniz\",AC40=\"Frank Nijholt\",\"Frank\",AC40=\"Matthias Nolte\",\"Matthias\",AC40=\"Jörg Frahm\",\"Jörg\")","v":"Anne"},null,null,null,{"$f":"_xlfn.IFS(AL40=\"Annegret Schmidt\",\"Anne\",AL40=\"Ilona Wetzel\",\"Ilona\",AL40=\"Michael Wetzel\",\"Michael\",AL40=\"Mario Jurk\",\"Mario\",AL40=\"Kai Roßberg\",\"Kai\",AL40=\"Deniz Hagelstein\",\"Deniz\",AL40=\"Frank Nijholt\",\"Frank\",AL40=\"Matthias Nolte\",\"Matthias\",AL40=\"Jörg Frahm\",\"Jörg\")","v":"Frank"},null,null,null,{"$f":"_xlfn.IFS(AU40=\"Annegret Schmidt\",\"Anne\",AU40=\"Ilona Wetzel\",\"Ilona\",AU40=\"Michael Wetzel\",\"Michael\",AU40=\"Mario Jurk\",\"Mario\",AU40=\"Kai Roßberg\",\"Kai\",AU40=\"Deniz Hagelstein\",\"Deniz\",AU40=\"Frank Nijholt\",\"Frank\",AU40=\"Matthias Nolte\",\"Matthias\",AU40=\"Jörg Frahm\",\"Jörg\")","v":"Matthias"},null,null,null,{"$f":"_xlfn.IFS(B64=\"Annegret Schmidt\",\"Anne\",B64=\"Ilona Wetzel\",\"Ilona\",B64=\"Michael Wetzel\",\"Michael\",B64=\"Mario Jurk\",\"Mario\",B64=\"Kai Roßberg\",\"Kai\",B64=\"Deniz Hagelstein\",\"Deniz\",B64=\"Frank Nijholt\",\"Frank\",B64=\"Matthias Nolte\",\"Matthias\",B64=\"Jörg Frahm\",\"Jörg\")","v":"Deniz"},null,null,null,{"$f":"_xlfn.IFS(K64=\"Annegret Schmidt\",\"Anne\",K64=\"Ilona Wetzel\",\"Ilona\",K64=\"Michael Wetzel\",\"Michael\",K64=\"Mario Jurk\",\"Mario\",K64=\"Kai Roßberg\",\"Kai\",K64=\"Deniz Hagelstein\",\"Deniz\",K64=\"Frank Nijholt\",\"Frank\",K64=\"Matthias Nolte\",\"Matthias\",K64=\"Jörg Frahm\",\"Jörg\")","v":"Matthias"},null,null,null,{"$f":"_xlfn.IFS(T64=\"Annegret Schmidt\",\"Anne\",T64=\"Ilona Wetzel\",\"Ilona\",T64=\"Michael Wetzel\",\"Michael\",T64=\"Mario Jurk\",\"Mario\",T64=\"Kai Roßberg\",\"Kai\",T64=\"Deniz Hagelstein\",\"Deniz\",T64=\"Frank Nijholt\",\"Frank\",T64=\"Matthias Nolte\",\"Matthias\",T64=\"Jörg Frahm\",\"Jörg\")","v":"Deniz"}]
[null,{"$f":"IFERROR(_xlfn.IFS(B16=\"Annegret Schmidt\",\"Anne\",B16=\"Ilona Wetzel\",\"Ilona\",B16=\"Michael Wetzel\",\"Michael\",B16=\"Mario Jurk\",\"Mario\",B16=\"Kai Roßberg\",\"Kai\",B16=\"Deniz Hagelstein\",\"Deniz\",B16=\"Frank Nijholt\",\"Frank\",B16=\"Matthias Nolte\",\"Matthias\",B16=\"Jörg Frahm\",\"Jörg\"),\"\")","v":"Ilona"},null,null,null,{"$f":"_xlfn.IFS(K16=\"Annegret Schmidt\",\"Anne\",K16=\"Ilona Wetzel\",\"Ilona\",K16=\"Michael Wetzel\",\"Michael\",K16=\"Mario Jurk\",\"Mario\",K16=\"Kai Roßberg\",\"Kai\",K16=\"Deniz Hagelstein\",\"Deniz\",K16=\"Frank Nijholt\",\"Frank\",K16=\"Matthias Nolte\",\"Matthias\",K16=\"Jörg Frahm\",\"Jörg\")","v":"Anne"},null,null,null,{"$f":"_xlfn.IFS(T16=\"Annegret Schmidt\",\"Anne\",T16=\"Ilona Wetzel\",\"Ilona\",T16=\"Michael Wetzel\",\"Michael\",T16=\"Mario Jurk\",\"Mario\",T16=\"Kai Roßberg\",\"Kai\",T16=\"Deniz Hagelstein\",\"Deniz\",T16=\"Frank Nijholt\",\"Frank\",T16=\"Matthias Nolte\",\"Matthias\",T16=\"Jörg Frahm\",\"Jörg\")","v":"Ilona"},null,null,null,{"$f":"_xlfn.IFS(AC16=\"Annegret Schmidt\",\"Anne\",AC16=\"Ilona Wetzel\",\"Ilona\",AC16=\"Michael Wetzel\",\"Michael\",AC16=\"Mario Jurk\",\"Mario\",AC16=\"Kai Roßberg\",\"Kai\",AC16=\"Deniz Hagelstein\",\"Deniz\",AC16=\"Frank Nijholt\",\"Frank\",AC16=\"Matthias Nolte\",\"Matthias\",AC16=\"Jörg Frahm\",\"Jörg\")","v":"Deniz"},null,null,null,{"$f":"_xlfn.IFS(AL16=\"Annegret Schmidt\",\"Anne\",AL16=\"Ilona Wetzel\",\"Ilona\",AL16=\"Michael Wetzel\",\"Michael\",AL16=\"Mario Jurk\",\"Mario\",AL16=\"Kai Roßberg\",\"Kai\",AL16=\"Deniz Hagelstein\",\"Deniz\",AL16=\"Frank Nijholt\",\"Frank\",AL16=\"Matthias Nolte\",\"Matthias\",AL16=\"Jörg Frahm\",\"Jörg\")","v":"Deniz"},null,null,null,{"$f":"_xlfn.IFS(B42=\"Annegret Schmidt\",\"Anne\",B42=\"Ilona Wetzel\",\"Ilona\",B42=\"Michael Wetzel\",\"Michael\",B42=\"Mario Jurk\",\"Mario\",B42=\"Kai Roßberg\",\"Kai\",B42=\"Deniz Hagelstein\",\"Deniz\",B42=\"Frank Nijholt\",\"Frank\",B42=\"Matthias Nolte\",\"Matthias\",B42=\"Jörg Frahm\",\"Jörg\")","v":"Ilona"},null,null,null,{"$f":"_xlfn.IFS(K42=\"Annegret Schmidt\",\"Anne\",K42=\"Ilona Wetzel\",\"Ilona\",K42=\"Michael Wetzel\",\"Michael\",K42=\"Mario Jurk\",\"Mario\",K42=\"Kai Roßberg\",\"Kai\",K42=\"Deniz Hagelstein\",\"Deniz\",K42=\"Frank Nijholt\",\"Frank\",K42=\"Matthias Nolte\",\"Matthias\",K42=\"Jörg Frahm\",\"Jörg\")","v":"Frank"},null,null,null,{"$f":"_xlfn.IFS(T42=\"Annegret Schmidt\",\"Anne\",T42=\"Ilona Wetzel\",\"Ilona\",T42=\"Michael Wetzel\",\"Michael\",T42=\"Mario Jurk\",\"Mario\",T42=\"Kai Roßberg\",\"Kai\",T42=\"Deniz Hagelstein\",\"Deniz\",T42=\"Frank Nijholt\",\"Frank\",T42=\"Matthias Nolte\",\"Matthias\",T42=\"Jörg Frahm\",\"Jörg\")","v":"Jörg"},null,null,null,{"$f":"_xlfn.IFS(AC42=\"Annegret Schmidt\",\"Anne\",AC42=\"Ilona Wetzel\",\"Ilona\",AC42=\"Michael Wetzel\",\"Michael\",AC42=\"Mario Jurk\",\"Mario\",AC42=\"Kai Roßberg\",\"Kai\",AC42=\"Deniz Hagelstein\",\"Deniz\",AC42=\"Frank Nijholt\",\"Frank\",AC42=\"Matthias Nolte\",\"Matthias\",AC42=\"Jörg Frahm\",\"Jörg\")","v":"Ilona"},null,null,null,{"$f":"_xlfn.IFS(AL42=\"Annegret Schmidt\",\"Anne\",AL42=\"Ilona Wetzel\",\"Ilona\",AL42=\"Michael Wetzel\",\"Michael\",AL42=\"Mario Jurk\",\"Mario\",AL42=\"Kai Roßberg\",\"Kai\",AL42=\"Deniz Hagelstein\",\"Deniz\",AL42=\"Frank Nijholt\",\"Frank\",AL42=\"Matthias Nolte\",\"Matthias\",AL42=\"Jörg Frahm\",\"Jörg\")","v":"Anne"},null,null,null,{"$f":"_xlfn.IFS(AU42=\"Annegret Schmidt\",\"Anne\",AU42=\"Ilona Wetzel\",\"Ilona\",AU42=\"Michael Wetzel\",\"Michael\",AU42=\"Mario Jurk\",\"Mario\",AU42=\"Kai Roßberg\",\"Kai\",AU42=\"Deniz Hagelstein\",\"Deniz\",AU42=\"Frank Nijholt\",\"Frank\",AU42=\"Matthias Nolte\",\"Matthias\",AU42=\"Jörg Frahm\",\"Jörg\")","v":"Deniz"},null,null,null,{"$f":"_xlfn.IFS(B66=\"Annegret Schmidt\",\"Anne\",B66=\"Ilona Wetzel\",\"Ilona\",B66=\"Michael Wetzel\",\"Michael\",B66=\"Mario Jurk\",\"Mario\",B66=\"Kai Roßberg\",\"Kai\",B66=\"Deniz Hagelstein\",\"Deniz\",B66=\"Frank Nijholt\",\"Frank\",B66=\"Matthias Nolte\",\"Matthias\",B66=\"Jörg Frahm\",\"Jörg\")","v":"Anne"},null,null,null,{"$f":"_xlfn.IFS(K66=\"Annegret Schmidt\",\"Anne\",K66=\"Ilona Wetzel\",\"Ilona\",K66=\"Michael Wetzel\",\"Michael\",K66=\"Mario Jurk\",\"Mario\",K66=\"Kai Roßberg\",\"Kai\",K66=\"Deniz Hagelstein\",\"Deniz\",K66=\"Frank Nijholt\",\"Frank\",K66=\"Matthias Nolte\",\"Matthias\",K66=\"Jörg Frahm\",\"Jörg\")","v":"Jörg"},null,null,null,{"$f":"_xlfn.IFS(T66=\"Annegret Schmidt\",\"Anne\",T66=\"Ilona Wetzel\",\"Ilona\",T66=\"Michael Wetzel\",\"Michael\",T66=\"Mario Jurk\",\"Mario\",T66=\"Kai Roßberg\",\"Kai\",T66=\"Deniz Hagelstein\",\"Deniz\",T66=\"Frank Nijholt\",\"Frank\",T66=\"Matthias Nolte\",\"Matthias\",T66=\"Jörg Frahm\",\"Jörg\")","v":"Ilona"}]
[null,{"$f":"IFERROR(_xlfn.IFS(B18=\"Annegret Schmidt\",\"Anne\",B18=\"Ilona Wetzel\",\"Ilona\",B18=\"Michael Wetzel\",\"Michael\",B18=\"Mario Jurk\",\"Mario\",B18=\"Kai Roßberg\",\"Kai\",B18=\"Deniz Hagelstein\",\"Deniz\",B18=\"Frank Nijholt\",\"Frank\",B18=\"Matthias Nolte\",\"Matthias\",B18=\"Jörg Frahm\",\"Jörg\"),\"\")","v":"Michael"},null,null,null,{"$f":"_xlfn.IFS(K18=\"Annegret Schmidt\",\"Anne\",K18=\"Ilona Wetzel\",\"Ilona\",K18=\"Michael Wetzel\",\"Michael\",K18=\"Mario Jurk\",\"Mario\",K18=\"Kai Roßberg\",\"Kai\",K18=\"Deniz Hagelstein\",\"Deniz\",K18=\"Frank Nijholt\",\"Frank\",K18=\"Matthias Nolte\",\"Matthias\",K18=\"Jörg Frahm\",\"Jörg\")","v":"Jörg"},null,null,null,{"$f":"_xlfn.IFS(T18=\"Annegret Schmidt\",\"Anne\",T18=\"Ilona Wetzel\",\"Ilona\",T18=\"Michael Wetzel\",\"Michael\",T18=\"Mario Jurk\",\"Mario\",T18=\"Kai Roßberg\",\"Kai\",T18=\"Deniz Hagelstein\",\"Deniz\",T18=\"Frank Nijholt\",\"Frank\",T18=\"Matthias Nolte\",\"Matthias\",T18=\"Jörg Frahm\",\"Jörg\")","v":"Anne"},null,null,null,{"$f":"_xlfn.IFS(AC18=\"Annegret Schmidt\",\"Anne\",AC18=\"Ilona Wetzel\",\"Ilona\",AC18=\"Michael Wetzel\",\"Michael\",AC18=\"Mario Jurk\",\"Mario\",AC18=\"Kai Roßberg\",\"Kai\",AC18=\"Deniz Hagelstein\",\"Deniz\",AC18=\"Frank Nijholt\",\"Frank\",AC18=\"Matthias Nolte\",\"Matthias\",AC18=\"Jörg Frahm\",\"Jörg\")","v":"Michael"},null,null,null,{"$f":"_xlfn.IFS(AL18=\"Annegret Schmidt\",\"Anne\",AL18=\"Ilona Wetzel\",\"Ilona\",AL18=\"Michael Wetzel\",\"Michael\",AL18=\"Mario Jurk\",\"Mario\",AL18=\"Kai Roßberg\",\"Kai\",AL18=\"Deniz Hagelstein\",\"Deniz\",AL18=\"Frank Nijholt\",\"Frank\",AL18=\"Matthias Nolte\",\"Matthias\",AL18=\"Jörg Frahm\",\"Jörg\")","v":"Ilona"},null,null,null,{"$f":"_xlfn.IFS(B44=\"Annegret Schmidt\",\"Anne\",B44=\"Ilona Wetzel\",\"Ilona\",B44=\"Michael Wetzel\",\"Michael\",B44=\"Mario Jurk\",\"Mario\",B44=\"Kai Roßberg\",\"Kai\",B44=\"Deniz Hagelstein\",\"Deniz\",B44=\"Frank Nijholt\",\"Frank\",B44=\"Matthias Nolte\",\"Matthias\",B44=\"Jörg Frahm\",\"Jörg\")","v":"Michael"},null,null,null,{"$f":"_xlfn.IFS(K44=\"Annegret Schmidt\",\"Anne\",K44=\"Ilona Wetzel\",\"Ilona\",K44=\"Michael Wetzel\",\"Michael\",K44=\"Mario Jurk\",\"Mario\",K44=\"Kai Roßberg\",\"Kai\",K44=\"Deniz Hagelstein\",\"Deniz\",K44=\"Frank Nijholt\",\"Frank\",K44=\"Matthias Nolte\",\"Matthias\",K44=\"Jörg Frahm\",\"Jörg\")","v":"Anne"},null,null,null,{"$f":"_xlfn.IFS(T44=\"Annegret Schmidt\",\"Anne\",T44=\"Ilona Wetzel\",\"Ilona\",T44=\"Michael Wetzel\",\"Michael\",T44=\"Mario Jurk\",\"Mario\",T44=\"Kai Roßberg\",\"Kai\",T44=\"Deniz Hagelstein\",\"Deniz\",T44=\"Frank Nijholt\",\"Frank\",T44=\"Matthias Nolte\",\"Matthias\",T44=\"Jörg Frahm\",\"Jörg\")","v":"Kai"},null,null,null,{"$f":"_xlfn.IFS(AC44=\"Annegret Schmidt\",\"Anne\",AC44=\"Ilona Wetzel\",\"Ilona\",AC44=\"Michael Wetzel\",\"Michael\",AC44=\"Mario Jurk\",\"Mario\",AC44=\"Kai Roßberg\",\"Kai\",AC44=\"Deniz Hagelstein\",\"Deniz\",AC44=\"Frank Nijholt\",\"Frank\",AC44=\"Matthias Nolte\",\"Matthias\",AC44=\"Jörg Frahm\",\"Jörg\")","v":"Jörg"},null,null,null,{"$f":"_xlfn.IFS(AL44=\"Annegret Schmidt\",\"Anne\",AL44=\"Ilona Wetzel\",\"Ilona\",AL44=\"Michael Wetzel\",\"Michael\",AL44=\"Mario Jurk\",\"Mario\",AL44=\"Kai Roßberg\",\"Kai\",AL44=\"Deniz Hagelstein\",\"Deniz\",AL44=\"Frank Nijholt\",\"Frank\",AL44=\"Matthias Nolte\",\"Matthias\",AL44=\"Jörg Frahm\",\"Jörg\")","v":"Deniz"},null,null,null,{"$f":"_xlfn.IFS(AU44=\"Annegret Schmidt\",\"Anne\",AU44=\"Ilona Wetzel\",\"Ilona\",AU44=\"Michael Wetzel\",\"Michael\",AU44=\"Mario Jurk\",\"Mario\",AU44=\"Kai Roßberg\",\"Kai\",AU44=\"Deniz Hagelstein\",\"Deniz\",AU44=\"Frank Nijholt\",\"Frank\",AU44=\"Matthias Nolte\",\"Matthias\",AU44=\"Jörg Frahm\",\"Jörg\")","v":"Frank"},null,null,null,{"$f":"_xlfn.IFS(B68=\"Annegret Schmidt\",\"Anne\",B68=\"Ilona Wetzel\",\"Ilona\",B68=\"Michael Wetzel\",\"Michael\",B68=\"Mario Jurk\",\"Mario\",B68=\"Kai Roßberg\",\"Kai\",B68=\"Deniz Hagelstein\",\"Deniz\",B68=\"Frank Nijholt\",\"Frank\",B68=\"Matthias Nolte\",\"Matthias\",B68=\"Jörg Frahm\",\"Jörg\")","v":"Kai"},null,null,null,{"$f":"_xlfn.IFS(K68=\"Annegret Schmidt\",\"Anne\",K68=\"Ilona Wetzel\",\"Ilona\",K68=\"Michael Wetzel\",\"Michael\",K68=\"Mario Jurk\",\"Mario\",K68=\"Kai Roßberg\",\"Kai\",K68=\"Deniz Hagelstein\",\"Deniz\",K68=\"Frank Nijholt\",\"Frank\",K68=\"Matthias Nolte\",\"Matthias\",K68=\"Jörg Frahm\",\"Jörg\")","v":"Michael"},null,null,null,{"$f":"_xlfn.IFS(T68=\"Annegret Schmidt\",\"Anne\",T68=\"Ilona Wetzel\",\"Ilona\",T68=\"Michael Wetzel\",\"Michael\",T68=\"Mario Jurk\",\"Mario\",T68=\"Kai Roßberg\",\"Kai\",T68=\"Deniz Hagelstein\",\"Deniz\",T68=\"Frank Nijholt\",\"Frank\",T68=\"Matthias Nolte\",\"Matthias\",T68=\"Jörg Frahm\",\"Jörg\")","v":"Jörg"}]
[null,{"$f":"IFERROR(_xlfn.IFS(B20=\"Annegret Schmidt\",\"Anne\",B20=\"Ilona Wetzel\",\"Ilona\",B20=\"Michael Wetzel\",\"Michael\",B20=\"Mario Jurk\",\"Mario\",B20=\"Kai Roßberg\",\"Kai\",B20=\"Deniz Hagelstein\",\"Deniz\",B20=\"Frank Nijholt\",\"Frank\",B20=\"Matthias Nolte\",\"Matthias\",B20=\"Jörg Frahm\",\"Jörg\"),\"\")","v":"Kai"},null,null,null,{"$f":"_xlfn.IFS(K20=\"Annegret Schmidt\",\"Anne\",K20=\"Ilona Wetzel\",\"Ilona\",K20=\"Michael Wetzel\",\"Michael\",K20=\"Mario Jurk\",\"Mario\",K20=\"Kai Roßberg\",\"Kai\",K20=\"Deniz Hagelstein\",\"Deniz\",K20=\"Frank Nijholt\",\"Frank\",K20=\"Matthias Nolte\",\"Matthias\",K20=\"Jörg Frahm\",\"Jörg\")","v":"Kai"},null,null,null,{"$f":"_xlfn.IFS(T20=\"Annegret Schmidt\",\"Anne\",T20=\"Ilona Wetzel\",\"Ilona\",T20=\"Michael Wetzel\",\"Michael\",T20=\"Mario Jurk\",\"Mario\",T20=\"Kai Roßberg\",\"Kai\",T20=\"Deniz Hagelstein\",\"Deniz\",T20=\"Frank Nijholt\",\"Frank\",T20=\"Matthias Nolte\",\"Matthias\",T20=\"Jörg Frahm\",\"Jörg\")","v":"Kai"},null,null,null,{"$f":"_xlfn.IFS(AC20=\"Annegret Schmidt\",\"Anne\",AC20=\"Ilona Wetzel\",\"Ilona\",AC20=\"Michael Wetzel\",\"Michael\",AC20=\"Mario Jurk\",\"Mario\",AC20=\"Kai Roßberg\",\"Kai\",AC20=\"Deniz Hagelstein\",\"Deniz\",AC20=\"Frank Nijholt\",\"Frank\",AC20=\"Matthias Nolte\",\"Matthias\",AC20=\"Jörg Frahm\",\"Jörg\")","v":"Mario"},null,null,null,{"$f":"_xlfn.IFS(AL20=\"Annegret Schmidt\",\"Anne\",AL20=\"Ilona Wetzel\",\"Ilona\",AL20=\"Michael Wetzel\",\"Michael\",AL20=\"Mario Jurk\",\"Mario\",AL20=\"Kai Roßberg\",\"Kai\",AL20=\"Deniz Hagelstein\",\"Deniz\",AL20=\"Frank Nijholt\",\"Frank\",AL20=\"Matthias Nolte\",\"Matthias\",AL20=\"Jörg Frahm\",\"Jörg\")","v":"Kai"},null,null,null,{"$f":"_xlfn.IFS(B46=\"Annegret Schmidt\",\"Anne\",B46=\"Ilona Wetzel\",\"Ilona\",B46=\"Michael Wetzel\",\"Michael\",B46=\"Mario Jurk\",\"Mario\",B46=\"Kai Roßberg\",\"Kai\",B46=\"Deniz Hagelstein\",\"Deniz\",B46=\"Frank Nijholt\",\"Frank\",B46=\"Matthias Nolte\",\"Matthias\",B46=\"Jörg Frahm\",\"Jörg\")","v":"Mario"},null,null,null,{"$f":"_xlfn.IFS(K46=\"Annegret Schmidt\",\"Anne\",K46=\"Ilona Wetzel\",\"Ilona\",K46=\"Michael Wetzel\",\"Michael\",K46=\"Mario Jurk\",\"Mario\",K46=\"Kai Roßberg\",\"Kai\",K46=\"Deniz Hagelstein\",\"Deniz\",K46=\"Frank Nijholt\",\"Frank\",K46=\"Matthias Nolte\",\"Matthias\",K46=\"Jörg Frahm\",\"Jörg\")","v":"Mario"},null,null,null,{"$f":"_xlfn.IFS(T46=\"Annegret Schmidt\",\"Anne\",T46=\"Ilona Wetzel\",\"Ilona\",T46=\"Michael Wetzel\",\"Michael\",T46=\"Mario Jurk\",\"Mario\",T46=\"Kai Roßberg\",\"Kai\",T46=\"Deniz Hagelstein\",\"Deniz\",T46=\"Frank Nijholt\",\"Frank\",T46=\"Matthias Nolte\",\"Matthias\",T46=\"Jörg Frahm\",\"Jörg\")","v":"Mario"},null,null,null,{"$f":"_xlfn.IFS(AC46=\"Annegret Schmidt\",\"Anne\",AC46=\"Ilona Wetzel\",\"Ilona\",AC46=\"Michael Wetzel\",\"Michael\",AC46=\"Mario Jurk\",\"Mario\",AC46=\"Kai Roßberg\",\"Kai\",AC46=\"Deniz Hagelstein\",\"Deniz\",AC46=\"Frank Nijholt\",\"Frank\",AC46=\"Matthias Nolte\",\"Matthias\",AC46=\"Jörg Frahm\",\"Jörg\")","v":"Michael"},null,null,null,{"$f":"_xlfn.IFS(AL46=\"Annegret Schmidt\",\"Anne\",AL46=\"Ilona Wetzel\",\"Ilona\",AL46=\"Michael Wetzel\",\"Michael\",AL46=\"Mario Jurk\",\"Mario\",AL46=\"Kai Roßberg\",\"Kai\",AL46=\"Deniz Hagelstein\",\"Deniz\",AL46=\"Frank Nijholt\",\"Frank\",AL46=\"Matthias Nolte\",\"Matthias\",AL46=\"Jörg Frahm\",\"Jörg\")","v":"Michael"},null,null,null,{"$f":"_xlfn.IFS(AU46=\"Annegret Schmidt\",\"Anne\",AU46=\"Ilona Wetzel\",\"Ilona\",AU46=\"Michael Wetzel\",\"Michael\",AU46=\"Mario Jurk\",\"Mario\",AU46=\"Kai Roßberg\",\"Kai\",AU46=\"Deniz Hagelstein\",\"Deniz\",AU46=\"Frank Nijholt\",\"Frank\",AU46=\"Matthias Nolte\",\"Matthias\",AU46=\"Jörg Frahm\",\"Jörg\")","v":"Mario"},null,null,null,{"$f":"_xlfn.IFS(B70=\"Annegret Schmidt\",\"Anne\",B70=\"Ilona Wetzel\",\"Ilona\",B70=\"Michael Wetzel\",\"Michael\",B70=\"Mario Jurk\",\"Mario\",B70=\"Kai Roßberg\",\"Kai\",B70=\"Deniz Hagelstein\",\"Deniz\",B70=\"Frank Nijholt\",\"Frank\",B70=\"Matthias Nolte\",\"Matthias\",B70=\"Jörg Frahm\",\"Jörg\")","v":"Mario"},null,null,null,{"$f":"_xlfn.IFS(K70=\"Annegret Schmidt\",\"Anne\",K70=\"Ilona Wetzel\",\"Ilona\",K70=\"Michael Wetzel\",\"Michael\",K70=\"Mario Jurk\",\"Mario\",K70=\"Kai Roßberg\",\"Kai\",K70=\"Deniz Hagelstein\",\"Deniz\",K70=\"Frank Nijholt\",\"Frank\",K70=\"Matthias Nolte\",\"Matthias\",K70=\"Jörg Frahm\",\"Jörg\")","v":"Mario"},null,null,null,{"$f":"_xlfn.IFS(T70=\"Annegret Schmidt\",\"Anne\",T70=\"Ilona Wetzel\",\"Ilona\",T70=\"Michael Wetzel\",\"Michael\",T70=\"Mario Jurk\",\"Mario\",T70=\"Kai Roßberg\",\"Kai\",T70=\"Deniz Hagelstein\",\"Deniz\",T70=\"Frank Nijholt\",\"Frank\",T70=\"Matthias Nolte\",\"Matthias\",T70=\"Jörg Frahm\",\"Jörg\")","v":"Michael"}]
[]
[null,{"$f":"_xlfn.IFS(B29=\"Annegret Schmidt\",\"Anne\",B29=\"Ilona Wetzel\",\"Ilona\",B29=\"Michael Wetzel\",\"Michael\",B29=\"Mario Jurk\",\"Mario\",B29=\"Kai Roßberg\",\"Kai\",B29=\"Deniz Hagelstein\",\"Deniz\",B29=\"Frank Nijholt\",\"Frank\",B29=\"Matthias Nolte\",\"Matthias\",B29=\"Jörg Frahm\",\"Jörg\")","v":"Anne"},null,null,null,{"$f":"_xlfn.IFS(K29=\"Annegret Schmidt\",\"Anne\",K29=\"Ilona Wetzel\",\"Ilona\",K29=\"Michael Wetzel\",\"Michael\",K29=\"Mario Jurk\",\"Mario\",K29=\"Kai Roßberg\",\"Kai\",K29=\"Deniz Hagelstein\",\"Deniz\",K29=\"Frank Nijholt\",\"Frank\",K29=\"Matthias Nolte\",\"Matthias\",K29=\"Jörg Frahm\",\"Jörg\")","v":"Mario"},null,null,null,{"$f":"_xlfn.IFS(T29=\"Annegret Schmidt\",\"Anne\",T29=\"Ilona Wetzel\",\"Ilona\",T29=\"Michael Wetzel\",\"Michael\",T29=\"Mario Jurk\",\"Mario\",T29=\"Kai Roßberg\",\"Kai\",T29=\"Deniz Hagelstein\",\"Deniz\",T29=\"Frank Nijholt\",\"Frank\",T29=\"Matthias Nolte\",\"Matthias\",T29=\"Jörg Frahm\",\"Jörg\")","v":"Jörg"},null,null,null,{"$f":"_xlfn.IFS(AC29=\"Annegret Schmidt\",\"Anne\",AC29=\"Ilona Wetzel\",\"Ilona\",AC29=\"Michael Wetzel\",\"Michael\",AC29=\"Mario Jurk\",\"Mario\",AC29=\"Kai Roßberg\",\"Kai\",AC29=\"Deniz Hagelstein\",\"Deniz\",AC29=\"Frank Nijholt\",\"Frank\",AC29=\"Matthias Nolte\",\"Matthias\",AC29=\"Jörg Frahm\",\"Jörg\")","v":"Ilona"},null,null,null,{"$f":"_xlfn.IFS(AL29=\"Annegret Schmidt\",\"Anne\",AL29=\"Ilona Wetzel\",\"Ilona\",AL29=\"Michael Wetzel\",\"Michael\",AL29=\"Mario Jurk\",\"Mario\",AL29=\"Kai Roßberg\",\"Kai\",AL29=\"Deniz Hagelstein\",\"Deniz\",AL29=\"Frank Nijholt\",\"Frank\",AL29=\"Matthias Nolte\",\"Matthias\",AL29=\"Jörg Frahm\",\"Jörg\")","v":"Anne"},null,null,null,{"$f":"_xlfn.IFS(B55=\"Annegret Schmidt\",\"Anne\",B55=\"Ilona Wetzel\",\"Ilona\",B55=\"Michael Wetzel\",\"Michael\",B55=\"Mario Jurk\",\"Mario\",B55=\"Kai Roßberg\",\"Kai\",B55=\"Deniz Hagelstein\",\"Deniz\",B55=\"Frank Nijholt\",\"Frank\",B55=\"Matthias Nolte\",\"Matthias\",B55=\"Jörg Frahm\",\"Jörg\")","v":"Anne"},null,null,null,{"$f":"_xlfn.IFS(K55=\"Annegret Schmidt\",\"Anne\",K55=\"Ilona Wetzel\",\"Ilona\",K55=\"Michael Wetzel\",\"Michael\",K55=\"Mario Jurk\",\"Mario\",K55=\"Kai Roßberg\",\"Kai\",K55=\"Deniz Hagelstein\",\"Deniz\",K55=\"Frank Nijholt\",\"Frank\",K55=\"Matthias Nolte\",\"Matthias\",K55=\"Jörg Frahm\",\"Jörg\")","v":"Deniz"},null,null,null,{"$f":"_xlfn.IFS(T55=\"Annegret Schmidt\",\"Anne\",T55=\"Ilona Wetzel\",\"Ilona\",T55=\"Michael Wetzel\",\"Michael\",T55=\"Mario Jurk\",\"Mario\",T55=\"Kai Roßberg\",\"Kai\",T55=\"Deniz Hagelstein\",\"Deniz\",T55=\"Frank Nijholt\",\"Frank\",T55=\"Matthias Nolte\",\"Matthias\",T55=\"Jörg Frahm\",\"Jörg\")","v":"Anne"},null,null,null,{"$f":"_xlfn.IFS(AC55=\"Annegret Schmidt\",\"Anne\",AC55=\"Ilona Wetzel\",\"Ilona\",AC55=\"Michael Wetzel\",\"Michael\",AC55=\"Mario Jurk\",\"Mario\",AC55=\"Kai Roßberg\",\"Kai\",AC55=\"Deniz Hagelstein\",\"Deniz\",AC55=\"Frank Nijholt\",\"Frank\",AC55=\"Matthias Nolte\",\"Matthias\",AC55=\"Jörg Frahm\",\"Jörg\")","v":"Kai"},null,null,null,{"$f":"_xlfn.IFS(AL55=\"Annegret Schmidt\",\"Anne\",AL55=\"Ilona Wetzel\",\"Ilona\",AL55=\"Michael Wetzel\",\"Michael\",AL55=\"Mario Jurk\",\"Mario\",AL55=\"Kai Roßberg\",\"Kai\",AL55=\"Deniz Hagelstein\",\"Deniz\",AL55=\"Frank Nijholt\",\"Frank\",AL55=\"Matthias Nolte\",\"Matthias\",AL55=\"Jörg Frahm\",\"Jörg\")","v":"Kai"},null,null,null,{"$f":"_xlfn.IFS(AU55=\"Annegret Schmidt\",\"Anne\",AU55=\"Ilona Wetzel\",\"Ilona\",AU55=\"Michael Wetzel\",\"Michael\",AU55=\"Mario Jurk\",\"Mario\",AU55=\"Kai Roßberg\",\"Kai\",AU55=\"Deniz Hagelstein\",\"Deniz\",AU55=\"Frank Nijholt\",\"Frank\",AU55=\"Matthias Nolte\",\"Matthias\",AU55=\"Jörg Frahm\",\"Jörg\")","v":"Jörg"},null,null,null,{"$f":"_xlfn.IFS(B79=\"Annegret Schmidt\",\"Anne\",B79=\"Ilona Wetzel\",\"Ilona\",B79=\"Michael Wetzel\",\"Michael\",B79=\"Mario Jurk\",\"Mario\",B79=\"Kai Roßberg\",\"Kai\",B79=\"Deniz Hagelstein\",\"Deniz\",B79=\"Frank Nijholt\",\"Frank\",B79=\"Matthias Nolte\",\"Matthias\",B79=\"Jörg Frahm\",\"Jörg\")","v":"Frank"},null,null,null,{"$f":"_xlfn.IFS(K79=\"Annegret Schmidt\",\"Anne\",K79=\"Ilona Wetzel\",\"Ilona\",K79=\"Michael Wetzel\",\"Michael\",K79=\"Mario Jurk\",\"Mario\",K79=\"Kai Roßberg\",\"Kai\",K79=\"Deniz Hagelstein\",\"Deniz\",K79=\"Frank Nijholt\",\"Frank\",K79=\"Matthias Nolte\",\"Matthias\",K79=\"Jörg Frahm\",\"Jörg\")","v":"Anne"},null,null,null,{"$f":"_xlfn.IFS(T79=\"Annegret Schmidt\",\"Anne\",T79=\"Ilona Wetzel\",\"Ilona\",T79=\"Michael Wetzel\",\"Michael\",T79=\"Mario Jurk\",\"Mario\",T79=\"Kai Roßberg\",\"Kai\",T79=\"Deniz Hagelstein\",\"Deniz\",T79=\"Frank Nijholt\",\"Frank\",T79=\"Matthias Nolte\",\"Matthias\",T79=\"Jörg Frahm\",\"Jörg\")","v":"Frank"}]
[null,{"$f":"_xlfn.IFS(B30=\"Annegret Schmidt\",\"Anne\",B30=\"Ilona Wetzel\",\"Ilona\",B30=\"Michael Wetzel\",\"Michael\",B30=\"Mario Jurk\",\"Mario\",B30=\"Kai Roßberg\",\"Kai\",B30=\"Deniz Hagelstein\",\"Deniz\",B30=\"Frank Nijholt\",\"Frank\",B30=\"Matthias Nolte\",\"Matthias\",B30=\"Jörg Frahm\",\"Jörg\")","v":"Matthias"},null,null,null,{"$f":"_xlfn.IFS(K30=\"Annegret Schmidt\",\"Anne\",K30=\"Ilona Wetzel\",\"Ilona\",K30=\"Michael Wetzel\",\"Michael\",K30=\"Mario Jurk\",\"Mario\",K30=\"Kai Roßberg\",\"Kai\",K30=\"Deniz Hagelstein\",\"Deniz\",K30=\"Frank Nijholt\",\"Frank\",K30=\"Matthias Nolte\",\"Matthias\",K30=\"Jörg Frahm\",\"Jörg\")","v":"Deniz"},null,null,null,{"$f":"_xlfn.IFS(T30=\"Annegret Schmidt\",\"Anne\",T30=\"Ilona Wetzel\",\"Ilona\",T30=\"Michael Wetzel\",\"Michael\",T30=\"Mario Jurk\",\"Mario\",T30=\"Kai Roßberg\",\"Kai\",T30=\"Deniz Hagelstein\",\"Deniz\",T30=\"Frank Nijholt\",\"Frank\",T30=\"Matthias Nolte\",\"Matthias\",T30=\"Jörg Frahm\",\"Jörg\")","v":"Mario"},null,null,null,{"$f":"_xlfn.IFS(AC30=\"Annegret Schmidt\",\"Anne\",AC30=\"Ilona Wetzel\",\"Ilona\",AC30=\"Michael Wetzel\",\"Michael\",AC30=\"Mario Jurk\",\"Mario\",AC30=\"Kai Roßberg\",\"Kai\",AC30=\"Deniz Hagelstein\",\"Deniz\",AC30=\"Frank Nijholt\",\"Frank\",AC30=\"Matthias Nolte\",\"Matthias\",AC30=\"Jörg Frahm\",\"Jörg\")","v":"Matthias"},null,null,null,{"$f":"_xlfn.IFS(AL30=\"Annegret Schmidt\",\"Anne\",AL30=\"Ilona Wetzel\",\"Ilona\",AL30=\"Michael Wetzel\",\"Michael\",AL30=\"Mario Jurk\",\"Mario\",AL30=\"Kai Roßberg\",\"Kai\",AL30=\"Deniz Hagelstein\",\"Deniz\",AL30=\"Frank Nijholt\",\"Frank\",AL30=\"Matthias Nolte\",\"Matthias\",AL30=\"Jörg Frahm\",\"Jörg\")","v":"Mario"},null,null,null,{"$f":"_xlfn.IFS(B56=\"Annegret Schmidt\",\"Anne\",B56=\"Ilona Wetzel\",\"Ilona\",B56=\"Michael Wetzel\",\"Michael\",B56=\"Mario Jurk\",\"Mario\",B56=\"Kai Roßberg\",\"Kai\",B56=\"Deniz Hagelstein\",\"Deniz\",B56=\"Frank Nijholt\",\"Frank\",B56=\"Matthias Nolte\",\"Matthias\",B56=\"Jörg Frahm\",\"Jörg\")","v":"Matthias"},null,null,null,{"$f":"_xlfn.IFS(K56=\"Annegret Schmidt\",\"Anne\",K56=\"Ilona Wetzel\",\"Ilona\",K56=\"Michael Wetzel\",\"Michael\",K56=\"Mario Jurk\",\"Mario\",K56=\"Kai Roßberg\",\"Kai\",K56=\"Deniz Hagelstein\",\"Deniz\",K56=\"Frank Nijholt\",\"Frank\",K56=\"Matthias Nolte\",\"Matthias\",K56=\"Jörg Frahm\",\"Jörg\")","v":"Ilona"},null,null,null,{"$f":"_xlfn.IFS(T56=\"Annegret Schmidt\",\"Anne\",T56=\"Ilona Wetzel\",\"Ilona\",T56=\"Michael Wetzel\",\"Michael\",T56=\"Mario Jurk\",\"Mario\",T56=\"Kai Roßberg\",\"Kai\",T56=\"Deniz Hagelstein\",\"Deniz\",T56=\"Frank Nijholt\",\"Frank\",T56=\"Matthias Nolte\",\"Matthias\",T56=\"Jörg Frahm\",\"Jörg\")","v":"Deniz"},null,null,null,{"$f":"_xlfn.IFS(AC56=\"Annegret Schmidt\",\"Anne\",AC56=\"Ilona Wetzel\",\"Ilona\",AC56=\"Michael Wetzel\",\"Michael\",AC56=\"Mario Jurk\",\"Mario\",AC56=\"Kai Roßberg\",\"Kai\",AC56=\"Deniz Hagelstein\",\"Deniz\",AC56=\"Frank Nijholt\",\"Frank\",AC56=\"Matthias Nolte\",\"Matthias\",AC56=\"Jörg Frahm\",\"Jörg\")","v":"Frank"},null,null,null,{"$f":"_xlfn.IFS(AL56=\"Annegret Schmidt\",\"Anne\",AL56=\"Ilona Wetzel\",\"Ilona\",AL56=\"Michael Wetzel\",\"Michael\",AL56=\"Mario Jurk\",\"Mario\",AL56=\"Kai Roßberg\",\"Kai\",AL56=\"Deniz Hagelstein\",\"Deniz\",AL56=\"Frank Nijholt\",\"Frank\",AL56=\"Matthias Nolte\",\"Matthias\",AL56=\"Jörg Frahm\",\"Jörg\")","v":"Jörg"},null,null,null,{"$f":"_xlfn.IFS(AU56=\"Annegret Schmidt\",\"Anne\",AU56=\"Ilona Wetzel\",\"Ilona\",AU56=\"Michael Wetzel\",\"Michael\",AU56=\"Mario Jurk\",\"Mario\",AU56=\"Kai Roßberg\",\"Kai\",AU56=\"Deniz Hagelstein\",\"Deniz\",AU56=\"Frank Nijholt\",\"Frank\",AU56=\"Matthias Nolte\",\"Matthias\",AU56=\"Jörg Frahm\",\"Jörg\")","v":"Michael"},null,null,null,{"$f":"_xlfn.IFS(B80=\"Annegret Schmidt\",\"Anne\",B80=\"Ilona Wetzel\",\"Ilona\",B80=\"Michael Wetzel\",\"Michael\",B80=\"Mario Jurk\",\"Mario\",B80=\"Kai Roßberg\",\"Kai\",B80=\"Deniz Hagelstein\",\"Deniz\",B80=\"Frank Nijholt\",\"Frank\",B80=\"Matthias Nolte\",\"Matthias\",B80=\"Jörg Frahm\",\"Jörg\")","v":"Ilona"},null,null,null,{"$f":"_xlfn.IFS(K80=\"Annegret Schmidt\",\"Anne\",K80=\"Ilona Wetzel\",\"Ilona\",K80=\"Michael Wetzel\",\"Michael\",K80=\"Mario Jurk\",\"Mario\",K80=\"Kai Roßberg\",\"Kai\",K80=\"Deniz Hagelstein\",\"Deniz\",K80=\"Frank Nijholt\",\"Frank\",K80=\"Matthias Nolte\",\"Matthias\",K80=\"Jörg Frahm\",\"Jörg\")","v":"Ilona"},null,null,null,{"$f":"_xlfn.IFS(T80=\"Annegret Schmidt\",\"Anne\",T80=\"Ilona Wetzel\",\"Ilona\",T80=\"Michael Wetzel\",\"Michael\",T80=\"Mario Jurk\",\"Mario\",T80=\"Kai Roßberg\",\"Kai\",T80=\"Deniz Hagelstein\",\"Deniz\",T80=\"Frank Nijholt\",\"Frank\",T80=\"Matthias Nolte\",\"Matthias\",T80=\"Jörg Frahm\",\"Jörg\")","v":"Anne"}]
[null,{"$f":"_xlfn.IFS(B31=\"Annegret Schmidt\",\"Anne\",B31=\"Ilona Wetzel\",\"Ilona\",B31=\"Michael Wetzel\",\"Michael\",B31=\"Mario Jurk\",\"Mario\",B31=\"Kai Roßberg\",\"Kai\",B31=\"Deniz Hagelstein\",\"Deniz\",B31=\"Frank Nijholt\",\"Frank\",B31=\"Matthias Nolte\",\"Matthias\",B31=\"Jörg Frahm\",\"Jörg\")","v":"Frank"},null,null,null,{"$f":"_xlfn.IFS(K31=\"Annegret Schmidt\",\"Anne\",K31=\"Ilona Wetzel\",\"Ilona\",K31=\"Michael Wetzel\",\"Michael\",K31=\"Mario Jurk\",\"Mario\",K31=\"Kai Roßberg\",\"Kai\",K31=\"Deniz Hagelstein\",\"Deniz\",K31=\"Frank Nijholt\",\"Frank\",K31=\"Matthias Nolte\",\"Matthias\",K31=\"Jörg Frahm\",\"Jörg\")","v":"Matthias"},null,null,null,{"$f":"_xlfn.IFS(T31=\"Annegret Schmidt\",\"Anne\",T31=\"Ilona Wetzel\",\"Ilona\",T31=\"Michael Wetzel\",\"Michael\",T31=\"Mario Jurk\",\"Mario\",T31=\"Kai Roßberg\",\"Kai\",T31=\"Deniz Hagelstein\",\"Deniz\",T31=\"Frank Nijholt\",\"Frank\",T31=\"Matthias Nolte\",\"Matthias\",T31=\"Jörg Frahm\",\"Jörg\")","v":"Frank"},null,null,null,{"$f":"_xlfn.IFS(AC31=\"Annegret Schmidt\",\"Anne\",AC31=\"Ilona Wetzel\",\"Ilona\",AC31=\"Michael Wetzel\",\"Michael\",AC31=\"Mario Jurk\",\"Mario\",AC31=\"Kai Roßberg\",\"Kai\",AC31=\"Deniz Hagelstein\",\"Deniz\",AC31=\"Frank Nijholt\",\"Frank\",AC31=\"Matthias Nolte\",\"Matthias\",AC31=\"Jörg Frahm\",\"Jörg\")","v":"Anne"},null,null,null,{"$f":"_xlfn.IFS(AL31=\"Annegret Schmidt\",\"Anne\",AL31=\"Ilona Wetzel\",\"Ilona\",AL31=\"Michael Wetzel\",\"Michael\",AL31=\"Mario Jurk\",\"Mario\",AL31=\"Kai Roßberg\",\"Kai\",AL31=\"Deniz Hagelstein\",\"Deniz\",AL31=\"Frank Nijholt\",\"Frank\",AL31=\"Matthias Nolte\",\"Matthias\",AL31=\"Jörg Frahm\",\"Jörg\")","v":"Frank"},null,null,null,{"$f":"_xlfn.IFS(B57=\"Annegret Schmidt\",\"Anne\",B57=\"Ilona Wetzel\",\"Ilona\",B57=\"Michael Wetzel\",\"Michael\",B57=\"Mario Jurk\",\"Mario\",B57=\"Kai Roßberg\",\"Kai\",B57=\"Deniz Hagelstein\",\"Deniz\",B57=\"Frank Nijholt\",\"Frank\",B57=\"Matthias Nolte\",\"Matthias\",B57=\"Jörg Frahm\",\"Jörg\",B57=\"Jörg Frahm (Abw)\",\"Jörg (Abw)\",B57=\"Michael Wetzel (Abw)\",\"Michael (Abw)\")","v":"Deniz"},null,null,null,{"$f":"_xlfn.IFS(K57=\"Annegret Schmidt\",\"Anne\",K57=\"Ilona Wetzel\",\"Ilona\",K57=\"Michael Wetzel\",\"Michael\",K57=\"Mario Jurk\",\"Mario\",K57=\"Kai Roßberg\",\"Kai\",K57=\"Deniz Hagelstein\",\"Deniz\",K57=\"Frank Nijholt\",\"Frank\",K57=\"Matthias Nolte\",\"Matthias\",K57=\"Jörg Frahm\",\"Jörg\")","v":"Jörg"},null,null,null,{"$f":"_xlfn.IFS(T57=\"Annegret Schmidt\",\"Anne\",T57=\"Ilona Wetzel\",\"Ilona\",T57=\"Michael Wetzel\",\"Michael\",T57=\"Mario Jurk\",\"Mario\",T57=\"Kai Roßberg\",\"Kai\",T57=\"Deniz Hagelstein\",\"Deniz\",T57=\"Frank Nijholt\",\"Frank\",T57=\"Matthias Nolte\",\"Matthias\",T57=\"Jörg Frahm\",\"Jörg\")","v":"Frank"},null,null,null,{"$f":"_xlfn.IFS(AC57=\"Annegret Schmidt\",\"Anne\",AC57=\"Ilona Wetzel\",\"Ilona\",AC57=\"Michael Wetzel\",\"Michael\",AC57=\"Mario Jurk\",\"Mario\",AC57=\"Kai Roßberg\",\"Kai\",AC57=\"Deniz Hagelstein\",\"Deniz\",AC57=\"Frank Nijholt\",\"Frank\",AC57=\"Matthias Nolte\",\"Matthias\",AC57=\"Jörg Frahm\",\"Jörg\")","v":"Mario"},null,null,null,{"$f":"_xlfn.IFS(AL57=\"Annegret Schmidt\",\"Anne\",AL57=\"Ilona Wetzel\",\"Ilona\",AL57=\"Michael Wetzel\",\"Michael\",AL57=\"Mario Jurk\",\"Mario\",AL57=\"Kai Roßberg\",\"Kai\",AL57=\"Deniz Hagelstein\",\"Deniz\",AL57=\"Frank Nijholt\",\"Frank\",AL57=\"Matthias Nolte\",\"Matthias\",AL57=\"Jörg Frahm\",\"Jörg\")","v":"Mario"},null,null,null,{"$f":"_xlfn.IFS(AU57=\"Annegret Schmidt\",\"Anne\",AU57=\"Ilona Wetzel\",\"Ilona\",AU57=\"Michael Wetzel\",\"Michael\",AU57=\"Mario Jurk\",\"Mario\",AU57=\"Kai Roßberg\",\"Kai\",AU57=\"Deniz Hagelstein\",\"Deniz\",AU57=\"Frank Nijholt\",\"Frank\",AU57=\"Matthias Nolte\",\"Matthias\",AU57=\"Jörg Frahm\",\"Jörg\")","v":"Ilona"},null,null,null,{"$f":"_xlfn.IFS(B81=\"Annegret Schmidt\",\"Anne\",B81=\"Ilona Wetzel\",\"Ilona\",B81=\"Michael Wetzel\",\"Michael\",B81=\"Mario Jurk\",\"Mario\",B81=\"Kai Roßberg\",\"Kai\",B81=\"Deniz Hagelstein\",\"Deniz\",B81=\"Frank Nijholt\",\"Frank\",B81=\"Matthias Nolte\",\"Matthias\",B81=\"Jörg Frahm\",\"Jörg\")","v":"Michael"},null,null,null,{"$f":"_xlfn.IFS(K81=\"Annegret Schmidt\",\"Anne\",K81=\"Ilona Wetzel\",\"Ilona\",K81=\"Michael Wetzel\",\"Michael\",K81=\"Mario Jurk\",\"Mario\",K81=\"Kai Roßberg\",\"Kai\",K81=\"Deniz Hagelstein\",\"Deniz\",K81=\"Frank Nijholt\",\"Frank\",K81=\"Matthias Nolte\",\"Matthias\",K81=\"Jörg Frahm\",\"Jörg\")","v":"Frank"},null,null,null,{"$f":"_xlfn.IFS(T81=\"Annegret Schmidt\",\"Anne\",T81=\"Ilona Wetzel\",\"Ilona\",T81=\"Michael Wetzel\",\"Michael\",T81=\"Mario Jurk\",\"Mario\",T81=\"Kai Roßberg\",\"Kai\",T81=\"Deniz Hagelstein\",\"Deniz\",T81=\"Frank Nijholt\",\"Frank\",T81=\"Matthias Nolte\",\"Matthias\",T81=\"Jörg Frahm\",\"Jörg\")","v":"Kai"}]
[null,{"$f":"_xlfn.IFS(B32=\"Annegret Schmidt\",\"Anne\",B32=\"Ilona Wetzel\",\"Ilona\",B32=\"Michael Wetzel\",\"Michael\",B32=\"Mario Jurk\",\"Mario\",B32=\"Kai Roßberg\",\"Kai\",B32=\"Deniz Hagelstein\",\"Deniz\",B32=\"Frank Nijholt\",\"Frank\",B32=\"Matthias Nolte\",\"Matthias\",B32=\"Jörg Frahm\",\"Jörg\")","v":"Mario"},null,null,null,{"$f":"_xlfn.IFS(K32=\"Annegret Schmidt\",\"Anne\",K32=\"Ilona Wetzel\",\"Ilona\",K32=\"Michael Wetzel\",\"Michael\",K32=\"Mario Jurk\",\"Mario\",K32=\"Kai Roßberg\",\"Kai\",K32=\"Deniz Hagelstein\",\"Deniz\",K32=\"Frank Nijholt\",\"Frank\",K32=\"Matthias Nolte\",\"Matthias\",K32=\"Jörg Frahm\",\"Jörg\")","v":"Michael"},null,null,null,{"$f":"_xlfn.IFS(T32=\"Annegret Schmidt\",\"Anne\",T32=\"Ilona Wetzel\",\"Ilona\",T32=\"Michael Wetzel\",\"Michael\",T32=\"Mario Jurk\",\"Mario\",T32=\"Kai Roßberg\",\"Kai\",T32=\"Deniz Hagelstein\",\"Deniz\",T32=\"Frank Nijholt\",\"Frank\",T32=\"Matthias Nolte\",\"Matthias\",T32=\"Jörg Frahm\",\"Jörg\")","v":"Deniz"},null,null,null,{"$f":"_xlfn.IFS(AC32=\"Annegret Schmidt\",\"Anne\",AC32=\"Ilona Wetzel\",\"Ilona\",AC32=\"Michael Wetzel\",\"Michael\",AC32=\"Mario Jurk\",\"Mario\",AC32=\"Kai Roßberg\",\"Kai\",AC32=\"Deniz Hagelstein\",\"Deniz\",AC32=\"Frank Nijholt\",\"Frank\",AC32=\"Matthias Nolte\",\"Matthias\",AC32=\"Jörg Frahm\",\"Jörg\",AC32=\"Jörg Frahm (Abw)\",\"Jörg (Abw)\",AC32=\"Michael Wetzel (Abw)\",\"Michael (Abw)\")","v":"Kai"},null,null,null,{"$f":"_xlfn.IFS(AL32=\"Annegret Schmidt\",\"Anne\",AL32=\"Ilona Wetzel\",\"Ilona\",AL32=\"Michael Wetzel\",\"Michael\",AL32=\"Mario Jurk\",\"Mario\",AL32=\"Kai Roßberg\",\"Kai\",AL32=\"Deniz Hagelstein\",\"Deniz\",AL32=\"Frank Nijholt\",\"Frank\",AL32=\"Matthias Nolte\",\"Matthias\",AL32=\"Jörg Frahm\",\"Jörg\",AL32=\"Jörg Frahm (Abw)\",\"Jörg (Abw)\",AL32=\"Michael Wetzel (Abw)\",\"Michael (Abw)\")","v":"Jörg"},null,null,null,{"$f":"_xlfn.IFS(B58=\"Annegret Schmidt\",\"Anne\",B58=\"Ilona Wetzel\",\"Ilona\",B58=\"Michael Wetzel\",\"Michael\",B58=\"Mario Jurk\",\"Mario\",B58=\"Kai Roßberg\",\"Kai\",B58=\"Deniz Hagelstein\",\"Deniz\",B58=\"Frank Nijholt\",\"Frank\",B58=\"Matthias Nolte\",\"Matthias\",B58=\"Jörg Frahm\",\"Jörg\",B58=\"Jörg Frahm (Abw)\",\"Jörg (Abw)\",B58=\"Michael Wetzel (Abw)\",\"Michael (Abw)\")","v":"Kai"},null,null,null,{"$f":"_xlfn.IFS(K58=\"Annegret Schmidt\",\"Anne\",K58=\"Ilona Wetzel\",\"Ilona\",K58=\"Michael Wetzel\",\"Michael\",K58=\"Mario Jurk\",\"Mario\",K58=\"Kai Roßberg\",\"Kai\",K58=\"Deniz Hagelstein\",\"Deniz\",K58=\"Frank Nijholt\",\"Frank\",K58=\"Matthias Nolte\",\"Matthias\",K58=\"Jörg Frahm\",\"Jörg\",K58=\"Jörg Frahm (Abw)\",\"Jörg (Abw)\",K58=\"Michael Wetzel (Abw)\",\"Michael (Abw)\")","v":"Michael"},null,null,null,{"$f":"_xlfn.IFS(T58=\"Annegret Schmidt\",\"Anne\",T58=\"Ilona Wetzel\",\"Ilona\",T58=\"Michael Wetzel\",\"Michael\",T58=\"Mario Jurk\",\"Mario\",T58=\"Kai Roßberg\",\"Kai\",T58=\"Deniz Hagelstein\",\"Deniz\",T58=\"Frank Nijholt\",\"Frank\",T58=\"Matthias Nolte\",\"Matthias\",T58=\"Jörg Frahm\",\"Jörg\")","v":"Michael"},null,null,null,{"$f":"_xlfn.IFS(AC58=\"Annegret Schmidt\",\"Anne\",AC58=\"Ilona Wetzel\",\"Ilona\",AC58=\"Michael Wetzel\",\"Michael\",AC58=\"Mario Jurk\",\"Mario\",AC58=\"Kai Roßberg\",\"Kai\",AC58=\"Deniz Hagelstein\",\"Deniz\",AC58=\"Frank Nijholt\",\"Frank\",AC58=\"Matthias Nolte\",\"Matthias\",AC58=\"Jörg Frahm\",\"Jörg\")","v":"Deniz"},null,null,null,{"$f":"_xlfn.IFS(AL58=\"Annegret Schmidt\",\"Anne\",AL58=\"Ilona Wetzel\",\"Ilona\",AL58=\"Michael Wetzel\",\"Michael\",AL58=\"Mario Jurk\",\"Mario\",AL58=\"Kai Roßberg\",\"Kai\",AL58=\"Deniz Hagelstein\",\"Deniz\",AL58=\"Frank Nijholt\",\"Frank\",AL58=\"Matthias Nolte\",\"Matthias\",AL58=\"Jörg Frahm\",\"Jörg\")","v":"Ilona"},null,null,null,{"$f":"_xlfn.IFS(AU58=\"Annegret Schmidt\",\"Anne\",AU58=\"Ilona Wetzel\",\"Ilona\",AU58=\"Michael Wetzel\",\"Michael\",AU58=\"Mario Jurk\",\"Mario\",AU58=\"Kai Roßberg\",\"Kai\",AU58=\"Deniz Hagelstein\",\"Deniz\",AU58=\"Frank Nijholt\",\"Frank\",AU58=\"Matthias Nolte\",\"Matthias\",AU58=\"Jörg Frahm\",\"Jörg\")","v":"Anne"},null,null,null,{"$f":"_xlfn.IFS(B82=\"Annegret Schmidt\",\"Anne\",B82=\"Ilona Wetzel\",\"Ilona\",B82=\"Michael Wetzel\",\"Michael\",B82=\"Mario Jurk\",\"Mario\",B82=\"Kai Roßberg\",\"Kai\",B82=\"Deniz Hagelstein\",\"Deniz\",B82=\"Frank Nijholt\",\"Frank\",B82=\"Matthias Nolte\",\"Matthias\",B82=\"Jörg Frahm\",\"Jörg\")","v":"Matthias"},null,null,null,{"$f":"_xlfn.IFS(K82=\"Annegret Schmidt\",\"Anne\",K82=\"Ilona Wetzel\",\"Ilona\",K82=\"Michael Wetzel\",\"Michael\",K82=\"Mario Jurk\",\"Mario\",K82=\"Kai Roßberg\",\"Kai\",K82=\"Deniz Hagelstein\",\"Deniz\",K82=\"Frank Nijholt\",\"Frank\",K82=\"Matthias Nolte\",\"Matthias\",K82=\"Jörg Frahm\",\"Jörg\")","v":"Deniz"},null,null,null,{"$f":"_xlfn.IFS(T82=\"Annegret Schmidt\",\"Anne\",T82=\"Ilona Wetzel\",\"Ilona\",T82=\"Michael Wetzel\",\"Michael\",T82=\"Mario Jurk\",\"Mario\",T82=\"Kai Roßberg\",\"Kai\",T82=\"Deniz Hagelstein\",\"Deniz\",T82=\"Frank Nijholt\",\"Frank\",T82=\"Matthias Nolte\",\"Matthias\",T82=\"Jörg Frahm\",\"Jörg\")","v":"Mario"}]
[null,{"$f":"_xlfn.IFS(B33=\"Annegret Schmidt\",\"Anne\",B33=\"Ilona Wetzel\",\"Ilona\",B33=\"Michael Wetzel\",\"Michael\",B33=\"Mario Jurk\",\"Mario\",B33=\"Kai Roßberg\",\"Kai\",B33=\"Deniz Hagelstein\",\"Deniz\",B33=\"Frank Nijholt\",\"Frank\",B33=\"Matthias Nolte\",\"Matthias\",B33=\"Jörg Frahm\",\"Jörg\",B33=\"Jörg Frahm (Abw)\",\"Jörg (Abw)\",B33=\"Michael Wetzel (Abw)\",\"Michael (Abw)\")","v":"Deniz"},null,null,null,{"$f":"_xlfn.IFS(K33=\"Annegret Schmidt\",\"Anne\",K33=\"Ilona Wetzel\",\"Ilona\",K33=\"Michael Wetzel\",\"Michael\",K33=\"Mario Jurk\",\"Mario\",K33=\"Kai Roßberg\",\"Kai\",K33=\"Deniz Hagelstein\",\"Deniz\",K33=\"Frank Nijholt\",\"Frank\",K33=\"Matthias Nolte\",\"Matthias\",K33=\"Jörg Frahm\",\"Jörg\",K33=\"Jörg Frahm (Abw)\",\"Jörg (Abw)\",K33=\"Michael Wetzel (Abw)\",\"Michael (Abw)\")","v":"Ilona"},null,null,null,{"$f":"_xlfn.IFS(T33=\"Annegret Schmidt\",\"Anne\",T33=\"Ilona Wetzel\",\"Ilona\",T33=\"Michael Wetzel\",\"Michael\",T33=\"Mario Jurk\",\"Mario\",T33=\"Kai Roßberg\",\"Kai\",T33=\"Deniz Hagelstein\",\"Deniz\",T33=\"Frank Nijholt\",\"Frank\",T33=\"Matthias Nolte\",\"Matthias\",T33=\"Jörg Frahm\",\"Jörg\",T33=\"Jörg Frahm (Abw)\",\"Jörg (Abw)\",T33=\"Michael Wetzel (Abw)\",\"Michael (Abw)\")","v":"Michael"},null,null,null,{"$f":"_xlfn.IFS(AC33=\"Annegret Schmidt\",\"Anne\",AC33=\"Ilona Wetzel\",\"Ilona\",AC33=\"Michael Wetzel\",\"Michael\",AC33=\"Mario Jurk\",\"Mario\",AC33=\"Kai Roßberg\",\"Kai\",AC33=\"Deniz Hagelstein\",\"Deniz\",AC33=\"Frank Nijholt\",\"Frank\",AC33=\"Matthias Nolte\",\"Matthias\",AC33=\"Jörg Frahm\",\"Jörg\",AC33=\"Jörg Frahm (Abw)\",\"Jörg (Abw)\",AC33=\"Michael Wetzel (Abw)\",\"Michael (Abw)\")","v":"Jörg"},null,null,null,{"$f":"_xlfn.IFS(AL33=\"Annegret Schmidt\",\"Anne\",AL33=\"Ilona Wetzel\",\"Ilona\",AL33=\"Michael Wetzel\",\"Michael\",AL33=\"Mario Jurk\",\"Mario\",AL33=\"Kai Roßberg\",\"Kai\",AL33=\"Deniz Hagelstein\",\"Deniz\",AL33=\"Frank Nijholt\",\"Frank\",AL33=\"Matthias Nolte\",\"Matthias\",AL33=\"Jörg Frahm\",\"Jörg\",AL33=\"Jörg Frahm (Abw)\",\"Jörg (Abw)\",AL33=\"Michael Wetzel (Abw)\",\"Michael (Abw)\")","v":"Michael"},null,null,null,{"$f":"_xlfn.IFS(B59=\"Annegret Schmidt\",\"Anne\",B59=\"Ilona Wetzel\",\"Ilona\",B59=\"Michael Wetzel\",\"Michael\",B59=\"Mario Jurk\",\"Mario\",B59=\"Kai Roßberg\",\"Kai\",B59=\"Deniz Hagelstein\",\"Deniz\",B59=\"Frank Nijholt\",\"Frank\",B59=\"Matthias Nolte\",\"Matthias\",B59=\"Jörg Frahm\",\"Jörg\",B59=\"Jörg Frahm (Abw)\",\"Jörg (Abw)\",B59=\"Michael Wetzel (Abw)\",\"Michael (Abw)\")","v":"Jörg"},null,null,null,{"$f":"_xlfn.IFS(K59=\"Annegret Schmidt\",\"Anne\",K59=\"Ilona Wetzel\",\"Ilona\",K59=\"Michael Wetzel\",\"Michael\",K59=\"Mario Jurk\",\"Mario\",K59=\"Kai Roßberg\",\"Kai\",K59=\"Deniz Hagelstein\",\"Deniz\",K59=\"Frank Nijholt\",\"Frank\",K59=\"Matthias Nolte\",\"Matthias\",K59=\"Jörg Frahm\",\"Jörg\",K59=\"Jörg Frahm (Abw)\",\"Jörg (Abw)\",K59=\"Michael Wetzel (Abw)\",\"Michael (Abw)\")","v":"Kai"},null,null,null,{"$f":"_xlfn.IFS(T59=\"Annegret Schmidt\",\"Anne\",T59=\"Ilona Wetzel\",\"Ilona\",T59=\"Michael Wetzel\",\"Michael\",T59=\"Mario Jurk\",\"Mario\",T59=\"Kai Roßberg\",\"Kai\",T59=\"Deniz Hagelstein\",\"Deniz\",T59=\"Frank Nijholt\",\"Frank\",T59=\"Matthias Nolte\",\"Matthias\",T59=\"Jörg Frahm\",\"Jörg\",T59=\"Jörg Frahm (Abw)\",\"Jörg (Abw)\",T59=\"Michael Wetzel (Abw)\",\"Michael (Abw)\")","v":"Matthias"},null,null,null,{"$f":"_xlfn.IFS(AC59=\"Annegret Schmidt\",\"Anne\",AC59=\"Ilona Wetzel\",\"Ilona\",AC59=\"Michael Wetzel\",\"Michael\",AC59=\"Mario Jurk\",\"Mario\",AC59=\"Kai Roßberg\",\"Kai\",AC59=\"Deniz Hagelstein\",\"Deniz\",AC59=\"Frank Nijholt\",\"Frank\",AC59=\"Matthias Nolte\",\"Matthias\",AC59=\"Jörg Frahm\",\"Jörg\",R59=\"Jörg Frahm (Abw)\",\"Jörg (Abw)\",AC59=\"Michael Wetzel (Abw)\",\"Michael (Abw)\")","v":"Matthias"},null,null,null,{"$f":"_xlfn.IFS(AL59=\"Annegret Schmidt\",\"Anne\",AL59=\"Ilona Wetzel\",\"Ilona\",AL59=\"Michael Wetzel\",\"Michael\",AL59=\"Mario Jurk\",\"Mario\",AL59=\"Kai Roßberg\",\"Kai\",AL59=\"Deniz Hagelstein\",\"Deniz\",AL59=\"Frank Nijholt\",\"Frank\",AL59=\"Matthias Nolte\",\"Matthias\",AL59=\"Jörg Frahm\",\"Jörg\",AL59=\"Jörg Frahm (Abw)\",\"Jörg (Abw)\",AL59=\"Michael Wetzel (Abw)\",\"Michael (Abw)\")","v":"Matthias"},null,null,null,{"$f":"_xlfn.IFS(AU59=\"Annegret Schmidt\",\"Anne\",AU59=\"Ilona Wetzel\",\"Ilona\",AU59=\"Michael Wetzel\",\"Michael\",AU59=\"Mario Jurk\",\"Mario\",AU59=\"Kai Roßberg\",\"Kai\",AU59=\"Deniz Hagelstein\",\"Deniz\",AU59=\"Frank Nijholt\",\"Frank\",AU59=\"Matthias Nolte\",\"Matthias\",AU59=\"Jörg Frahm\",\"Jörg\",AU59=\"Jörg Frahm (Abw)\",\"Jörg (Abw)\",AU59=\"Michael Wetzel (Abw)\",\"Michael (Abw)\")","v":"Kai"},null,null,null,{"$f":"_xlfn.IFS(B83=\"Annegret Schmidt\",\"Anne\",B83=\"Ilona Wetzel\",\"Ilona\",B83=\"Michael Wetzel\",\"Michael\",B83=\"Mario Jurk\",\"Mario\",B83=\"Kai Roßberg\",\"Kai\",B83=\"Deniz Hagelstein\",\"Deniz\",B83=\"Frank Nijholt\",\"Frank\",B83=\"Matthias Nolte\",\"Matthias\",B83=\"Jörg Frahm\",\"Jörg\",B83=\"Jörg Frahm (Abw)\",\"Jörg (Abw)\",B83=\"Michael Wetzel (Abw)\",\"Michael (Abw)\")","v":"Jörg"},null,null,null,{"$f":"_xlfn.IFS(K83=\"Annegret Schmidt\",\"Anne\",K83=\"Ilona Wetzel\",\"Ilona\",K83=\"Michael Wetzel\",\"Michael\",K83=\"Mario Jurk\",\"Mario\",K83=\"Kai Roßberg\",\"Kai\",K83=\"Deniz Hagelstein\",\"Deniz\",K83=\"Frank Nijholt\",\"Frank\",K83=\"Matthias Nolte\",\"Matthias\",K83=\"Jörg Frahm\",\"Jörg\",K83=\"Jörg Frahm (Abw)\",\"Jörg (Abw)\",K83=\"Michael Wetzel (Abw)\",\"Michael (Abw)\")","v":"Kai"},null,null,null,{"$f":"_xlfn.IFS(T83=\"Annegret Schmidt\",\"Anne\",T83=\"Ilona Wetzel\",\"Ilona\",T83=\"Michael Wetzel\",\"Michael\",T83=\"Mario Jurk\",\"Mario\",T83=\"Kai Roßberg\",\"Kai\",T83=\"Deniz Hagelstein\",\"Deniz\",T83=\"Frank Nijholt\",\"Frank\",T83=\"Matthias Nolte\",\"Matthias\",T83=\"Jörg Frahm\",\"Jörg\",T83=\"Jörg Frahm (Abw)\",\"Jörg (Abw)\",T83=\"Michael Wetzel (Abw)\",\"Michael (Abw)\")","v":"Matthias"}]
[]
[]
[]
[]
[null,"Bahn:",null,{"$f":"VLOOKUP(F105,Hilfstabelle!$BC$3:$BD$16,2,0)","v":"Othmarschen - (OT)"},null,null,null,null,null,null,"Bahn:",null,{"$f":"VLOOKUP(O105,Hilfstabelle!$BC$3:$BD$16,2,0)","v":"Wandsbek - (WB)"},null,null,null,null,null,null,"Bahn:",null,{"$f":"VLOOKUP(X105,Hilfstabelle!$BC$3:$BD$16,2,0)","v":"Othmarschen - (OT)"},null,null,null,null,null,null,"Bahn:",null,{"$f":"VLOOKUP(AG105,Hilfstabelle!$BC$3:$BD$16,2,0)","v":"Wandsbek - (WB)"},null,null,null,null,null,null,"Bahn:",null,{"$f":"VLOOKUP(AP105,Hilfstabelle!$BC$3:$BD$16,2,0)","v":"Othmarschen - (OT)"}]
[null,"1.","Antritt",null,null,{"$f":"VLOOKUP(B105,Hilfstabelle!$A$5:$B$18,2,0)","v":"2025-09-09"},null,null,null,null,"2.","Antritt",null,null,{"$f":"VLOOKUP(K105,Hilfstabelle!$A$5:$B$18,2,0)","v":"2025-09-23"},null,null,null,null,"3.","Antritt",null,null,{"$f":"VLOOKUP(T105,Hilfstabelle!$A$5:$B$18,2,0)","v":"2025-10-07"},null,null,null,null,"4.","Antritt",null,null,{"$f":"VLOOKUP(AC105,Hilfstabelle!$A$5:$B$18,2,0)","v":"2025-10-21"},null,null,null,null,"5.","Antritt",null,null,{"$f":"VLOOKUP(AL105,Hilfstabelle!$A$5:$B$18,2,0)","v":"2025-11-04"}]
[null,"Jörg Frahm",null,null,null,null,{"$f":"IFERROR(VLOOKUP(B106,Hilfstabelle!$AZ$3:$BA$11,2,0),\"\")","v":170.96774193548387},null,null,null,"Frank Nijholt",null,null,null,null,{"$f":"IFERROR(VLOOKUP(K106,Hilfstabelle!$AZ$3:$BA$11,2,0),\"\")","v":136.73333333333332},null,null,null,"Matthias Nolte",null,null,null,null,{"$f":"IFERROR(VLOOKUP(T106,Hilfstabelle!$AZ$3:$BA$11,2,0),\"\")","v":133.33333333333334},null,null,null,"Frank Nijholt",null,null,null,null,{"$f":"IFERROR(VLOOKUP(AC106,Hilfstabelle!$AZ$3:$BA$11,2,0),\"\")","v":136.73333333333332},null,null,null,"Matthias Nolte",null,null,null,null,{"$f":"IFERROR(VLOOKUP(AL106,Hilfstabelle!$AZ$3:$BA$11,2,0),\"\")","v":133.33333333333334}]
[null,"Ilona Wetzel",null,null,null,null,{"$f":"IFERROR(VLOOKUP(B107,Hilfstabelle!$AZ$3:$BA$11,2,0),\"\")","v":153.75510204081633},null,null,null,"Annegret Schmidt",null,null,null,null,{"$f":"IFERROR(VLOOKUP(K107,Hilfstabelle!$AZ$3:$BA$11,2,0),\"\")","v":137.50793650793651},null,null,null,"Ilona Wetzel",null,null,null,null,{"$f":"IFERROR(VLOOKUP(T107,Hilfstabelle!$AZ$3:$BA$11,2,0),\"\")","v":153.75510204081633},null,null,null,"Deniz Hagelstein",null,null,null,null,{"$f":"IFERROR(VLOOKUP(AC107,Hilfstabelle!$AZ$3:$BA$11,2,0),\"\")","v":134.1904761904762},null,null,null,"Deniz Hagelstein",null,null,null,null,{"$f":"IFERROR(VLOOKUP(AL107,Hilfstabelle!$AZ$3:$BA$11,2,0),\"\")","v":134.1904761904762}]
[null,"Michael Wetzel",null,null,null,null,{"$f":"IFERROR(VLOOKUP(B108,Hilfstabelle!$AZ$3:$BA$11,2,0),\"\")","v":176.78571428571428},null,null,null,"Jörg Frahm",null,null,null,null,{"$f":"IFERROR(VLOOKUP(K108,Hilfstabelle!$AZ$3:$BA$11,2,0),\"\")","v":170.96774193548387},null,null,null,"Annegret Schmidt",null,null,null,null,{"$f":"IFERROR(VLOOKUP(T108,Hilfstabelle!$AZ$3:$BA$11,2,0),\"\")","v":137.50793650793651},null,null,null,"Michael Wetzel",null,null,null,null,{"$f":"IFERROR(VLOOKUP(AC108,Hilfstabelle!$AZ$3:$BA$11,2,0),\"\")","v":176.78571428571428},null,null,null,"Ilona Wetzel",null,null,null,null,{"$f":"IFERROR(VLOOKUP(AL108,Hilfstabelle!$AZ$3:$BA$11,2,0),\"\")","v":153.75510204081633}]
[null,"Kai Roßberg",null,null,null,null,{"$f":"IFERROR(VLOOKUP(B109,Hilfstabelle!$AZ$3:$BA$11,2,0),\"\")","v":179.41666666666666},null,null,null,"Kai Roßberg",null,null,null,null,{"$f":"IFERROR(VLOOKUP(K109,Hilfstabelle!$AZ$3:$BA$11,2,0),\"\")","v":179.41666666666666},null,null,null,"Kai Roßberg",null,null,null,null,{"$f":"IFERROR(VLOOKUP(T109,Hilfstabelle!$AZ$3:$BA$11,2,0),\"\")","v":179.41666666666666},null,null,null,"Mario Jurk",null,null,null,null,{"$f":"IFERROR(VLOOKUP(AC109,Hilfstabelle!$AZ$3:$BA$11,2,0),\"\")","v":180.27777777777777},null,null,null,"Kai Roßberg",null,null,null,null,{"$f":"IFERROR(VLOOKUP(AL109,Hilfstabelle!$AZ$3:$BA$11,2,0),\"\")","v":179.41666666666666}]
[null,"Zu erwartender \nMannschaftsschnitt:",null,null,null,null,{"$f":"SUM(G106:G109)/4","v":170.23130623217028},null,null,null,"Zu erwartender \nMannschaftsschnitt:",null,null,null,null,{"$f":"SUM(P106:P109)/4","v":156.1564196108551},null,null,null,"Zu erwartender \nMannschaftsschnitt:",null,null,null,null,{"$f":"SUM(Y106:Y109)/4","v":151.00325963718819},null,null,null,"Zu erwartender \nMannschaftsschnitt:",null,null,null,null,{"$f":"SUM(AH106:AH109)/4","v":156.99682539682539},null,null,null,"Zu erwartender \nMannschaftsschnitt:",null,null,null,null,{"$f":"SUM(AQ106:AQ109)/4","v":150.17389455782313}]
[null,null,null,null,null,null,{"$f":"SUM(G110*12)","v":2042.7756747860435},null,null,null,null,null,null,null,null,{"$f":"SUM(P110*12)","v":1873.8770353302612},null,null,null,null,null,null,null,null,{"$f":"SUM(Y110*12)","v":1812.0391156462583},null,null,null,null,null,null,null,null,{"$f":"SUM(AH110*12)","v":1883.9619047619046},null,null,null,null,null,null,null,null,{"$f":"SUM(AQ110*12)","v":1802.0867346938776}]
[]
[null,"Bahn:",null,{"$f":"VLOOKUP(F114,Hilfstabelle!$BC$3:$BD$16,2,0)","v":"Wandsbek - (WB)"},null,null,null,null,null,null,"Bahn:",null,{"$f":"VLOOKUP(O114,Hilfstabelle!$BC$3:$BD$16,2,0)","v":"Othmarschen - (OT)"},null,null,null,null,null,null,"Bahn:",null,{"$f":"VLOOKUP(X114,Hilfstabelle!$BC$3:$BD$16,2,0)","v":"Wandsbek - (WB)"},null,null,null,null,null,null,"Bahn:",null,{"$f":"VLOOKUP(AG114,Hilfstabelle!$BC$3:$BD$16,2,0)","v":"Othmarschen - (OT)"},null,null,null,null,null,null,"Bahn:",null,{"$f":"VLOOKUP(AP114,Hilfstabelle!$BC$3:$BD$16,2,0)","v":"Wandsbek - (WB)"}]
[null,"6.","Antritt",null,null,{"$f":"VLOOKUP(B114,Hilfstabelle!$A$5:$B$18,2,0)","v":"2025-11-18"},null,null,null,null,"7.","Antritt",null,null,{"$f":"VLOOKUP(K114,Hilfstabelle!$A$5:$B$18,2,0)","v":"2026-01-13"},null,null,null,null,"8.","Antritt",null,null,{"$f":"VLOOKUP(T114,Hilfstabelle!$A$5:$B$18,2,0)","v":"2026-01-27"},null,null,null,null,"9.","Antritt",null,null,{"$f":"VLOOKUP(AC114,Hilfstabelle!$A$5:$B$18,2,0)","v":"2026-02-10"},null,null,null,null,"10.","Antritt",null,null,{"$f":"VLOOKUP(AL114,Hilfstabelle!$A$5:$B$18,2,0)","v":"2026-02-24"}]
[null,"Frank Nijholt",null,null,null,null,{"$f":"IFERROR(VLOOKUP(B115,Hilfstabelle!$AZ$3:$BA$11,2,0),\"\")","v":136.73333333333332},null,null,null,"Matthias Nolte",null,null,null,null,{"$f":"IFERROR(VLOOKUP(K115,Hilfstabelle!$AZ$3:$BA$11,2,0),\"\")","v":133.33333333333334},null,null,null,"Ilona Wetzel",null,null,null,null,{"$f":"IFERROR(VLOOKUP(T115,Hilfstabelle!$AZ$3:$BA$11,2,0),\"\")","v":153.75510204081633},null,null,null,"Annegret Schmidt",null,null,null,null,{"$f":"IFERROR(VLOOKUP(AC115,Hilfstabelle!$AZ$3:$BA$11,2,0),\"\")","v":137.50793650793651},null,null,null,"Frank Nijholt",null,null,null,null,{"$f":"IFERROR(VLOOKUP(AL115,Hilfstabelle!$AZ$3:$BA$11,2,0),\"\")","v":136.73333333333332}]
[null,"Ilona Wetzel",null,null,null,null,{"$f":"IFERROR(VLOOKUP(B116,Hilfstabelle!$AZ$3:$BA$11,2,0),\"\")","v":153.75510204081633},null,null,null,"Frank Nijholt",null,null,null,null,{"$f":"IFERROR(VLOOKUP(K116,Hilfstabelle!$AZ$3:$BA$11,2,0),\"\")","v":136.73333333333332},null,null,null,"Jörg Frahm",null,null,null,null,{"$f":"IFERROR(VLOOKUP(T116,Hilfstabelle!$AZ$3:$BA$11,2,0),\"\")","v":170.96774193548387},null,null,null,"Ilona Wetzel",null,null,null,null,{"$f":"IFERROR(VLOOKUP(AC116,Hilfstabelle!$AZ$3:$BA$11,2,0),\"\")","v":153.75510204081633},null,null,null,"Annegret Schmidt",null,null,null,null,{"$f":"IFERROR(VLOOKUP(AL116,Hilfstabelle!$AZ$3:$BA$11,2,0),\"\")","v":137.50793650793651}]
[null,"Michael Wetzel",null,null,null,null,{"$f":"IFERROR(VLOOKUP(B117,Hilfstabelle!$AZ$3:$BA$11,2,0),\"\")","v":176.78571428571428},null,null,null,"Annegret Schmidt",null,null,null,null,{"$f":"IFERROR(VLOOKUP(K117,Hilfstabelle!$AZ$3:$BA$11,2,0),\"\")","v":137.50793650793651},null,null,null,"Kai Roßberg",null,null,null,null,{"$f":"IFERROR(VLOOKUP(T117,Hilfstabelle!$AZ$3:$BA$11,2,0),\"\")","v":179.41666666666666},null,null,null,"Jörg Frahm",null,null,null,null,{"$f":"IFERROR(VLOOKUP(AC117,Hilfstabelle!$AZ$3:$BA$11,2,0),\"\")","v":170.96774193548387},null,null,null,"Deniz Hagelstein",null,null,null,null,{"$f":"IFERROR(VLOOKUP(AL117,Hilfstabelle!$AZ$3:$BA$11,2,0),\"\")","v":134.1904761904762}]
[null,"Mario Jurk",null,null,null,null,{"$f":"IFERROR(VLOOKUP(B118,Hilfstabelle!$AZ$3:$BA$11,2,0),\"\")","v":180.27777777777777},null,null,null,"Mario Jurk",null,null,null,null,{"$f":"IFERROR(VLOOKUP(K118,Hilfstabelle!$AZ$3:$BA$11,2,0),\"\")","v":180.27777777777777},null,null,null,"Mario Jurk",null,null,null,null,{"$f":"IFERROR(VLOOKUP(T118,Hilfstabelle!$AZ$3:$BA$11,2,0),\"\")","v":180.27777777777777},null,null,null,"Michael Wetzel",null,null,null,null,{"$f":"IFERROR(VLOOKUP(AC118,Hilfstabelle!$AZ$3:$BA$11,2,0),\"\")","v":176.78571428571428},null,null,null,"Michael Wetzel",null,null,null,null,{"$f":"IFERROR(VLOOKUP(AL118,Hilfstabelle!$AZ$3:$BA$11,2,0),\"\")","v":176.78571428571428}]
[null,"Zu erwartender \nMannschaftsschnitt:",null,null,null,null,156.56726190476189,null,null,null,"Zu erwartender \nMannschaftsschnitt:",null,null,null,null,{"$f":"SUM(P115:P118)/4","v":146.96309523809524},null,null,null,"Zu erwartender \nMannschaftsschnitt:",null,null,null,null,{"$f":"SUM(Y115:Y118)/4","v":171.10432210518616},null,null,null,"Zu erwartender \nMannschaftsschnitt:",null,null,null,null,{"$f":"SUM(AH115:AH118)/4","v":159.75412369248772},null,null,null,"Zu erwartender \nMannschaftsschnitt:",null,null,null,null,{"$f":"SUM(AQ115:AQ118)/4","v":146.30436507936508}]
[null,null,null,null,null,null,{"$f":"SUM(G119*12)","v":1878.8071428571427},null,null,null,null,null,null,null,null,{"$f":"SUM(P119*12)","v":1763.5571428571429},null,null,null,null,null,null,null,null,{"$f":"SUM(Y119*12)","v":2053.2518652622339},null,null,null,null,null,null,null,null,{"$f":"SUM(AH119*12)","v":1917.0494843098527},null,null,null,null,null,null,null,null,{"$f":"SUM(AQ119*12)","v":1755.652380952381}]
[]
[null,"Bahn:",null,{"$f":"VLOOKUP(F123,Hilfstabelle!$BC$3:$BD$16,2,0)","v":"Othmarschen - (OT)"},null,null,null,null,null,null,"Bahn:",null,{"$f":"VLOOKUP(O123,Hilfstabelle!$BC$3:$BD$16,2,0)","v":"Wandsbek - (WB)"},null,null,null,null,null,null,"Bahn:",null,{"$f":"VLOOKUP(X123,Hilfstabelle!$BC$3:$BD$16,2,0)","v":"Othmarschen - (OT)"},null,null,null,null,null,null,"Bahn:",null,{"$f":"VLOOKUP(AG123,Hilfstabelle!$BC$3:$BD$16,2,0)","v":"Wandsbek - (WB)"}]
[null,"11.","Antritt",null,null,{"$f":"VLOOKUP(B123,Hilfstabelle!$A$5:$B$18,2,0)","v":"2026-03-10"},null,null,null,null,"12.","Antritt",null,null,{"$f":"VLOOKUP(K123,Hilfstabelle!$A$5:$B$18,2,0)","v":"2026-03-24"},null,null,null,null,"13.","Antritt",null,null,{"$f":"VLOOKUP(T123,Hilfstabelle!$A$5:$B$18,2,0)","v":"2026-04-07"},null,null,null,null,"14.","Antritt",null,null,{"$f":"VLOOKUP(AC123,Hilfstabelle!$A$5:$B$18,2,0)","v":"2026-04-21"}]
[null,"Matthias Nolte",null,null,null,null,{"$f":"IFERROR(VLOOKUP(B124,Hilfstabelle!$AZ$3:$BA$11,2,0),\"\")","v":133.33333333333334},null,null,null,"Deniz Hagelstein",null,null,null,null,{"$f":"IFERROR(VLOOKUP(K124,Hilfstabelle!$AZ$3:$BA$11,2,0),\"\")","v":134.1904761904762},null,null,null,"Matthias Nolte",null,null,null,null,{"$f":"IFERROR(VLOOKUP(T124,Hilfstabelle!$AZ$3:$BA$11,2,0),\"\")","v":133.33333333333334},null,null,null,"Deniz Hagelstein",null,null,null,null,{"$f":"IFERROR(VLOOKUP(AC124,Hilfstabelle!$AZ$3:$BA$11,2,0),\"\")","v":134.1904761904762}]
[null,"Deniz Hagelstein",null,null,null,null,{"$f":"IFERROR(VLOOKUP(B125,Hilfstabelle!$AZ$3:$BA$11,2,0),\"\")","v":134.1904761904762},null,null,null,"Annegret Schmidt",null,null,null,null,{"$f":"IFERROR(VLOOKUP(K125,Hilfstabelle!$AZ$3:$BA$11,2,0),\"\")","v":137.50793650793651},null,null,null,"Jörg Frahm",null,null,null,null,{"$f":"IFERROR(VLOOKUP(T125,Hilfstabelle!$AZ$3:$BA$11,2,0),\"\")","v":170.96774193548387},null,null,null,"Ilona Wetzel",null,null,null,null,{"$f":"IFERROR(VLOOKUP(AC125,Hilfstabelle!$AZ$3:$BA$11,2,0),\"\")","v":153.75510204081633}]
[null,"Frank Nijholt",null,null,null,null,{"$f":"IFERROR(VLOOKUP(B126,Hilfstabelle!$AZ$3:$BA$11,2,0),\"\")","v":136.73333333333332},null,null,null,"Kai Roßberg",null,null,null,null,{"$f":"IFERROR(VLOOKUP(K126,Hilfstabelle!$AZ$3:$BA$11,2,0),\"\")","v":179.41666666666666},null,null,null,"Michael Wetzel",null,null,null,null,{"$f":"IFERROR(VLOOKUP(T126,Hilfstabelle!$AZ$3:$BA$11,2,0),\"\")","v":176.78571428571428},null,null,null,"Jörg Frahm",null,null,null,null,{"$f":"IFERROR(VLOOKUP(AC126,Hilfstabelle!$AZ$3:$BA$11,2,0),\"\")","v":170.96774193548387}]
[null,"Mario Jurk",null,null,null,null,{"$f":"IFERROR(VLOOKUP(B127,Hilfstabelle!$AZ$3:$BA$11,2,0),\"\")","v":180.27777777777777},null,null,null,"Mario Jurk",null,null,null,null,{"$f":"IFERROR(VLOOKUP(K127,Hilfstabelle!$AZ$3:$BA$11,2,0),\"\")","v":180.27777777777777},null,null,null,"Mario Jurk",null,null,null,null,{"$f":"IFERROR(VLOOKUP(T127,Hilfstabelle!$AZ$3:$BA$11,2,0),\"\")","v":180.27777777777777},null,null,null,"Michael Wetzel",null,null,null,null,{"$f":"IFERROR(VLOOKUP(AC127,Hilfstabelle!$AZ$3:$BA$11,2,0),\"\")","v":176.78571428571428}]
[null,"Zu erwartender \nMannschaftsschnitt:",null,null,null,null,{"$f":"SUM(G124:G127)/4","v":146.13373015873015},null,null,null,"Zu erwartender \nMannschaftsschnitt:",null,null,null,null,{"$f":"SUM(P124:P127)/4","v":157.84821428571428},null,null,null,"Zu erwartender \nMannschaftsschnitt:",null,null,null,null,{"$f":"SUM(Y124:Y127)/4","v":165.3411418330773},null,null,null,"Zu erwartender \nMannschaftsschnitt:",null,null,null,null,{"$f":"SUM(AH124:AH127)/4","v":158.92475861312266}]
[null,null,null,null,null,null,{"$f":"SUM(G128*12)","v":1753.6047619047617},null,null,null,null,null,null,null,null,{"$f":"SUM(P128*12)","v":1894.1785714285713},null,null,null,null,null,null,null,null,{"$f":"SUM(Y128*12)","v":1984.0937019969276},null,null,null,null,null,null,null,null,{"$f":"SUM(AH128*12)","v":1907.097103357472}]
[]
[null,null,null,null,null,"Anzahl Spiele pro Spieler/in"]
[null,null,null,null,null,"Gesamt",null,null,"OT",null,null,"WB",null,null,"P.-Nr:",null,null,null,null,null,"Anzahl Über -und Unterschnitt"]
[null,"Anne",null,null,null,{"$f":"SUM(I133:N133)","v":6},null,null,{"$f":"COUNTIF($T$14:$AA$20,\"Annegret Schmidt\")+COUNTIF($AL$14:$AS$20,\"Annegret Schmidt\")+COUNTIF($K$40:$R$46,\"Annegret Schmidt\")+COUNTIF($AC$40:$AJ$46,\"Annegret Schmidt\")+COUNTIF($AU$40:$BB$46,\"Annegret Schmidt\")+COUNTIF($K$64:$R$70,\"Annegret Schmidt\")+COUNTIF($B$14:$I$20,\"Annegret Schmidt\")","v":3},null,null,{"$f":"COUNTIF($AC$14:$AJ$20,\"Annegret Schmidt\")+COUNTIF($B$40:$I$46,\"Annegret Schmidt\")+COUNTIF($T$40:$AA$46,\"Annegret Schmidt\")+COUNTIF($AL$40:$AS$46,\"Annegret Schmidt\")+COUNTIF($B$64:$I$70,\"Annegret Schmidt\")+COUNTIF($T$64:$AA$70,\"Annegret Schmidt\")+COUNTIF($K$14:$R$20,\"Annegret Schmidt\")","v":3},null,null,19222,null,null,null,null,null,{"$f":"COUNTIFS(B110:AS110,\">156,27\")+COUNTIFS(B119:AS119,\">156,27\")+COUNTIFS(T128:AJ128,\">156,27\")+COUNTIFS(B128:S128,\">156,27\")&\" X\"","v":"8 X"},null,null,null,null,{"$f":"COUNTIFS(B110:AS110,\"<156,27\")+COUNTIFS(T128:AJ128,\"<156,27\")+COUNTIFS(B128:S128,\"<156,27\")+COUNTIFS(B119:AS119,\"<156,27\")&\" X\"","v":"6 X"}]
[null,"Deniz",null,null,null,{"$f":"SUM(I134:N134)","v":6},null,null,{"$f":"COUNTIF($T$14:$AA$20,\"Deniz Hagelstein\")+COUNTIF($AL$14:$AS$20,\"Deniz Hagelstein\")+COUNTIF($K$40:$R$46,\"Deniz Hagelstein\")+COUNTIF($AC$40:$AJ$46,\"Deniz Hagelstein\")+COUNTIF($AU$40:$BB$46,\"Deniz Hagelstein\")+COUNTIF($K$64:$R$70,\"Deniz Hagelstein\")+COUNTIF($B$14:$I$20,\"Deniz Hagelstein\")","v":2},null,null,{"$f":"COUNTIF($AC$14:$AJ$20,\"Deniz Hagelstein\")+COUNTIF($B$40:$I$46,\"Deniz Hagelstein\")+COUNTIF($T$40:$AA$46,\"Deniz Hagelstein\")+COUNTIF($AL$40:$AS$46,\"Deniz Hagelstein\")+COUNTIF($B$64:$I$70,\"Deniz Hagelstein\")+COUNTIF($T$64:$AA$70,\"Deniz Hagelstein\")+COUNTIF($K$14:$R$20,\"Deniz Hagelstein\")","v":4},null,null,24775]
[null,"Frank",null,null,null,6,null,null,{"$f":"COUNTIF($T$14:$AA$20,\"Frank Nijholt\")+COUNTIF($AL$14:$AS$20,\"Frank Nijholt\")+COUNTIF($K$40:$R$46,\"Frank Nijholt\")+COUNTIF($AC$40:$AJ$46,\"Frank Nijholt\")+COUNTIF($AU$40:$BB$46,\"Frank Nijholt\")+COUNTIF($K$64:$R$70,\"Frank Nijholt\")+COUNTIF($B$14:$I$20,\"Frank Nijholt\")","v":2},null,null,{"$f":"COUNTIF($AC$14:$AJ$20,\"Frank Nijholt\")+COUNTIF($B$40:$I$46,\"Frank Nijholt\")+COUNTIF($T$40:$AA$46,\"Frank Nijholt\")+COUNTIF($AL$40:$AS$46,\"Frank Nijholt\")+COUNTIF($B$64:$I$70,\"Frank Nijholt\")+COUNTIF($T$64:$AA$70,\"Frank Nijholt\")+COUNTIF($K$14:$R$20,\"Frank Nijholt\")","v":4},null,null,24774]
[null,"Ilona",null,null,null,7,null,null,{"$f":"COUNTIF($T$14:$AA$20,\"Ilona Wetzel\")+COUNTIF($AL$14:$AS$20,\"Ilona Wetzel\")+COUNTIF($K$40:$R$46,\"Ilona Wetzel\")+COUNTIF($AC$40:$AJ$46,\"Ilona Wetzel\")+COUNTIF($AU$40:$BB$46,\"Ilona Wetzel\")+COUNTIF($K$63:$R$70,\"Ilona Wetzel\")+COUNTIF($B$14:$I$20,\"Ilona Wetzel\")","v":4},null,null,{"$f":"COUNTIF($AC$14:$AJ$20,\"Ilona Wetzel\")+COUNTIF($B$40:$I$46,\"Ilona Wetzel\")+COUNTIF($T$40:$AA$46,\"Ilona Wetzel\")+COUNTIF($AL$40:$AS$46,\"Ilona Wetzel\")+COUNTIF($B$64:$I$70,\"Ilona Wetzel\")+COUNTIF($T$64:$AA$70,\"Ilona Wetzel\")+COUNTIF($K$14:$R$20,\"Ilona Wetzel\")","v":3},null,null,22115]
[null,"Jörg",null,null,null,6,null,null,{"$f":"COUNTIF($T$14:$AA$20,\"Jörg Frahm\")+COUNTIF($AL$14:$AS$20,\"Jörg Frahm\")+COUNTIF($K$40:$R$46,\"Jörg Frahm\")+COUNTIF($AC$40:$AJ$46,\"Jörg Frahm\")+COUNTIF($AU$40:$BB$46,\"Jörg Frahm\")+COUNTIF($K$64:$R$70,\"Jörg Frahm\")+COUNTIF($B$14:$I$20,\"Jörg Frahm\")","v":3},null,null,{"$f":"COUNTIF($AC$14:$AJ$20,\"Jörg Frahm\")+COUNTIF($B$40:$I$46,\"Jörg Frahm\")+COUNTIF($T$40:$AA$46,\"Jörg Frahm\")+COUNTIF($AL$40:$AS$46,\"Jörg Frahm\")+COUNTIF($B$64:$I$70,\"Jörg Frahm\")+COUNTIF($T$64:$AA$70,\"Jörg Frahm\")+COUNTIF($K$14:$R$20,\"Jörg Frahm\")","v":3},null,null,19221]
[null,"Kai",null,null,null,6,null,null,{"$f":"COUNTIF($T$14:$AA$20,\"Kai Roßberg\")+COUNTIF($AL$14:$AS$20,\"Kai Roßberg\")+COUNTIF($K$40:$R$46,\"Kai Roßberg\")+COUNTIF($AC$40:$AJ$46,\"Kai Roßberg\")+COUNTIF($AU$40:$BB$46,\"Kai Roßberg\")+COUNTIF($K$64:$R$70,\"Kai Roßberg\")+COUNTIF($B$14:$I$20,\"Kai Roßberg\")","v":3},null,null,{"$f":"COUNTIF($AC$14:$AJ$20,\"Kai Roßberg\")+COUNTIF($B$40:$I$46,\"Kai Roßberg\")+COUNTIF($T$40:$AA$46,\"Kai Roßberg\")+COUNTIF($AL$40:$AS$46,\"Kai Roßberg\")+COUNTIF($B$64:$I$70,\"Kai Roßberg\")+COUNTIF($T$64:$AA$70,\"Kai Roßberg\")+COUNTIF($K$14:$R$20,\"Kai Roßberg\")","v":3},null,null,21889]
[null,"Mario",null,null,null,7,null,null,{"$f":"COUNTIF($T$14:$AA$20,\"Mario Jurk\")+COUNTIF($AL$14:$AS$20,\"Mario Jurk\")+COUNTIF($K$40:$R$46,\"Mario Jurk\")+COUNTIF($AC$40:$AJ$46,\"Mario Jurk\")+COUNTIF($AU$40:$BB$46,\"Mario Jurk\")+COUNTIF($K$64:$R$70,\"Mario Jurk\")+COUNTIF($B$14:$I$20,\"Mario Jurk\")","v":3},null,null,{"$f":"COUNTIF($AC$14:$AJ$20,\"Mario Jurk\")+COUNTIF($B$39:$I$46,\"Mario Jurk\")+COUNTIF($T$40:$AA$46,\"Mario Jurk\")+COUNTIF($AL$40:$AS$46,\"Mario Jurk\")+COUNTIF($B$63:$I$70,\"Mario Jurk\")+COUNTIF($T$63:$AA$70,\"Mario Jurk\")+COUNTIF($K$14:$R$20,\"Mario Jurk\")","v":4},null,null,23302]
[null,"Matthias",null,null,null,5,null,null,{"$f":"COUNTIF($T$14:$AA$20,\"Matthias Nolte\")+COUNTIF($AL$14:$AS$20,\"Matthias Nolte\")+COUNTIF($K$40:$R$46,\"Matthias Nolte\")+COUNTIF($AC$40:$AJ$46,\"Matthias Nolte\")+COUNTIF($AU$40:$BB$46,\"Matthias Nolte\")+COUNTIF($K$64:$R$70,\"Matthias Nolte\")+COUNTIF($B$14:$I$20,\"Matthias Nolte\")","v":5},null,null,{"$f":"COUNTIF($AC$14:$AJ$20,\"Matthias Nolte\")+COUNTIF($B$40:$I$46,\"Matthias Nolte\")+COUNTIF($T$40:$AA$46,\"Matthias Nolte\")+COUNTIF($AL$40:$AS$46,\"Matthias Nolte\")+COUNTIF($B$64:$I$70,\"Matthias Nolte\")+COUNTIF($T$64:$AA$70,\"Matthias Nolte\")+COUNTIF($K$14:$R$20,\"Matthias Nolte\")","v":0},null,null,20137]
[null,"Michael",null,null,null,7,null,null,{"$f":"COUNTIF($T$14:$AA$20,\"Michael Wetzel\")+COUNTIF($AL$14:$AS$20,\"Michael Wetzel\")+COUNTIF($K$40:$R$46,\"Michael Wetzel\")+COUNTIF($AC$40:$AJ$46,\"Michael Wetzel\")+COUNTIF($AU$40:$BB$46,\"Michael Wetzel\")+COUNTIF($K$64:$R$70,\"Michael Wetzel\")+COUNTIF($B$14:$I$20,\"Michael Wetzel\")","v":3},null,null,{"$f":"COUNTIF($AC$14:$AJ$20,\"Michael Wetzel\")+COUNTIF($B$40:$I$46,\"Michael Wetzel\")+COUNTIF($T$40:$AA$46,\"Michael Wetzel\")+COUNTIF($AL$40:$AS$46,\"Michael Wetzel\")+COUNTIF($B$64:$I$70,\"Michael Wetzel\")+COUNTIF($T$64:$AA$70,\"Michael Wetzel\")+COUNTIF($K$14:$R$20,\"Michael Wetzel\")","v":4},null,null,22113]
[null,null,null,null,null,{"$f":"SUM(F133:H141)","v":56},null,null,{"$f":"SUM(I133:K141)","v":28},null,null,{"$f":"SUM(L133:N141)","v":28}]

{"sheet":"Anmeldegruppen Turniere","index":23,"n_rows":31,"n_cols":30,"rows_kept":31,"cut":false,"hidden":false,"merged":[[3,2,3,29],[4,4,4,24],[6,28,8,28],[10,28,11,28],[6,15,14,15],[6,20,14,20],[13,28,16,28],[13,27,16,27],[6,25,7,25],[13,25,15,25],[6,29,8,29],[10,29,11,29],[13,29,16,29],[9,7,9,9],[10,7,10,9],[11,7,11,9],[29,29,30,29],[24,28,27,28],[24,29,27,29],[21,29,22,29],[24,12,24,13],[29,28,30,28],[24,27,27,27],[24,25,26,25],[23,18,23,19],[21,16,21,17],[22,16,22,17],[21,18,21,19],[22,18,22,19],[21,12,21,13],[22,12,22,13],[24,6,24,7],[24,18,24,19],[21,28,22,28],[17,4,19,9],[17,10,19,15],[17,16,19,21],[21,4,21,5],[22,4,22,5],[21,6,21,7],[22,6,22,7],[21,10,21,11],[22,10,22,11],[12,7,12,9],[13,7,13,9],[14,7,14,9],[6,10,6,12],[7,10,7,12],[8,10,8,12],[9,10,9,12],[10,10,10,12],[11,10,11,12],[12,10,12,12],[13,10,13,12],[14,10,14,12],[6,7,6,9],[7,7,7,9],[8,7,8,9]]}
[null,"Start",null,null,null,null,null,null,null,null,null,null,null,null,null,null,null,null,null,null,{"$f":"26+18+14+8","v":66}]
[null,"Rangliste"]
[]
[null,null,{"$f":"\"Turnierplanung PUNKTSPIELSAISON  \"&'Hilfstabelle Mannschaften'!I6","v":"Turnierplanung PUNKTSPIELSAISON  2025/2026"}]
[null,null,null,null,"Bei  ED, HM,FM und DM bestimmt der/die  ranghöchste Partner/in die Meldegruppe"]
[null,null,null,null,"Mitgliedsname",null,null,"Pass-Nummer",null,null,"Rangliste \n2024/25",null,null,"ED","HC","HM","WB","EM ","EM alternativ",null,"FM","DM",null,null,null,null,"Gruppen","Termine","Meldeschluss","Letzter Abmeldetermin"]
[null,null,null,null,"Ilona Wetzel",null,null,22115,null,null,{"$f":"VLOOKUP(E7,'Offizielle BSV-Rangliste'!F9:I10,4,0)","v":153.75510204081633},null,null,{"$f":"IF(K7<175,\"B\",\"A\")","v":"B"},null,null,null,"DB","D-SB",null,null,{"$f":"IF(K7<185,\"B\",IF(K7>=185,\"A\",\"\"))","v":"B"},null,{"$f":"+R7","v":"DB"},null,"ED = Eröffnungsdoppel  ","Gruppe  A",null,"2025-08-20","2025-08-15"]
[null,null,null,null,"Annegret Schmidt",null,null,19222,null,null,{"$f":"VLOOKUP(E8,'Offizielle BSV-Rangliste'!F9:I10,4,0)","v":137.50793650793651},null,null,"B",null,null,null,"DB","D-SB",null,null,"B",null,{"$f":"+#REF!&\" / \"&#REF!","v":{"$error":"#REF!"}},null,null,"Gruppe A/B","13. / 14. 09. 2025"]
[null,null,null,null,"Mario Jurk",null,null,23302,null,null,{"$f":"VLOOKUP(E9,'Offizielle BSV-Rangliste'!$F$16:$I$22,4,0)","v":180.27777777777777},null,null,"A",null,null,null,"HC","H-SA",null,null,"B",null,{"$f":"+#REF!","v":{"$error":"#REF!"}},null,"Startgeld: 50 € je Doppel","Gruppe  B"]
[null,null,null,null,"Kai Roßberg",null,null,21889,null,null,{"$f":"VLOOKUP(E10,'Offizielle BSV-Rangliste'!$F$16:$I$22,4,0)","v":179.41666666666666},null,null,"A",null,null,null,"HC","H-SA",null,null,"B",null,{"$f":"+#REF!","v":{"$error":"#REF!"}}]
[null,null,null,null,"Michael Wetzel",null,null,22113,null,null,{"$f":"VLOOKUP(E11,'Offizielle BSV-Rangliste'!$F$16:$I$22,4,0)","v":176.78571428571428},null,null,"A",null,null,null,"HC","H-SB",null,null,"B",null,{"$f":"+R8","v":"DB"},null,"HC = Hamburg Cup","1. Antritt","27. / 28. 09. 2025","2025-09-03","2025-08-30"]
[". ",null,null,null,"Jörg Frahm",null,null,19221,null,null,{"$f":"VLOOKUP(E12,'Offizielle BSV-Rangliste'!$F$16:$I$22,4,0)","v":170.96774193548387},null,null,"B",null,null,null,"HC","H-SC",null,null,"B",null,{"$f":"+#REF!&\" / \"&#REF!","v":{"$error":"#REF!"}},null,"20 € je Teilnehmer je Antritt","2. Antritt","11. / 12. 10. 2025"]
[null,null,null,null,"Deniz Hagelstein",null,null,24775,null,null,{"$f":"VLOOKUP(E13,'Offizielle BSV-Rangliste'!$F$16:$I$22,4,0)","v":134.1904761904762},null,null,"B",null,null,null,"HC","H-SA",null,null,"B",null,{"$f":"+R10&\" / \"&S10","v":"HC / H-SA"}]
[null,null,null,null,"Frank Nijholt",null,null,24774,null,null,{"$f":"VLOOKUP(E14,'Offizielle BSV-Rangliste'!$F$16:$I$22,4,0)","v":136.73333333333332},null,null,"B",null,null,null,"HC","H-SA",null,null,"B",null,{"$f":"+#REF!","v":{"$error":"#REF!"}},null,"HM = Herbst-Mixed","Gruppe A","15. / 16. 11. 2025","2025-10-22","2025-10-15"]
[null,null,null,null,"Matthias Nolte",null,null,20137,null,null,{"$f":"VLOOKUP(E15,'Offizielle BSV-Rangliste'!$F$16:$I$22,4,0)","v":133.33333333333334},null,null,"B",null,null,null,"HC","H-SA",null,null,"B",null,{"$f":"+R12&\" / \"&S12","v":"HC / H-SC"},null,null,"Gruppe B"]
[null,null,null,null,null,null,null,null,null,null,null,null,null,null,null,null,null,"HM und FM siehe Berechnungsmodul",null,null,null,null,null,{"$f":"+#REF!&\" / \"&#REF!","v":{"$error":"#REF!"}},null,null,"Gruppe C"]
[null,null,null,null,null,null,null,null,null,null,null,null,null,null,null,null,null,null,null,null,null,null,null,{"$f":"+#REF!&\" / \"&#REF!","v":{"$error":"#REF!"}},null,"Startgeld: 38 € je Paar","Gruppe D"]
[null,null,null,null,"Berechnungsmodul für Herbst- und Frühjarsmixed",null,null,null,null,null,"Berechnungsmodul für Eröffnungsdoppel, Herren",null,null,null,null,null,"Berechnungsmodul für Eröffnungsdoppel, Damen",null,null,null,null,null,null,{"$f":"+#REF!&\" / \"&#REF!","v":{"$error":"#REF!"}}]
[null,null,null,null,null,null,null,null,null,null,null,null,null,null,null,null,null,null,null,null,null,null,null,null,null,"WB = Weihnachts-Bowling",null,"13. / 14. 12. 2025","2025-11-19","2025-11-12"]
[null,null,null,null,null,null,null,null,null,null,null,null,null,null,null,null,null,null,null,null,null,null,null,{"$f":"+#REF!","v":{"$error":"#REF!"}},null,"Startgeld: 22 € je Teilnehmer"]
[null,null,null,null,null,null,null,null,"Schnitt","Gruppe",null,null,null,null,null,null,null,null,null,null,null,null,null,{"$f":"+#REF!&\" / \"&#REF!","v":{"$error":"#REF!"}}]
[null,null,null,null,"Schnitt Spieler 1:",null,155,null,0,"A","Schnitt Spieler 1:",null,164.35,null,null,null,"Schnitt Spieler 1:",null,{"$f":"+K7","v":153.75510204081633},null,null,null,null,{"$f":"+#REF!","v":{"$error":"#REF!"}},null,"EM = Einzelmeisterschaft\n (alle Gruppen)","1. Antritt","17. / 18. 01. 2026"," 24. Dezember 2025"," 19. Dezember 2025"]
[null,null,null,null,"Schnitt Spieler 2:",null,154,null,0.01,"D","Schnitt Spieler 2:",null,164.35,null,"Schnitt","Gruppe","Schnitt Spieler 2:",null,{"$f":"+K8","v":137.50793650793651},null,"Schnitt","Gruppe",null,{"$f":"+#REF!","v":{"$error":"#REF!"}},null,"Startgeld: 50 € je Teilnehmer für beide Antritte","2. Antritt","31. / 01. 02. 2026"]
[null,null,null,null,null,null,{"$f":"SUM(G22:G23/2)","v":154.5},null,155,"C",null,null,{"$f":"SUM(M22:M23/2)","v":164.35},null,165,"C",null,null,{"$f":"SUM(S22:S23/2)","v":145.63151927437642},null,null,null,null,{"$f":"+#REF!","v":{"$error":"#REF!"}}]
[null,null,null,null,"also Gruppe",null,{"$f":"VLOOKUP(G24,I22:J26,2)","v":"D"},null,165,"B","also Gruppe",null,{"$f":"_xlfn.IFS(AND(M24<=O24),P24,AND(M24>=O24,M24<=O25),P25,AND(M24>=O25),P26)","v":"C"},null,174.99,"B","also Gruppe",null,{"$f":"_xlfn.IFS(AND(S24<=U24),V24,AND(S24>=U24,S24<=U25),V25,AND(S24>=U25),V26)","v":"B"},null,159.99,"B",null,{"$f":"+#REF!&\" / \"&#REF!","v":{"$error":"#REF!"}},null,"FM = Frühjahrs-Mixed","Gruppe A","21. / 22. 03. 2026","2026-02-25","2026-02-20"]
[null,null,null,null,null,null,null,null,175,"A",null,null,null,null,175,"A",null,null,null,null,160,"A",null,{"$f":"+R13&\" / \"&S13","v":"HC / H-SA"},null,null,"Gruppe B"]
[null,null,null,null,null,null,null,null,null,null,null,null,null,null,null,null,null,null,null,null,null,null,null,{"$f":"+E31&\" / \"&#REF!","v":{"$error":"#REF!"}},null,null,"Gruppe C"]
[null,null,null,null,null,null,null,null,null,null,null,null,null,null,null,null,null,null,null,null,null,null,null,{"$f":"+E32&\" / \"&#REF!","v":{"$error":"#REF!"}},null,"Startgeld: 38 € je Paar","Gruppe D"]
[null,null,null,null,null,null,null,null,null,null,null,null,null,null,null,null,null,null,null,null,null,null,null,{"$f":"+#REF!","v":{"$error":"#REF!"}}]
[null,null,null,null,null,null,null,null,null,null,null,null,null,null,null,null,null,null,null,null,null,null,null,{"$f":"+#REF!&\" / \"&#REF!","v":{"$error":"#REF!"}},null,"DM = Doppelmeisterschaft\n  (alle Gruppen)","1. Antritt","25. / 26. 04. 2026","2026-04-01","2026-03-25"]
[null,null,null,null,null,null,null,null,null,null,null,null,null,null,null,null,null,null,null,null,null,null,null,null,null,"Startgeld: 20 € je Teilnehmer","2. Antritt","09. / 10. 05. 2026"]

{"sheet":"Offizielle BSV-Rangliste","index":24,"n_rows":25,"n_cols":9,"rows_kept":25,"cut":false,"hidden":false,"merged":[[52,4,53,13],[28,4,29,13],[38,4,38,9],[14,17,14,19],[7,17,7,19],[7,15,8,15],[7,16,8,16],[14,15,15,15],[14,16,15,16],[6,5,7,5],[6,6,6,8],[13,5,14,5],[13,6,13,8],[39,4,40,13]]}
[null,"Start",null,null,null,{"$f":"\"Saison  \"&+Hilfstabelle!D5","v":"Saison  2025/2026"}]
[null,"Rangliste"]
[]
[null,null,null,null,"Offizielle Rangliste PANA-Spieler"]
[]
[null,null,null,null,null,"Damen"]
[null,null,null,null,null,"Name"]
[null,null,null,null,null,null,"Anzahl Spiele","Pins","Schnitt"]
[null,null,null,null,null,"Annegret Schmidt",63,8663,{"$f":"IF(H9<1,\"\",+H9/G9)","v":137.50793650793651}]
[null,null,null,null,null,"Ilona Wetzel",49,7534,{"$f":"IF(H10<1,\"\",+H10/G10)","v":153.75510204081633}]
[null,null,null,null,null,null,{"$f":"SUM(H9:H10)","v":16197},{"$f":"SUM(G9:G10)","v":112},{"$f":"+G11/H11","v":144.61607142857142}]
[]
[null,null,null,null,null,"Herren"]
[null,null,null,null,null,"Name"]
[null,null,null,null,null,null,"Anzahl Spiele","Pins","Schnitt"]
[null,null,null,null,null,"Mario Jurk",18,3245,{"$f":"IF(H16<1,\"\",+H16/G16)","v":180.27777777777777}]
[null,null,null,null,null,"Kai Roßberg",36,6459,179.41666666666666]
[null,null,null,null,null,"Michael Wetzel",28,4950,176.78571428571428]
[null,null,null,null,null,"Jörg Frahm",31,5300,170.96774193548387]
[null,null,null,null,null,"Frank Nijholt",15,2051,136.73333333333332]
[null,null,null,null,null,"Deniz Hagelstein",21,2818,134.1904761904762]
[null,null,null,null,null,"Matthias Nolte",15,2000,133.33333333333334]
[null,null,null,null,null,null,{"$f":"SUM(H16:H22)","v":26823},{"$f":"SUM(G16:G22)","v":164},{"$f":"+G23/H23","v":163.55487804878049}]
[]
[null,null,null,null,null,"Gesamt:",{"$f":"+G23+G11","v":43020},{"$f":"+H23+H11","v":276},{"$f":"+G25/H25","v":155.86956521739131}]

{"sheet":"BSG-Schnittliste Saison 23-24","index":25,"n_rows":16,"n_cols":10,"rows_kept":16,"cut":false,"hidden":true,"merged":[[5,5,5,6],[5,7,5,8]]}
[null,"Start"]
[null,"Rangliste",null,"BSG-Schnittliste Saison 2023-2024"]
[]
[null,null,"Rangliste","Pass-Nr.","Name","BSG","m/w","Anz. Spiele","Pins","Schnitt"]
[]
[null,null,"","PAN","Panasonic","BSG-Nr.",null,53807,null,""]
[null,null,54,null,"Frahm, Jörg","PAN","m",55,9481,172.38181818181818]
[null,null,"",null,"Hagelstein, Deniz","PAN","m",21,2931,139.57142857142858]
[null,null,"",null,"Jurk, Mario","PAN","m",12,2225,185.41666666666666]
[null,null,"",null,"Nijholt, Frank","PAN","m",15,2045,136.33333333333334]
[null,null,"",null,"Nolte, Matthias","PAN","m",6,808,134.66666666666666]
[null,null,"",null,"Roßberg, Kai","PAN","m",12,2326,193.83333333333334]
[null,null,35,null,"Schmidt, Annegret","PAN","w",62,8712,140.51612903225808]
[null,null,"",null,"Wetzel, Ilona","PAN","w",42,6011,143.11904761904762]
[null,null,50,null,"Wetzel, Michael","PAN","m",64,11154,174.28125]
[null,null,"",null,null,null,null,289,45693,158.10726643598616]

{"sheet":"Spielbogen 10er","index":26,"n_rows":50,"n_cols":13,"rows_kept":50,"cut":false,"hidden":false,"merged":[[0,0,0,1],[1,0,1,1],[9,3,9,5],[0,2,0,12],[1,2,1,6],[1,8,1,12],[3,2,3,6],[8,3,8,5],[16,3,16,5],[17,3,17,5],[10,3,10,5],[11,3,11,5],[12,3,12,5],[13,3,13,5],[14,3,14,5],[15,3,15,5]]}
["Start",null," Betriebssportverband Hamburg e.V."]
["Rangliste",null,"-  Sparte Bowling  -",null,null,null,null,null,"-  Spielsystembogen  -"]
[]
[null,null,"Klasse   B2    ",null,null,null,null,null,"Antritt","Bahn","Datum","    Ausrichter"]
[null,null,null,67,null,null,null,null,"1.","OT","2025-09-09",1,{"$f":"G9","v":"EAG 1"}]
[null,null,null,null,null,null,null,null,"2.","WB","2025-09-23",2,"ESV 2"]
[null,null,null,null,null,null," ",null,"3.","OT","2025-10-07",3,"AXA 1"]
[null,null,null,"BSG",null,null,"Kurzf.",null,"4.","WB","2025-10-21",4,"ERG 3"]
[null,null,1,"Eppendorf AG 1",null,null,"EAG 1",null,"5.","OT","2025-11-04",5,"DAT 2"]
[null,null,2,"Energie Sportvereinigung 2",null,null,"ESV 2",null,"6.","WB","2025-11-18",6,"PAN 1"]
[null,null,3,"AXA 1",null,null,"AXA 1",null,"7.","OT","2026-01-13",7,"GEN 3"]
[null,null,4,"ERGO Sports 3",null,null,"ERG 3",null,"8.","WB","2026-01-27",8,"FAH 3"]
[null,null,5,"Dataport 2",null,null,"DAT 2",null,"9.","OT","2026-02-10",9,"HAS 5"]
[null,null,6,"Panasonic 1",null,null,"PAN 1",null,"10.","WB","2026-02-24",10,"BWV 5"]
[null,null,7,"Generali 3",null,null,"GEN 3",null,"11.","OT","2026-03-10",1,{"$f":"G9","v":"EAG 1"}]
[null,null,8,"Finanzamt 3",null,null,"FAH 3",null,"12.","WB","2026-03-24",2,{"$f":"G10","v":"ESV 2"}]
[null,null,9,"HASPA 5",null,null,"HAS 5",null,"13.","OT","2026-04-07",3,{"$f":"G11","v":"AXA 1"}]
[null,null,10,"BWVL 5",null,null,"BWV 5",null,"14.","WB","2026-04-21",4,{"$f":"G12","v":"ERG 3"}]
[null,null,null,null,null,null,null,null," "]
[null,null,"Antritt"]
[null,null,"Halle"]
[null,null,"1 . A.",1,6,8,3,7,10,9,4,5,2]
[null,null,"OT",{"$f":"VLOOKUP(D22,$C$7:$G$18,5,0)","v":"EAG 1"},"PAN 1","FAH 3","AXA 1","GEN 3","BWV 5","HAS 5","ERG 3","DAT 2","ESV 2"]
[null,null,"2 . A.",5,8,10,1,9,2,4,7,3,6]
[null,null,"WB",{"$f":"VLOOKUP(D24,$C$7:$G$18,5,0)","v":"DAT 2"},"FAH 3","BWV 5","EAG 1","HAS 5","ESV 2","ERG 3","GEN 3","AXA 1","PAN 1"]
[null,null,"3 . A.",3,1,7,5,10,8,6,9,2,4]
[null,null,"OT",{"$f":"VLOOKUP(D26,$C$7:$G$18,5,0)","v":"AXA 1"},"EAG 1","GEN 3","DAT 2","BWV 5","FAH 3","PAN 1","HAS 5","ESV 2","ERG 3"]
[null,null,"4 . A.",2,7,5,9,8,1,4,6,10,3]
[null,null,"WB",{"$f":"VLOOKUP(D28,$C$7:$G$18,5,0)","v":"ESV 2"},"GEN 3","DAT 2","HAS 5","FAH 3","EAG 1","ERG 3","PAN 1","BWV 5","AXA 1"]
[null,null,"5 . A.",8,4,10,2,1,9,5,3,6,7]
[null,null,"OT",{"$f":"VLOOKUP(D30,$C$7:$G$18,5,0)","v":"FAH 3"},"ERG 3","BWV 5","ESV 2","EAG 1","HAS 5","DAT 2","AXA 1","PAN 1","GEN 3"]
[null,null,"6 . A.",6,2,4,10,3,7,1,5,8,9]
[null,null,"WB",{"$f":"VLOOKUP(D32,$C$7:$G$18,5,0)","v":"PAN 1"},"ESV 2","ERG 3","BWV 5","AXA 1","GEN 3","EAG 1","DAT 2","FAH 3","HAS 5"]
[null,null,"7 . A.",7,9,6,8,10,5,3,2,4,1]
[null,null,"OT",{"$f":"VLOOKUP(D34,$C$7:$G$18,5,0)","v":"GEN 3"},"HAS 5","PAN 1","FAH 3","BWV 5","DAT 2","AXA 1","ESV 2","ERG 3","EAG 1"]
[null,null,"8 . A.",4,5,1,7,2,8,10,6,9,3]
[null,null,"WB",{"$f":"VLOOKUP(D36,$C$7:$G$18,5,0)","v":"ERG 3"},"DAT 2","EAG 1","GEN 3","ESV 2","FAH 3","BWV 5","PAN 1","HAS 5","AXA 1"]
[null,null,"9 . A.",9,10,3,4,5,6,2,1,7,8]
[null,null,"OT",{"$f":"VLOOKUP(D38,$C$7:$G$18,5,0)","v":"HAS 5"},"BWV 5","AXA 1","ERG 3","DAT 2","PAN 1","ESV 2","EAG 1","GEN 3","FAH 3"]
[null,null,"10 . A.",3,7,2,6,9,4,8,10,1,5]
[null,null,"WB",{"$f":"VLOOKUP(D40,$C$7:$G$18,5,0)","v":"AXA 1"},"GEN 3","ESV 2","PAN 1","HAS 5","ERG 3","FAH 3","BWV 5","EAG 1","DAT 2"]
[null,null,"11 . A.",4,8,9,5,6,3,7,1,2,10]
[null,null,"OT",{"$f":"VLOOKUP(D42,$C$7:$G$18,5,0)","v":"ERG 3"},"FAH 3","HAS 5","DAT 2","PAN 1","AXA 1","GEN 3","EAG 1","ESV 2","BWV 5"]
[null,null,"12 . A.",10,3,1,2,4,6,5,8,9,7]
[null,null,"WB",{"$f":"VLOOKUP(D44,$C$7:$G$18,5,0)","v":"BWV 5"},"AXA 1","EAG 1","ESV 2","ERG 3","PAN 1","DAT 2","FAH 3","HAS 5","GEN 3"]
[null,null,"13 . A.",2,5,4,7,3,1,10,9,8,6]
[null,null,"OT",{"$f":"VLOOKUP(D46,$C$7:$G$18,5,0)","v":"ESV 2"},"DAT 2","ERG 3","GEN 3","AXA 1","EAG 1","BWV 5","HAS 5","FAH 3","PAN 1"]
[null,null,"14 . A.","7.","8.","3.","4.","1.","2.","5.","6.","9.","10."]
[null,null,"WB"]
[null,null,"Stand Mai 2015"]

{"sheet":"Ergebnisse nach BVH","index":27,"n_rows":4,"n_cols":85,"rows_kept":4,"cut":false,"hidden":false,"merged":[[3,0,3,8],[3,14,3,21],[3,28,3,36],[3,84,3,92],[0,14,0,21],[0,28,0,36],[0,42,0,50],[0,56,0,64],[0,84,0,92],[0,70,0,78],[3,42,3,50],[3,56,3,64],[3,70,3,78]]}
["Start"]
["Rangliste"]
[]
["Ergebnisse der Punktspielsaison  2025 / 2026",null,null,null,null,null,null,null,null,null,null,null,null,null,"Ergebnisse der Punktspielsaison  2024 / 2025",null,null,null,null,null,null,null,null,null,null,null,null,null,"Ergebnisse der Punktspielsaison  2024 / 2025",null,null,null,null,null,null,null,null,null,null,null,null,null,"Ergebnisse der Punktspielsaison  2024 / 2025",null,null,null,null,null,null,null,null,null,null,null,null,null,"Ergebnisse der Punktspielsaison  2024 / 2025",null,null,null,null,null,null,null,null,null,null,null,null,null,"Ergebnisse der Punktspielsaison  2024 / 2025",null,null,null,null,null,null,null,null,null,null,null,null,null,"Ergebnisse der Punktspielsaison  2024 / 2025"]

{"sheet":"Abschlusstabelle  24-25","index":28,"n_rows":141,"n_cols":11,"rows_kept":141,"cut":false,"hidden":false,"merged":[[0,3,0,10]]}
[null,"Start",null,"Betriebssportverband Hamburg    -    Sparte Bowling"]
[null,"Rangliste"]
[null,null,null,"ABSCHLUSSTABELLEN     PUNKTSPIELSAISON    2024 / 25"]
[]
[null,null,null,"HAMBURGER VERBANDSMEISTER  2025",null,null,null,null,"B W V L  1"]
[]
[null,null,null,null,"SONDERKLASSE"]
[null,null,null,null,null,"Punkte","Spiele","Pins","Schnitt Mann.","Schnitt Einzel"]
[null,null,null,1,"B W V L  1",153,168,32488,2320.5714285714284,193.38095238095238,"Meister"]
[null,null,null,2,"Hamburger Sparkasse 1",128.5,168,30972,2212.2857142857142,184.35714285714286]
[null,null,null,3,"Edeka 1",125.5,168,31209,2229.2142857142858,185.76785714285714]
[null,null,null,4,"StahlhandelNord 1 1",100,167,30002,2155.8323353293413,179.65269461077844]
[null,null,null,5,"Condor-Versicherung 1",96,168,30248,2160.5714285714284,180.04761904761904]
[null,null,null,6,"Otto 1",91,166,29594,2139.3253012048194,178.27710843373495]
[null,null,null,7,"Hamburger Hochbahn 1",85,168,29591,2113.6428571428569,176.13690476190476]
[null,null,null,8,"H H L A 1",82,168,29546,2110.4285714285716,175.86904761904762]
[null,null,null,9,"Körber Sports 1",69,168,28855,2061.0714285714284,171.75595238095238]
[null,null,null,10,"Deutsche Bank 1",63.5,168,28780,2055.7142857142853,171.3095238095238,"Absteiger"]
[null,null,null,11,"Postamt 2  1",55.5,168,28504,2036,169.66666666666666,"Absteiger"]
[null,null,null,12,"Dakosy 1",43,168,27532,1966.5714285714284,163.88095238095238,"Absteiger"]
[]
[null,null,null,null,"KLASSE  A 1","MEISTER",null,"SV Signal Iduna 1"]
[null,null,null,null,null,"Punkte","Spiele","Pins","Schnitt Mann.","Schnitt Einzel"]
[null,null,null,1,"SV Signal Iduna 1",111.5,168,29188,2084.8571428571431,173.73809523809524,"Aufsteiger"]
[null,null,null,2,"B W V L  3",99,168,28572,2040.8571428571431,170.07142857142858]
[null,null,null,3,"Commerzbank 1",98,168,28491,2035.0714285714287,169.58928571428572]
[null,null,null,4,"Energie Sportvereinigung 1",96,168,28543,2038.7857142857142,169.89880952380952]
[null,null,null,5,"Hamburger Sparkasse 2",77.5,168,27859,1989.9285714285716,165.82738095238096]
[null,null,null,6,"Hamburger Hochbahn 2",76,165,27418,1994.0363636363636,166.16969696969696]
[null,null,null,7,"Die Aktiven 1",74,168,27536,1966.8571428571427,163.9047619047619]
[null,null,null,8,"Justizbehörde 1",60,162,26226,1942.6666666666665,161.88888888888889]
[null,null,null,9,"Still 1",42,165,25819,1877.7454545454543,156.47878787878787,"Absteiger"]
[null,null,null,10,"Hamburger Sparkasse 3",36,168,25329,1809.2142857142858,150.76785714285714,"Absteiger"]
[]
[null,null,null,null,"KLASSE  A 2","MEISTER",null,"LG Finanzämter Hamburg 1"]
[null,null,null,null,null,"Punkte","Spiele","Pins","Schnitt Mann.","Schnitt Einzel"]
[null,null,null,1,"LG Finanzämter Hamburg 1",101,168,28579,2041.3571428571429,170.11309523809524,"Aufsteiger"]
[null,null,null,2,"B W V L  2",98,168,28562,2040.1428571428571,170.01190476190476]
[null,null,null,3,"Stadtreinigung 1",84.5,165,27752,2018.3272727272727,168.19393939393939]
[null,null,null,4,"Hamburger Hochbahn 3",80.5,168,27752,1982.2857142857144,165.1904761904762]
[null,null,null,5,"Aurubis 1",69,168,27031,1930.7857142857142,160.89880952380952]
[null,null,null,6,"Sportclub Dt. Bundesbank  1",67,167,27308,1962.2514970059881,163.52095808383234]
[null,null,null,7,"Lufthansa 1",52,168,26536,1895.4285714285716,157.95238095238096]
[null,null,null,8,"BWVL Hamburg Port Authority 1",52,165,26260,1909.818181818182,159.15151515151516]
[null,null,null,9,"Deutsche Bank 2",26,168,24970,1783.5714285714284,148.63095238095238,"Absteiger"]
[]
[null,null,null,null,"KLASSE  A 3","MEISTER",null,"Elbe-Sport eV 1"]
[null,null,null,null,null,"Punkte","Spiele","Pins","Schnitt Mann.","Schnitt Einzel"]
[null,null,null,1,"Elbe-Sport eV 1",94,168,28182,2013,167.75,"Aufsteiger"]
[null,null,null,2,"B W V L  4",92.5,168,27919,1994.2142857142856,166.1845238095238]
[null,null,null,3,"Edeka 2",83,153,25745,2019.2156862745098,168.26797385620915]
[null,null,null,4,"LG Finanzämter Hamburg 2",72,168,27435,1959.6428571428569,163.30357142857142]
[null,null,null,5,"Dataport Hamburg  1",65.5,168,26893,1920.9285714285716,160.07738095238096]
[null,null,null,6,"Jornitz u. Luth 1",62,167,26737,1921.2215568862275,160.10179640718562]
[null,null,null,7,"Generali Versicherungen 1",59,168,26795,1913.9285714285716,159.49404761904762]
[null,null,null,8,"SV Signal Iduna 2",53,168,26462,1890.1428571428571,157.51190476190476]
[null,null,null,9,"Commerzbank 2",48,168,26512,1893.7142857142856,157.8095238095238,"Absteiger"]
[null,null,null," ","","","","","",""]
[null,null,null,null,"KLASSE  B 1","MEISTER",null,"Jungheinrich 1"]
[null,null,null,null,null,"Punkte","Spiele","Pins","Schnitt Mann.","Schnitt Einzel"]
[null,null,null,1,"Jungheinrich 1",113.5,168,28585,2041.7857142857142,170.14880952380952,"Aufsteiger"]
[null,null,null,2,"Feuerwehr Hamburg 1",107,168,27722,1980.1428571428571,165.01190476190476,"Aufsteiger"]
[null,null,null,3,"Elbe-Sport eV 2",99,168,26881,1920.0714285714284,160.00595238095238]
[null,null,null,4,"Hamburger Hochbahn 4",78,168,26154,1868.1428571428569,155.67857142857142]
[null,null,null,5,"Jungheinrich 2",58.5,168,24733,1766.6428571428573,147.2202380952381]
[null,null,null,6,"ERGO Sports Hamburg 2",48,168,24298,1735.5714285714284,144.63095238095238]
[null,null,null,7,"H H L A 2",48,162,23997,1777.5555555555554,148.12962962962962]
[null,null,null,8,"Smart Blue Club Nord 1",44,156,22433,1725.6153846153845,143.80128205128204]
[null,null,null,9,"Hamburger Sparkasse 5",33,168,23688,1692,141,"Absteiger"]
[null,null,null," ","","","","","",""]
[null,null,null,null,"KLASSE  B 2","MEISTER",null,"Generali Versicherungen 2"]
[null,null,null,null,null,"Punkte","Spiele","Pins","Schnitt Mann.","Schnitt Einzel"]
[null,null,null,1,"Generali Versicherungen 2",89.5,168,27036,1931.1428571428569,160.92857142857142,"Aufsteiger"]
[null,null,null,2,"Deutsche Bank 3",86,168,26860,1918.5714285714284,159.88095238095238]
[null,null,null,3,"ERGO Sports Hamburg 1",65.5,168,25535,1823.9285714285716,151.99404761904762]
[null,null,null,4,"AXA Sportvereinigung 1",60.5,162,25410,1882.2222222222222,156.85185185185185]
[null,null,null,5,"Eppendorf AG 1",53,168,25037,1788.3571428571427,149.0297619047619]
[null,null,null,6,"Edeka 3",52,153,23408,1835.9215686274511,152.99346405228758]
[null,null,null,7,"Otto 2",50.5,168,24634,1759.5714285714284,146.63095238095238]
[null,null,null,8,"Berufsgen f. Gesundheitsd. 1",46,168,24643,1760.2142857142856,146.6845238095238,"Absteiger"]
[null,null,null," ","","","","","",""]
[null,null,null,null,"KLASSE  B 3","MEISTER",null,"Die Socke 1"]
[null,null,null,null,null,"Punkte","Spiele","Pins","Schnitt Mann.","Schnitt Einzel"]
[null,null,null,1,"Die Socke 1",107,168,26052,1860.8571428571431,155.07142857142858,"Aufsteiger"]
[null,null,null,2,"Polizei Hamburg v. 1972 1",89.5,168,25310,1807.8571428571427,150.6547619047619,"Aufsteiger"]
[null,null,null,3,"Hamburger Sparkasse 4",88,168,25287,1806.2142857142858,150.51785714285714]
[null,null,null,4,"Elbe-Sport eV 3",87,168,25016,1786.8571428571427,148.9047619047619]
[null,null,null,5,"Aurubis 2",86,168,24778,1769.8571428571429,147.48809523809524]
[null,null,null,6,"Still 2",85,167,25391,1824.5029940119762,152.04191616766468]
[null,null,null,7,"D A K  1",84.5,168,25032,1788,149]
[null,null,null,8,"Generali Versicherungen 3",68.5,168,24188,1727.7142857142858,143.97619047619048]
[null,null,null,9,"Commerzbank 3",48.5,168,23411,1672.2142857142858,139.35119047619048]
[null,"Start",null,10,"Otto 3",24,135,18357,1631.7333333333336,135.97777777777779,"Absteiger"]
[null,"Rangliste",null," ","","","","","",""]
[null,null,null,null,"KLASSE  B 4","MEISTER",null,"Körber Sports 2"]
[null,null,null,null,null,"Punkte","Spiele","Pins","Schnitt Mann.","Schnitt Einzel"]
[null,null,null,1,"Körber Sports 2",72,159,25432,1919.3962264150944,159.9496855345912,"Aufsteiger"]
[null,null,null,2,"Panasonic 1",68,168,26254,1875.2857142857142,156.27380952380952]
[null,null,null,3,"Dataport Hamburg  2",58,168,25261,1804.3571428571429,150.36309523809524]
[null,null,null,4,"SG Stern Daimler Chrysler AG 1",50,165,24599,1789.0181818181818,149.08484848484849]
[null,null,null,5,"Still 3",49,168,24708,1764.8571428571431,147.07142857142858]
[null,null,null,6,"Justizbehörde 2",49,168,24259,1732.7857142857142,144.39880952380952]
[null,null,null,7,"Postamt 2  2",46,168,24763,1768.7857142857142,147.39880952380952,"Absteiger"]
[null,null,null," ","","","","","",""]
[null,null,null,null,"KLASSE  C 1","MEISTER",null,"B W V L  5"]
[null,null,null,null,null,"Punkte","Spiele","Pins","Schnitt Mann.","Schnitt Einzel"]
[null,null,null,1,"B W V L  5",69,165,24640,1792,149.33333333333334,"Aufsteiger"]
[null,null,null,2,"SV Weiß Blau Allianz 1",59,168,24254,1732.4285714285716,144.36904761904762]
[null,null,null,3,"Feuerwehr Hamburg 2",56,168,23951,1710.7857142857144,142.5654761904762]
[null,null,null,4,"LG Finanzämter Hamburg 3",53,165,23614,1717.3818181818183,143.11515151515152]
[null,null,null,5,"ERGO Sports Hamburg 3",35,150,20909,1672.7200000000003,139.39333333333335]
[null,null,null,6,"Energie Sportvereinigung 3",21,168,21191,1513.6428571428571,126.13690476190476]
[null,null,null," ","","","","","",""]
[null,null,null,null,"KLASSE  C 2","MEISTER",null,"Hamburger Sparkasse 6"]
[null,null,null,null,null,"Punkte","Spiele","Pins","Schnitt Mann.","Schnitt Einzel"]
[null,null,null,1,"Hamburger Sparkasse 6",65,168,23729,1694.9285714285716,141.24404761904762,"Aufsteiger"]
[null,null,null,2,"Energie Sportvereinigung  2",61,168,23473,1676.6428571428573,139.7202380952381]
[null,null,null,3,"Hanse Merkur 1",59,168,23924,1708.8571428571427,142.4047619047619]
[null,null,null,4,"Polizei Hamburg v. 1972 2",46,150,21125,1690,140.83333333333334]
[null,null,null,5,"Elbe-Sport eV 4",42,168,21992,1570.8571428571427,130.9047619047619]
[null,null,null,6,"Zentrum für Personaldienste 1",18,108,13270,1474.4444444444443,122.87037037037037]
[null,null,null," ","","","","","",""]
[null,null,null,null,"KLASSE  C 3","MEISTER",null,"Baloise 1"]
[null,null,null,null,null,"Punkte","Spiele","Pins","Schnitt Mann.","Schnitt Einzel"]
[null,null,null,1,"Baloise 1",66,165,22884,1664.2909090909091,138.69090909090909,"Aufsteiger"]
[null,null,null,2,"Lufthansa 2",61,166,22523,1628.1686746987953,135.68072289156626]
[null,null,null,3,"Jungheinrich 3",50,165,21556,1567.7090909090912,130.64242424242425]
[null,null,null,4,"Agentur für Arbeit Hamburg 1",47,141,19002,1617.191489361702,134.7659574468085]
[null,null,null,5,"Hamburger Hochbahn 5",40,168,20663,1475.9285714285716,122.99404761904762]
[null,null,null,6,"SV Weiß Blau Allianz 3",28,162,19045,1410.7407407407409,117.56172839506173]
[null,null,null," ","","","","","",""]
[null,null,null,null,"KLASSE  C 4","MEISTER",null,"Elbe-Sport eV 5"]
[null,null,null,null,null,"Punkte","Spiele","Pins","Schnitt Mann.","Schnitt Einzel"]
[null,null,null,1,"Elbe-Sport eV 5",79,168,24090,1720.7142857142858,143.39285714285714,"Aufsteiger"]
[null,null,null,2,"Hamburger Sparkasse 7",78,168,24247,1731.9285714285716,144.32738095238096]
[null,null,null,3,"BMH-Claudius Peters AG 1",71,168,23978,1712.7142857142858,142.72619047619048]
[null,null,null,4,"SV Weiß Blau Allianz 2",64,168,23290,1663.5714285714284,138.63095238095238]
[null,null,null,5,"Amandus Kahl 1",43,168,22226,1587.5714285714284,132.29761904761904]
[null,null,null,6,"SV Signal Iduna 3",34,156,20474,1574.9230769230771,131.24358974358975]
[null,null,null,7,"Baloise 2",22,162,20298,1503.5555555555554,125.29629629629629]
[null,null,null," ","","","","","",""]

{"sheet":"BSG-Schnittliste 24-25","index":29,"n_rows":715,"n_cols":7,"rows_kept":715,"cut":false,"hidden":false,"merged":[]}
["Start"]
["Rangliste",null,"BSG-Schnittliste Saison 2024/2025"]
[]
[null,null,"Rang","Name","Anz. Spiele","Pins","Schnitt"]
[]
[null,null,"AAH","Agentur für Arbeit Hamburg"]
[null,null,"","Drewes, Friedhelm",27,4439,164.40740740740742]
[null,null,"","Gstall, Hansmichael",9,860,95.555555555555557]
[null,null,"","Jäcks, Joachim",9,828,92]
[null,null,"","Marx, Reinhold",6,679,113.16666666666667]
[null,null,"","Reich, Andreas",18,2232,124]
[null,null,{"$error":"#N/A"},"Reich, Gertrud",12,1536,128]
[null,null,{"$error":"#N/A"},"Schrage, Regine",3,346,115.33333333333333]
[null,null,"","Wacker, Uwe-Jens",33,4990,151.21212121212122]
[null,null,{"$error":"#N/A"},"Werner, Alexandra",24,3092,128.83333333333334]
[null,null,null,null,141,19002,134.7659574468085]
[null,null,"ALL","SV Weiß Blau Allianz"]
[null,null,104,"Baxmann, Jörg",84,11783,140.27380952380952]
[null,null,106,"Bott, Christian",57,7303,128.12280701754386]
[null,null,"","Fritsche, Christian",21,2961,141]
[null,null,89,"Griebel, Wilfried",81,12381,152.85185185185185]
[null,null,95,"Heitmann, Werner",60,8987,149.78333333333333]
[null,null,"","Hennes, Klaus",9,1048,116.44444444444444]
[null,null,"","Kluge, Steffen",39,4973,127.51282051282051]
[null,null,"","Lautenbach, David",36,4881,135.58333333333334]
[null,null,101,"Meinert, Norbert",95,13743,144.66315789473686]
[null,null,17,"Möller, Sabine",89,13340,149.88764044943821]
[null,null,"","Pauli, Ludwig",39,4023,103.15384615384616]
[null,null,{"$error":"#N/A"},"Peter, Nicole",18,1874,104.11111111111111]
[null,null,"","Schlichting, André",39,5759,147.66666666666666]
[null,null,"","Ulrich, Felix",42,4930,117.38095238095238]
[null,null,"","Ulrich, Jens",39,4985,127.82051282051282]
[null,null,null,null,748,102971,37.659999999999997]
[null,null,"AU","Aurubis",null,null,""]
[null,null,"","Behncke, Hakon",39,6276,160.92307692307693]
[null,null,94,"Eggeling, Rainer",80,12046,150.57499999999999]
[null,null,78,"Jansen, Dieter",94,14817,157.62765957446808]
[null,null,{"$error":"#N/A"},"Leirs, Kathleen",22,4131,187.77272727272728]
[null,null,"","Oberg, Axel",15,2026,135.06666666666666]
[null,null,8,"Oberg, Anita",70,11370,162.42857142857142]
[null,null,"","Rathje, Kristian",3,472,157.33333333333334]
[null,null,{"$error":"#N/A"},"Seth, Sabine",47,6992,148.7659574468085]
[null,null,103,"Thierbach, Heinz",73,10276,140.76712328767124]
[null,null,"","Urig, Franz",3,396,132]
[null,null,71,"Weiland, Marco",50,8060,161.19999999999999]
[null,null,46,"Wülfken, Lars",84,14268,169.85714285714286]
[null,null,null,null,580,91130,157.12068965517241]
[null,null,"AXA","AXA Sportvereinigung",null,null,""]
[null,null,"","Jansen, Sönke",33,5150,156.06060606060606]
[null,null,"","Lohrbach, Gustav-Michael",39,6819,174.84615384615384]
[null,null,"","Markow, Wolfgang",42,6450,153.57142857142858]
[null,null,{"$error":"#N/A"},"Noack, Inge",9,1005,111.66666666666667]
[null,null,"","Schwartz, Oliver",36,5580,155]
[null,null,null,null,159,25004,157.25786163522014]
[null,null,"B36","Berufgen. für Gesundheitsdienst",null,null,""]
[null,null,"","Behring, Jürgen",3,442,147.33333333333334]
[null,null,"","Dietzel, Andreas",12,1620,135]
[null,null,"","Hergel, Günter",27,3938,145.85185185185185]
[null,null,"","Karsten, Jörn",21,3035,144.52380952380952]
[null,null,"","Nosinski, Darius",30,4304,143.46666666666667]
[null,null,"","Partey, Klaus",6,856,142.66666666666666]
[null,null,"","Strobach, Sven",9,926,102.88888888888889]
[null,null,"","Tietgen, Andreas",39,6936,177.84615384615384]
[null,null,{"$error":"#N/A"},"Tietgen, Ulrike",21,2586,123.14285714285714]
[null,null,null,null,168,24643,146.6845238095238]
[null,null,"BAL","Baloise",null,null,""]
[null,null,"","Bögner, Thomas",27,3902,144.5185185185185]
[null,null,"","Bokow, Werner",18,2466,137]
[null,null,{"$error":"#N/A"},"Cornils, Meike",33,4615,139.84848484848484]
[null,null,"","Cornils, Stephan",21,2870,136.66666666666666]
[null,null,{"$error":"#N/A"},"Düwel, Antje",33,4915,148.93939393939394]
[null,null,"","Kavka, Jürgen",21,2202,104.85714285714286]
[null,null,{"$error":"#N/A"},"Kayser, Barbara",24,3019,125.79166666666667]
[null,null,{"$error":"#N/A"},"Klockner, Christa",42,5697,135.64285714285714]
[null,null,"","Möller-Langer, Fred",15,2114,140.93333333333334]
[null,null,{"$error":"#N/A"},"Rickert, Anja",15,1732,115.46666666666667]
[null,null,{"$error":"#N/A"},"Schmidt, Frauke",24,2158,89.916666666666671]
[null,null,"","Schmidt, Ulrich",33,4582,138.84848484848484]
[null,null,"","Trutnau, Rüdiger",21,2910,138.57142857142858]
[null,null,null,null,327,43182,132.05504587155963]
[null,null,"BBK","Sportclub Dt. Bundesbank",null,null,""]
[null,null,"","Deppe, Norman",6,935,155.83333333333334]
[null,null,"","Deppe, Rainer",45,7824,173.86666666666667]
[null,null,"","Friedrich, Jürgen",9,1347,149.66666666666666]
[null,null,"","Kühlcke, Hans-Dieter",3,383,127.66666666666667]
[null,null,"","Lehmann, Rolf-Dieter",42,6844,162.95238095238096]
[null,null,"","Mahnkopf, Torben",29,5124,176.68965517241378]
[null,null,{"$error":"#N/A"},"Nest, Ingrid",3,284,94.666666666666671]
[null,null,"","Völzow, Holger",42,6702,159.57142857142858]
[null,null,null,null,179,29443,164.48603351955308]
[null,null,"BWV","B W V L",null,null,""]
[null,null,{"$error":"#N/A"},"Fütterer, Karin",33,4288,129.93939393939394]
[null,null,5,"Gäthke, Bernd",51,9995,195.98039215686273]
[null,null,21,"Grohmann, André",67,12035,179.62686567164178]
[null,null,{"$error":"#N/A"},"Grohmann, Marlies",40,6180,154.5]
[null,null,{"$error":"#N/A"},"Grosse, Ellen",39,5190,133.07692307692307]
[null,null,"","Groth, Alexander",33,7199,218.15151515151516]
[null,null,5,"Hamann, Astrid",61,10354,169.73770491803279]
[null,null,19,"Hamann, Uwe",80,14518,181.47499999999999]
[null,null,"","Heymuth, Rainer",48,6558,136.625]
[null,null,45,"Klockmann, Andreas",75,12833,171.10666666666665]
[null,null,66,"Korst, Joachim",51,8323,163.19607843137254]
[null,null,39,"Milde, Stephan",83,14390,173.37349397590361]
[null,null,62,"Noack, Hans-Ulrich",66,10815,163.86363636363637]
[null,null,{"$error":"#N/A"},"Reinhold, Renate",16,2079,129.9375]
[null,null,64,"Rose, Jürgen",79,12906,163.36708860759492]
[null,null,44,"Skalden, Winfried",76,13025,171.38157894736841]
[null,null,{"$error":"#N/A"},"Soppa, Birgit",33,5701,172.75757575757575]
[null,null,"","Soppa, Hansi",33,5668,171.75757575757575]
[null,null,33,"Stoll, Frank",90,15780,175.33333333333334]
[null,null,32,"Tavakoli, Darius",84,14737,175.4404761904762]
[null,null,"","Wendlandt, Steffen",33,6303,191]
[null,null,{"$error":"#N/A"},"Wittschen, Kathrin",39,5923,151.87179487179486]
[null,null,14,"Wittschen, Thomas",59,10999,186.42372881355934]
[null,null,null,null,1269,215799,170.05437352245863]
[null,null,"CLP","BMH-Claudius Peters AG",null,null,""]
[null,null,38,"Hartwigsen, Jens",76,13189,173.53947368421052]
[null,null,"","Kreutzberger, Dieter",33,4930,149.39393939393941]
[null,null,"","Lang, Hans-Georg",21,2838,135.14285714285714]
[null,null,"","Neisewald, Axel",42,6112,145.52380952380952]
[null,null,21,"Neisewald, Gudrun",50,7430,148.6]
[null,null,{"$error":"#N/A"},"Schildt, Brigitte",15,1982,132.13333333333333]
[null,null,"","Rohr, Wolfgang",21,2889,137.57142857142858]
[null,null,null,null,258,39370,152.59689922480621]
[null,null,"COM","Commerzbank",null,null,""]
[null,null,"","Andresen, Holger",39,5848,149.94871794871796]
[null,null,87,"Arndt, Christoph",66,10211,154.71212121212122]
[null,null,"","Bach, Uwe",30,3847,128.23333333333332]
[null,null,11,"Endreß, Maren",103,16270,157.96116504854368]
[null,null,17,"Endreß, Oliver",70,12784,182.62857142857143]
[null,null,81,"Endreß, Rudi",98,15389,157.03061224489795]
[null,null,{"$error":"#N/A"},"Fechner, Inge",3,383,127.66666666666667]
[null,null,"","Florack, Georg",48,6246,130.125]
[null,null,42,"Husemann, Steffen",81,13945,172.16049382716051]
[null,null,15,"Kalenski, Petra",76,11565,152.17105263157896]
[null,null,23,"Krüger, Stefan",82,14653,178.69512195121951]
[null,null,"","Obodda, Jochen",30,4000,133.33333333333334]
[null,null,60,"Preylowski, Gerhard",84,13788,164.14285714285714]
[null,null,{"$error":"#N/A"},"Preylowski, Marina",45,6293,139.84444444444443]
[null,null,"","Schroeder, Gösta",6,812,135.33333333333334]
[null,null,{"$error":"#N/A"},"Teegler, Birgit",35,5408,154.51428571428571]
[null,null,null,null,896,141442,157.859375]
[null,null,"CON","Condor-Versicherung",null,null,""]
[null,null,{"$error":"#N/A"},"Niemann, Bettina",42,6176,147.04761904761904]
[null,null,2,"Niemann, Niklas",90,18286,203.17777777777778]
[null,null,1,"Niemann, Fynn",90,18549,206.1]
[null,null,"","Trümper, Andreas",42,7017,167.07142857142858]
[null,null,null,null,264,50028,189.5]
[null,null,"DA","Die Aktiven",null,null,""]
[null,null,{"$error":"#N/A"},"Jakubeit, Hildegard",3,392,130.66666666666666]
[null,null,83,"Jakubeit, Joachim",56,8766,156.53571428571428]
[null,null,{"$error":"#N/A"},"Möller, Gisela",12,1846,153.83333333333334]
[null,null,10,"Möller, Werner",59,11190,189.66101694915255]
[null,null,{"$error":"#N/A"},"Rübenthaler, Ingrid",27,4038,149.55555555555554]
[null,null,"","Rübenthaler, Stefan",9,1323,147]
[null,null,59,"Wolf, Edgar",58,9538,164.44827586206895]
[null,null,null,null,224,37093,165.59375]
[null,null,"DAK","D A K",null,null,""]
[null,null,"","Bree, Norbert",12,2016,168]
[null,null,"","Krogmann, Peter",33,4672,141.57575757575756]
[null,null,"","Neubert, Dierk",24,3815,158.95833333333334]
[null,null,"","Pekarek, Joseph",12,1832,152.66666666666666]
[null,null,"","Rotzolk, Jürgen",27,3729,138.11111111111111]
[null,null,{"$error":"#N/A"},"Schönberger, Sabine",33,5398,163.57575757575756]
[null,null,"","Schönberger, Wolf-Rüdiger",27,3442,127.48148148148148]
[null,null,null,null,168,24904,148.23809523809524]
[null,null,"DAT","Dataport Hamburg",null,null,""]
[null,null,"","Aeuckens, Michael",36,5521,153.36111111111111]
[null,null,"","Damaschke, Andreas",33,5288,160.24242424242425]
[null,null,"","Decker, Heiko",3,432,144]
[null,null,65,"Dutkiewicz, Peter",78,12736,163.28205128205127]
[null,null,88,"Gebert, Florian",87,13313,153.02298850574712]
[null,null,6,"Gebert, Martina",69,11582,167.85507246376812]
[null,null,82,"König, Dietmar",57,8934,156.73684210526315]
[null,null,48,"Melbert, Horst",104,17648,169.69230769230768]
[null,null,"","Schlender, Rainer",30,4272,142.4]
[null,null,"","Schumacher, Konstantin Frederik",3,374,124.66666666666667]
[null,null,"","Schumacher, Martin",45,6052,134.48888888888888]
[null,null,{"$error":"#N/A"},"Werner, Magdalena",3,363,121]
[null,null,null,null,548,86515,157.87408759124088]
[null,null,"DB","Deutsche Bank",null,null,""]
[null,null,{"$error":"#N/A"},"Bieri, Alicia",11,1829,166.27272727272728]
[null,null,75,"Bieri, Thomas",50,7919,158.38]
[null,null,{"$error":"#N/A"},"Bieri, Ute",41,5451,132.95121951219511]
[null,null,"","Champin, Stephen",24,3735,155.625]
[null,null,{"$error":"#N/A"},"Corleis, Heidi",28,4541,162.17857142857142]
[null,null,{"$error":"#N/A"},"Corleis, Tanja",35,6018,171.94285714285715]
[null,null,"","Corleis, Uwe",6,855,142.5]
[null,null,"","Eggebrecht, Erwin",47,8029,170.82978723404256]
[null,null,"","Eifler, Christian",30,4794,159.80000000000001]
[null,null,{"$error":"#N/A"},"Gauert-Nüschen, Birgit",21,3007,143.1904761904762]
[null,null,"","Hanne, Frank Peter",27,4809,178.11111111111111]
[null,null,"","Herber, Michael",30,4397,146.56666666666666]
[null,null,"","Klemm, Norbert",35,4897,139.91428571428571]
[null,null,80,"Kuffer, Michael",57,8956,157.12280701754386]
[null,null,"","Kühne, Ralph",36,6115,169.86111111111111]
[null,null,"","Nüschen, Manfred",15,2504,166.93333333333334]
[null,null,54,"Rabe, Wilfried",50,8277,165.54]
[null,null,{"$error":"#N/A"},"Reinke, Anett",27,4721,174.85185185185185]
[null,null,"","Stölting, Danny",45,7931,176.24444444444444]
[null,null,91,"Wohlers, Thomas",65,9866,151.78461538461539]
[null,null,null,null,680,108651,159.78088235294118]
[null,null,"DKY","Dakosy",null,null,""]
[null,null,"","Honebrinker, Matthias",3,379,126.33333333333333]
[null,null,"","Koops, Johannes",3,418,139.33333333333334]
[null,null,22,"Mauritz, Marko",54,9674,179.14814814814815]
[null,null,"","Milde, Stefan",6,949,158.16666666666666]
[null,null,90,"Schiller, Thomas",65,9915,152.53846153846155]
[null,null,{"$error":"#N/A"},"Schneider, Irene",7,950,135.71428571428572]
[null,null,"","Täger, Patrik",35,6148,175.65714285714284]
[null,null,{"$error":"#N/A"},"Wildfang, Angela",37,6118,165.35135135135135]
[null,null,{"$error":"#N/A"},"Wildfang, Michaela",40,6953,173.82499999999999]
[null,null,"","Wildfang, Thorsten",33,5386,163.21212121212122]
[null,null,null,null,283,46890,165.68904593639576]
[null,null,"DSO","Die Socke",null,null,""]
[null,null,16,"Ermisch, Dagmar",74,11208,151.45945945945945]
[null,null,18,"Ermisch, Julia",82,12264,149.5609756097561]
[null,null,"","Fieberg, Matthias",27,4798,177.7037037037037]
[null,null,"","Thierauf, Stephan",18,2424,134.66666666666666]
[null,null,85,"Vietz, Otmar",59,9162,155.28813559322035]
[null,null,null,null,260,39856,153.2923076923077]
[null,null,"EAG","Eppendorf AG",null,null,""]
[null,null,{"$error":"#N/A"},"Amundsen, Margit",10,1543,154.30000000000001]
[null,null,"","Did, Essiad",34,4891,143.85294117647058]
[null,null,"","Filter, Wolfgang",15,2067,137.80000000000001]
[null,null,"","Frenzel, Peter",27,4151,153.74074074074073]
[null,null,{"$error":"#N/A"},"Hansen, Ines",22,3127,142.13636363636363]
[null,null,"","Peters, Christian",15,2101,140.06666666666666]
[null,null,"","Schill, Eduard",40,5987,149.67500000000001]
[null,null,{"$error":"#N/A"},"Stoob, Marlies",18,2734,151.88888888888889]
[null,null,"","Zühlke, Bernd",27,4232,156.74074074074073]
[null,null,null,null,208,30833,148.24]
[null,null,"ED","Edeka",null,null,""]
[null,null,34,"Böttger, Jürgen",57,9927,174.15789473684211]
[null,null,13,"Erichsen, Monika",73,11326,155.15068493150685]
[null,null,58,"Erichsen, Thomas",73,12037,164.89041095890411]
[null,null,{"$error":"#N/A"},"Klause, Heidi",10,1570,157]
[null,null,9,"Knop, Stefan",57,10821,189.84210526315789]
[null,null,4,"Liebe, Sebastian",63,12354,196.0952380952381]
[null,null,"","Marwede, Helmut",28,4870,173.92857142857142]
[null,null,{"$error":"#N/A"},"Neumann, Christiane",21,2763,131.57142857142858]
[null,null,"","Neumann, Dirk",30,5476,182.53333333333333]
[null,null,"","Popp, Arne",39,6226,159.64102564102564]
[null,null,{"$error":"#N/A"},"Popp, Brigitte",27,3873,143.44444444444446]
[null,null,"","Popp, Reinhard",42,6642,158.14285714285714]
[null,null,{"$error":"#N/A"},"Ruhnau, Birgit",6,780,130]
[null,null,"","Ruhnau, Holger",19,3566,187.68421052631578]
[null,null,49,"Ruwoldt, Joachim",79,13275,168.03797468354429]
[null,null,11,"Voß, Olaf",64,12082,188.78125]
[null,null,null,null,688,117588,170.91279069767441]
[null,null,"ELB","Elbe-Sport eV",null,null,""]
[null,null,97,"Anten, Werner",53,7873,148.54716981132074]
[null,null,"","Clausen, Christian",24,3471,144.625]
[null,null,"","Eckert, Thomas",48,7567,157.64583333333334]
[null,null,51,"Fahrenkrog, Jürgen",109,18254,167.46788990825689]
[null,null,67,"Frercksen, Martin",89,14521,163.15730337078651]
[null,null,12,"Frercksen, Ute",60,9450,157.5]
[null,null,22,"Klimm, Gerlinde",84,12225,145.53571428571428]
[null,null,47,"Klimm, Michael",88,14945,169.82954545454547]
[null,null,76,"Krüger, Jürgen",61,9652,158.2295081967213]
[null,null,25,"Kuhtal, Manfred",106,18887,178.17924528301887]
[null,null,{"$error":"#N/A"},"Kuderna, Regine",6,579,96.5]
[null,null,"","Linz, Siegried",21,2841,135.28571428571428]
[null,null,"","Neumann, Kay",24,3963,165.125]
[null,null,28,"Nissen, Sylvia",78,10639,136.39743589743588]
[null,null,25,"Regenbogen, Anja",3,399,133]
[null,null,{"$error":"#N/A"},"Renneberg, Gabriele",62,8591,138.56451612903226]
[null,null,86,"Renneberg, Jan",68,10557,155.25]
[null,null,92,"Retzlaff, Adelbert",72,10884,151.16666666666666]
[null,null,"","Seffert, Frank",9,1361,151.22222222222223]
[null,null,"","Sturzebecher, Denny",27,3716,137.62962962962962]
[null,null,{"$error":"#N/A"},"Sturzebecher, Jasmin",15,2244,149.6]
[null,null,93,"Tatzelt, Volker",59,8888,150.64406779661016]
[null,null,{"$error":"#N/A"},"Tumforde, Adina",26,3903,150.11538461538461]
[null,null,"","Valinda, Hans-Werner",18,2240,124.44444444444444]
[null,null,{"$error":"#N/A"},"Valinda, Ute",24,2812,117.16666666666667]
[null,null,9,"Vetten, Ramona",85,13542,159.31764705882352]
[null,null,"","Wiegand, Alfred",42,5826,138.71428571428572]
[null,null,{"$error":"#N/A"},"Wiegand, Cornell",39,4766,122.2051282051282]
[null,null,null,null,1400,214596,153.28285714285715]
[null,null,"ERG","ERGO Sports Hamburg",null,null,""]
[null,null,"","Ahn v., Werner",24,3551,147.95833333333334]
[null,null,"","Banck, Sönke",18,2122,117.88888888888889]
[null,null,"","Bergmann, Klaus",12,1645,137.08333333333334]
[null,null,"","Bürkle, Volker",21,3251,154.8095238095238]
[null,null,"","Deske, Günther",24,3054,127.25]
[null,null,"","Griebenow, Martin",36,5788,160.77777777777777]
[null,null,"","Jonas, Werner",45,7063,156.95555555555555]
[null,null,{"$error":"#N/A"},"Kathe, Silke",30,4027,134.23333333333332]
[null,null,"","Klee, Karl-Heinz",33,4703,142.5151515151515]
[null,null,"","Meyer, Uwe",45,6408,142.4]
[null,null,"","Nierzalewski, Jens",30,4670,155.66666666666666]
[null,null,"","Peters, Axel",39,5468,140.2051282051282]
[null,null,"","Schreyer, Jens",33,4874,147.69696969696969]
[null,null,"","Schultis, Holger",30,4426,147.53333333333333]
[null,null,"","Siehler, Michael",30,4520,150.66666666666666]
[null,null,"","Sprätz, Holger",36,5172,143.66666666666666]
[null,null,null,null,486,70742,145.559670781893]
[null,null,"ESV","Energie Sportvereinigung Hamburg",null,null,""]
[null,null,"","Chorala, Rolf",36,4385,121.80555555555556]
[null,null,"","Christiansen, Andreas",35,6233,178.08571428571429]
[null,null,{"$error":"#N/A"},"Groß, Angelika",33,4233,128.27272727272728]
[null,null,"","Kalben, Dieter",27,4915,182.03703703703704]
[null,null,"","Kreidelmeyer, Elam",39,5214,133.69230769230768]
[null,null,{"$error":"#N/A"},"Meier Tolks, Pamela-Erika",27,3217,119.14814814814815]
[null,null,26,"Nabel, Erika",67,9243,137.955223880597]
[null,null,102,"Nabel, Uwe",79,11346,143.62025316455697]
[null,null,{"$error":"#N/A"},"Schmedes, Heike",39,6122,156.97435897435898]
[null,null,"","Schmedes, Holger",42,7560,180]
[null,null,{"$error":"#N/A"},"Theus, Janine",33,4537,137.4848484848485]
[null,null,{"$error":"#N/A"},"Tolks, Imelda",21,2373,113]
[null,null,{"$error":"#N/A"},"Tolks, Keschia Angela",9,972,108]
[null,null,"","Vesper, Michael",42,6184,147.23809523809524]
[null,null,{"$error":"#N/A"},"Wiese, Iris",36,5160,143.33333333333334]
[null,null,{"$error":"#N/A"},"Zimmermann, Monika",8,1174,146.75]
[null,null,null,null,573,82868,144.62129144851659]
[null,null,"FAH","LG Finanzämter Hamburg",null,null,""]
[null,null,20,"Bär, Sven",75,13576,181.01333333333332]
[null,null,{"$error":"#N/A"},"Barz, Petra",9,1234,137.11111111111111]
[null,null,13,"Beck, Frank",58,10814,186.44827586206895]
[null,null,70,"Brandes, Dirk",54,8732,161.7037037037037]
[null,null,{"$error":"#N/A"},"Erdmann, Iris",12,1411,117.58333333333333]
[null,null,"","Glüse, Ulf",48,7491,156.0625]
[null,null,"","Götze, Roland",15,2142,142.80000000000001]
[null,null,26,"Hinnrichs, Carsten",95,16893,177.82105263157894]
[null,null,"","Jürgens, Michael",45,6984,155.19999999999999]
[null,null,"","Kaddatz, Kurt",21,2932,139.61904761904762]
[null,null,"","Kurt, Michael",9,1364,151.55555555555554]
[null,null,"","Kurt, Wolf-Dietrich",3,300,100]
[null,null,"","Lenz, Jan-Peter",34,5100,150]
[null,null,37,"Ly, Hien-Chanh",94,16326,173.68085106382978]
[null,null,"","Matthes, Bernd",36,5813,161.47222222222223]
[null,null,"","Möller, Joachim",45,6851,152.24444444444444]
[null,null,4,"Plaikaew, Jaruwan",104,17720,170.38461538461539]
[null,null,"","Schypulla, Axel",15,2174,144.93333333333334]
[null,null,7,"Semizenko, Viktoria",110,18323,166.57272727272726]
[null,null,40,"Sommer, Christian",95,16437,173.02105263157895]
[null,null,"","Waal, David",3,437,145.66666666666666]
[null,null,{"$error":"#N/A"},"Weseloh, Sigrid",6,699,116.5]
[null,null,null,null,986,163753,166.07809330628803]
[null,null,"FIT","Fit im BSV",null,null,""]
[null,null,"","Großmann, Wolfgang",42,6244,148.66666666666666]
[null,null,10,"Schmoock, Sigrid",50,7960,159.19999999999999]
[null,null,null,null,92,14204,154.38999999999999]
[null,null,"FW","Feuerwehr Hamburg",null,null,""]
[null,null,"","Avila Rojas, Antonio David",30,4893,163.1]
[null,null,"","Bischof, Horst",23,3367,146.39130434782609]
[null,null,{"$error":"#N/A"},"Bischof, Karin ",42,5371,127.88095238095238]
[null,null,"","Clorius, Thorsten",18,2762,153.44444444444446]
[null,null,{"$error":"#N/A"},"Droop, Leonie Sophie",37,5298,143.18918918918919]
[null,null,"","Droop, Thorsten",40,6051,151.27500000000001]
[null,null,30,"Finke, Andreas",51,8959,175.66666666666666]
[null,null,{"$error":"#N/A"},"Haedge, Gerda",12,1632,136]
[null,null,"","Höfling, Thomas",24,3847,160.29166666666666]
[null,null,"","Otto, Michael",6,782,130.33333333333334]
[null,null,{"$error":"#N/A"},"Schröder, Michaela",12,1966,163.83333333333334]
[null,null,"","Thiel, Sven",21,3173,151.0952380952381]
[null,null,"","Walter, Tino",39,6918,177.38461538461539]
[null,null,null,null,355,55019,154.98309859154929]
[null,null,null,null,0,0,0]
[null,null,"GEN","Generali Versicherungen",null,null,""]
[null,null,"","Avemarg, Mathias",30,4392,146.4]
[null,null,"","Buys, Peter",27,5189,192.18518518518519]
[null,null,"","Fietkau, Karsten",42,7191,171.21428571428572]
[null,null,"","Gathmann, Sven",9,1326,147.33333333333334]
[null,null,"","Geißler, Frank",9,1256,139.55555555555554]
[null,null,"","Göttsch, Volker",3,415,138.33333333333334]
[null,null,"","Gottschling, Hans-Joachim",27,3674,136.07407407407408]
[null,null,{"$error":"#N/A"},"Haack, Peggy",33,5577,169]
[null,null,{"$error":"#N/A"},"Hass, Stefanie",18,2582,143.44444444444446]
[null,null,"","Heymann, Kay-Joachim",39,6174,158.30769230769232]
[null,null,"","Jenning, Jürgen",12,1429,119.08333333333333]
[null,null,"","Kock, Manfred",9,1194,132.66666666666666]
[null,null,68,"Marczynkowski, Frank",51,8291,162.56862745098039]
[null,null,"","Naht, Volker",21,2792,132.95238095238096]
[null,null,"","Paetsch, Dieter",3,303,101]
[null,null,"","Pellnath, Thorsten",21,3046,145.04761904761904]
[null,null,"","Post, Herbert",27,4075,150.92592592592592]
[null,null,"","Quade, Detlef",30,4775,159.16666666666666]
[null,null,"","Roitzsch, Georg",46,7527,163.63043478260869]
[null,null,{"$error":"#N/A"},"Schmidt, Marianne",47,7088,150.80851063829786]
[null,null,"","Schmolling, Magnus",39,6771,173.61538461538461]
[null,null,{"$error":"#N/A"},"Wenzel, Susanne",15,2163,144.19999999999999]
[null,null,null,null,558,87230,156.32616487455198]
[null,null,"HAN","Hanse Merkur",null,null,""]
[null,null,{"$error":"#N/A"},"Bunge, Elke",12,1694,141.16666666666666]
[null,null,98,"Frauendiener, Daniel",51,7487,146.80392156862746]
[null,null,{"$error":"#N/A"},"John, Kora",15,1868,124.53333333333333]
[null,null,{"$error":"#N/A"},"Korb, Luisa",15,1852,123.46666666666667]
[null,null,{"$error":"#N/A"},"Max, Helga",49,7573,154.55102040816325]
[null,null,35,"Ohl, Jörg",65,11319,174.13846153846154]
[null,null,{"$error":"#N/A"},"Röseler, Miriam",3,247,82.333333333333329]
[null,null,{"$error":"#N/A"},"Schmagler, Jana",16,2517,157.3125]
[null,null,"","Steger, Ulrich",9,916,101.77777777777777]
[null,null,99,"Völler, Fabian",51,7471,146.49019607843138]
[null,null,"","Zagorski, Grzegorz",18,2588,143.77777777777777]
[null,null,null,null,304,45532,149.77631578947367]
[null,null,"HAS","Hamburger Sparkasse",null,null,""]
[null,null,"","Baule, Danny",36,6515,180.97222222222223]
[null,null,"","Baule, Stefan",45,8173,181.62222222222223]
[null,null,"","Becker, Tim",33,6378,193.27272727272728]
[null,null,27,"Corleis, Holger",95,16784,176.67368421052632]
[null,null,"","Fanter, Karsten",30,4098,136.6]
[null,null,{"$error":"#N/A"},"Fentner, Angela",18,2476,137.55555555555554]
[null,null,"","Fentner, Boris",42,6939,165.21428571428572]
[null,null,"","Godhusen, André",48,7119,148.3125]
[null,null,{"$error":"#N/A"},"Greve, Irmgard",12,1621,135.08333333333334]
[null,null,"","Guhl, Ralph",30,4105,136.83333333333334]
[null,null,"","Gurtmann, Christian",42,6064,144.38095238095238]
[null,null,"","Hahnhausen, Peter",39,5727,146.84615384615384]
[null,null,{"$error":"#N/A"},"Hartwigsen, Antje",28,4457,159.17857142857142]
[null,null,{"$error":"#N/A"},"Haupt, Maike",33,4785,145]
[null,null,"","Jeckstat, Wolfgang",30,5518,183.93333333333334]
[null,null,"","Jeroschewitz, Volkmar",33,4951,150.03030303030303]
[null,null,"","Metzger, Jörg",21,3270,155.71428571428572]
[null,null,{"$error":"#N/A"},"Michalski, Angela",33,4962,150.36363636363637]
[null,null,"","Mohnke, Rolf",48,7634,159.04166666666666]
[null,null,"","Pahnke, Kurt",42,5397,128.5]
[null,null,23,"Pahnke, Rita",51,7420,145.49019607843138]
[null,null,{"$error":"#N/A"},"Prüß, Kirsten",39,5749,147.41025641025641]
[null,null,"","Röper, Günther",42,6527,155.4047619047619]
[null,null,{"$error":"#N/A"},"Röper, Monika",48,6809,141.85416666666666]
[null,null,"","Ruhnau, Bernd",42,6464,153.9047619047619]
[null,null,"","Schraner, Thomas",24,3724,155.16666666666666]
[null,null,"","Schulz, Bernd",42,5573,132.6904761904762]
[null,null,"","Schulze, Oliver",36,6683,185.63888888888889]
[null,null,{"$error":"#N/A"},"Schwarz, Susanne",24,3394,141.41666666666666]
[null,null,"","Sube, Wolfgang",30,4580,152.66666666666666]
[null,null,"","Tams, Olaf",45,8184,181.86666666666667]
[null,null,"","Thielecke, Manfred",42,5985,142.5]
[null,null,"","Timm, Frank",27,3715,137.59259259259258]
[null,null,69,"Tjaden, Christian",51,8258,161.92156862745097]
[null,null,"","Vogt, Bernd",3,525,175]
[null,null,"","Weber, Henning",3,442,147.33333333333334]
[null,null,{"$error":"#N/A"},"Witt, Dunja",21,2963,141.0952380952381]
[null,null,null,null,1308,203968,155.93883792048931]
[null,null,"HHA","Hamburger Hochbahn",null,null,""]
[null,null,28,"Blasch, Stephan",79,13949,176.56962025316454]
[null,null,"","Brack, Berthold",33,5388,163.27272727272728]
[null,null,{"$error":"#N/A"},"Brammann, Doris",22,3037,138.04545454545453]
[null,null,"","Buddenhagen, Ronny",45,7087,157.48888888888888]
[null,null,3,"Franze, Olaf",51,10070,197.45098039215685]
[null,null,"","Haeger, Jörg",33,5722,173.39393939393941]
[null,null,{"$error":"#N/A"},"Harms, Birgit",40,6815,170.375]
[null,null,{"$error":"#N/A"},"Heidenreich, Dorlind",18,2126,118.11111111111111]
[null,null,{"$error":"#N/A"},"Kowalska, Sylwia Anna",21,1761,83.857142857142861]
[null,null,{"$error":"#N/A"},"Lüdeke, Carmen",44,7577,172.20454545454547]
[null,null,"","Mattern, Holger ",30,4669,155.63333333333333]
[null,null,52,"Miegel, Michael",57,9487,166.43859649122808]
[null,null,{"$error":"#N/A"},"Misof, Ayleen",20,3193,159.65]
[null,null,53,"Möller, Hans-Sönke",57,9474,166.21052631578948]
[null,null,41,"Möller, Leon",58,10030,172.93103448275863]
[null,null,{"$error":"#N/A"},"Naguschewski, Tatjana",15,1975,131.66666666666666]
[null,null,"","Ong, Julian",9,1499,166.55555555555554]
[null,null,56,"Pasenow, Norbert",51,8431,165.31372549019608]
[null,null,{"$error":"#N/A"},"Radicke, Anja",15,2159,143.93333333333334]
[null,null,{"$error":"#N/A"},"Rasch, Nicole",24,3298,137.41666666666666]
[null,null,"","Reinhardt, Lars",43,7335,170.58139534883722]
[null,null,"","Retterath, Stefan",49,7933,161.89795918367346]
[null,null,"","Schumann, Thomas",18,2581,143.38888888888889]
[null,null,"","Schwarz, Dirk",42,7286,173.47619047619048]
[null,null,{"$error":"#N/A"},"Schwarz, Maximilian",21,2303,109.66666666666667]
[null,null,{"$error":"#N/A"},"Schwarz, Selina",30,4888,162.93333333333334]
[null,null,{"$error":"#N/A"},"Schwarz, Simone",24,2798,116.58333333333333]
[null,null,14,"Spieß, Lydia",53,8079,152.43396226415095]
[null,null,"","Stoldt, Olaf",42,6994,166.52380952380952]
[null,null,"","von Borstel, Volker",15,2195,146.33333333333334]
[null,null,"","Wallbrecht, Uwe",30,4730,157.66666666666666]
[null,null,null,null,1089,174869,160.57759412304867]
[null,null,"HLA","HHLA",null,null,""]
[null,null,"","Blaudzun, Torsten",36,6469,179.69444444444446]
[null,null,"","Gripp, Frank",6,941,156.83333333333334]
[null,null,"","Günther, Hilmar",45,7111,158.02222222222221]
[null,null,"","Günther, Sven",24,3525,146.875]
[null,null,"","Hase, Klaus",18,2341,130.05555555555554]
[null,null,{"$error":"#N/A"},"Hennicke, Sandra",3,539,179.66666666666666]
[null,null,"","Holle, Ralf",27,4069,150.7037037037037]
[null,null,"","Krüger, Joachim",24,3753,156.375]
[null,null,"","Krüger, Karsten",39,7436,190.66666666666666]
[null,null,"","Kunert, Volker",42,7680,182.85714285714286]
[null,null,"","Reuter, Heinz",27,4372,161.92592592592592]
[null,null,"","Seiferth, Florian",12,1566,130.5]
[null,null,{"$error":"#N/A"},"Siebert, Corinna",6,709,118.16666666666667]
[null,null,"","Windisch, Tobias",24,3662,152.58333333333334]
[null,null,null,null,333,54173,162.68168168168168]
[null,null,"HPA","BWVL Hamburg Port Authority",null,null,""]
[null,null,72,"Bassing, Joachim",71,11438,161.09859154929578]
[null,null,"","Krahl, Andreas",36,5670,157.5]
[null,null,"","Krüger, Andreas",39,6603,169.30769230769232]
[null,null,"","Mechela, Andreas",6,674,112.33333333333333]
[null,null,"","Salvador, Jay",6,1091,181.83333333333334]
[null,null,79,"Walter, Matthias",55,8657,157.4]
[null,null,null,null,213,34133,160.24882629107981]
[null,null,"JH","Jungheinrich",null,null,""]
[null,null,{"$error":"#N/A"},"Birkenfeld, Annemarie",27,3459,128.11111111111111]
[null,null,{"$error":"#N/A"},"Boschen, Regina",43,5697,132.48837209302326]
[null,null,"","Ernst, Holger",36,6757,187.69444444444446]
[null,null,"","Ernst, Miro",36,6378,177.16666666666666]
[null,null,{"$error":"#N/A"},"Ernst, Yvonne",12,1820,151.66666666666666]
[null,null,{"$error":"#N/A"},"Förster, Eveline",39,4886,125.28205128205128]
[null,null,"","Förster, Karl-Heinz",42,6865,163.45238095238096]
[null,null,"","Hartmann, Bernd",6,747,124.5]
[null,null,"","Krüger, Gregor Christof",24,3639,151.625]
[null,null,{"$error":"#N/A"},"Lesch, Heide",40,6653,166.32499999999999]
[null,null,"","Markwa, Hans-Jürgen",24,3979,165.79166666666666]
[null,null,{"$error":"#N/A"},"Markwa, Rita",12,1436,119.66666666666667]
[null,null,"","Meinke, Horst",45,6072,134.93333333333334]
[null,null,{"$error":"#N/A"},"Niethammer, Ramona",24,3509,146.20833333333334]
[null,null,"","Priegnitz, Jörg",24,2585,107.70833333333333]
[null,null,"","Priegnitz, Lars",9,1126,125.11111111111111]
[null,null,"","Schulz, Burkhard",12,1543,128.58333333333334]
[null,null,"","Stöbe, Uwe",43,6483,150.76744186046511]
[null,null,"","Wengel. Stefan",39,6445,165.25641025641025]
[null,null,null,null,537,80079,149.12290502793297]
[null,null,"JUL","Jornitz u. Luth",null,null,""]
[null,null,43,"Jornitz, Karsten",63,10822,171.77777777777777]
[null,null,"","Krüger, Albert",35,4849,138.54285714285714]
[null,null,29,"Thießen, Christian",59,10392,176.13559322033899]
[null,null,"","Thießen, Christopher",39,6304,161.64102564102564]
[null,null,{"$error":"#N/A"},"Thießen, Esmeralda",20,2988,149.4]
[null,null,"","Thießen, Marcel",38,6037,158.86842105263159]
[null,null,"","Born, Ronald",29,4565,157.41379310344828]
[null,null,null,null,283,45957,162.38999999999999]
[null,null,"JUS","Justizbehörde",null,null,""]
[null,null,{"$error":"#N/A"},"Beier, Sabine",27,3580,132.59259259259258]
[null,null,"","Dobs, Hans-Hermann",42,5834,138.9047619047619]
[null,null,"","Gebauer, Andreas",39,4805,123.2051282051282]
[null,null,"","Jöhnk, Michael",33,4753,144.03030303030303]
[null,null,"","Kleefeld, Michael",21,3246,154.57142857142858]
[null,null,"","Lannte, Niklas",27,5072,187.85185185185185]
[null,null,{"$error":"#N/A"},"Meier, Anja",27,3717,137.66666666666666]
[null,null,"","Meier, Ulrich",36,6147,170.75]
[null,null,"","Wipperhausen, Lars",42,7518,179]
[null,null,{"$error":"#N/A"},"Wipperhausen, Martina",42,6953,165.54761904761904]
[null,null,null,null,336,51625,153.64583333333334]
[null,null,"KAH","Amandus Kahl",null,null,""]
[null,null,"","Bröer, Markus",30,3987,132.9]
[null,null,{"$error":"#N/A"},"Ghising, Patricia",3,289,96.333333333333329]
[null,null,{"$error":"#N/A"},"Keil, Jennifer",36,4821,133.91666666666666]
[null,null,"","Konietzny, Marcel",27,3981,147.44444444444446]
[null,null,"","Könnecke, Jörg",12,1516,126.33333333333333]
[null,null,"","Mahn, Heiko",15,1760,117.33333333333333]
[null,null,"","Rullmann, Lukas",12,1467,122.25]
[null,null,"","von Geldern, Kai",33,4405,133.4848484848485]
[null,null,null,null,168,22226,132.29761904761904]
[null,null,"KS","Körber Sports",null,null,""]
[null,null,"","Gartmann, Carsten",45,6586,146.35555555555555]
[null,null,36,"Gerdau, Daniel",62,10780,173.87096774193549]
[null,null,"","Heidukowski, Frank",42,6920,164.76190476190476]
[null,null,12,"Höner, Christopher",62,11627,187.53225806451613]
[null,null,"","Karwat, Chris",3,332,110.66666666666667]
[null,null,"","Maack, Jürgen",39,6814,174.71794871794873]
[null,null,63,"Oesterling, Thomas",68,11132,163.70588235294119]
[null,null,"","Piel, Andreas",42,6762,161]
[null,null,"","Saggau, Maik",39,6746,172.97435897435898]
[null,null,"","Thiessen, Niclas",3,455,151.66666666666666]
[null,null,null,null,405,68154,168.28148148148148]
[null,null,"LSV","Lufthansa",null,null,""]
[null,null,"","Duve, Roland",36,5220,145]
[null,null,"","Hagelkris, Franz",24,3247,135.29166666666666]
[null,null,"","Kaminsky, Jürgen",3,453,151]
[null,null,"","Keseling, Klaus",45,7021,156.02222222222221]
[null,null,"","Keseling, Patrick",18,2873,159.61111111111111]
[null,null,{"$error":"#N/A"},"Langbein, Pornphan",30,4328,144.26666666666668]
[null,null,{"$error":"#N/A"},"Ludwig, Bella",6,856,142.66666666666666]
[null,null,{"$error":"#N/A"},"Schiller, Amporn",25,3205,128.19999999999999]
[null,null,"","Schütze, Jörg",33,4997,151.42424242424244]
[null,null,{"$error":"#N/A"},"Sitas, Bärbel",21,2392,113.9047619047619]
[null,null,{"$error":"#N/A"},"Vogler, Renate",24,2799,116.625]
[null,null,"","Voß, Harald",45,7473,166.06666666666666]
[null,null,57,"Wehder, Christian",50,8253,165.06]
[null,null,84,"Wicens, Rolf",54,8427,156.05555555555554]
[null,null,null,null,414,61544,148.65700483091788]
[null,null,"OTT","Otto",null,null,""]
[null,null,"","Gogoll, Andreas",25,4108,164.32]
[null,null,{"$error":"#N/A"},"Gogoll, Janice",41,5501,134.17073170731706]
[null,null,"","Güllnitz, Ingo",36,5239,145.52777777777777]
[null,null,{"$error":"#N/A"},"Güllnitz, Silke",33,4036,122.3030303030303]
[null,null,"","Hellwagen, Sven",30,5016,167.2]
[null,null,{"$error":"#N/A"},"Kotz, Britta",16,2366,147.875]
[null,null,100,"Kotz, Ralf",87,12725,146.26436781609195]
[null,null,"","Krause, Volker",24,3201,133.375]
[null,null,19,"Landmesser, Tanja",67,10014,149.46268656716418]
[null,null,18,"Pahl, Florian",74,13505,182.5]
[null,null,105,"Renter, Stephan",51,7118,139.56862745098039]
[null,null,96,"Reszel, Mario",58,8619,148.60344827586206]
[null,null,16,"Scharfe, Heiko",92,16957,184.31521739130434]
[null,null,77,"Schönhöbel, Stefan",53,8384,158.18867924528303]
[null,null,7,"Wahrmann, Christian",75,14491,193.21333333333334]
[null,null,"","Wiegand, Wolfgang",6,943,157.16666666666666]
[null,null,null,null,768,122223,159.14453125]
[null,null,"P 2","Postamt  2",null,null,""]
[null,null,"","Bente, Maik",24,3910,162.91666666666666]
[null,null,"","Borchert, Martin",30,3992,133.06666666666666]
[null,null,{"$error":"#N/A"},"Borchert, Monika",27,3747,138.77777777777777]
[null,null,"","Bücking, Joachim",48,7428,154.75]
[null,null,"","Hatje, Jonas",42,7310,174.04761904761904]
[null,null,"","Hatje, Thomas",48,8191,170.64583333333334]
[null,null,{"$error":"#N/A"},"Kunze, Isolde",36,5331,148.08333333333334]
[null,null,"","Naujack, Kurt",48,8318,173.29166666666666]
[null,null,"","Pohlmann, Erhard",42,6577,156.5952380952381]
[null,null,"","Stelter, Klaus",6,766,127.66666666666667]
[null,null,"","Stopat, Reiner",27,4313,159.74074074074073]
[null,null,"","Stopat, Simon Paul",42,7716,183.71428571428572]
[null,null,null,null,420,67599,160.94999999999999]
[null,null,"PAN","Panasonic",null,null,""]
[null,null,"","Frahm, Jörg",31,5300,170.96774193548387]
[null,null,"","Hagelstein, Deniz",21,2818,134.1904761904762]
[null,null,"","Jurk, Mario",18,3245,180.27777777777777]
[null,null,"","Nijholt, Frank",15,2051,136.73333333333332]
[null,null,"","Nolte, Matthias",15,2000,133.33333333333334]
[null,null,"","Roßberg, Kai",36,6459,179.41666666666666]
[null,null,27,"Schmidt, Annegret",63,8663,137.50793650793651]
[null,null,null,"Wetzel, Ilona",49,7534,153.75510204081633]
[null,null,"","Wetzel, Michael",28,4950,176.78571428571428]
[null,null,null,null,276,43020,155.86956521739131]
[null,null,"POL","Polizei Hamburg v. 1872",null,null,""]
[null,null,"","Bolduan, Harald",37,5564,150.37837837837839]
[null,null,"","Buck, Christian",9,903,100.33333333333333]
[null,null,"","Buro, Veit",18,2570,142.77777777777777]
[null,null,"","Eckhoff, Michael",31,4953,159.7741935483871]
[null,null,"","Geib, Thomas",18,2925,162.5]
[null,null,"","Grelck, Heiko",42,6195,147.5]
[null,null,{"$error":"#N/A"},"Heine, Theresa",28,3722,132.92857142857142]
[null,null,"","Gutthusen, Sebastian",15,2098,139.86666666666667]
[null,null,"","Hajek, Raimond",27,3939,145.88888888888889]
[null,null,"","Jagusch, Rainer",12,1687,140.58333333333334]
[null,null,"","Kobe, Winfried",15,2174,144.93333333333334]
[null,null,55,"Kratzke, Torsten",53,8762,165.32075471698113]
[null,null,"","Letz, Andreas",18,2277,126.5]
[null,null,"","Müller-Habekost, Thorsten",33,4965,150.45454545454547]
[null,null,"","Schufft, Patrick",18,2616,145.33333333333334]
[null,null,null,null,374,55350,147.99465240641712]
[null,null,"SBC","Smart Blue Club Hamburg",null,null,""]
[null,null,"","Aurast, Frank",36,5921,164.47222222222223]
[null,null,{"$error":"#N/A"},"Aurast, Kathrin",21,1845,87.857142857142861]
[null,null,"","Brink, Stephan",33,4488,136]
[null,null,"","Duft, Daniel",9,1503,167]
[null,null,"","Kahler, Mirko",6,841,140.16666666666666]
[null,null,"","Varga, Mihaly",12,1810,150.83333333333334]
[null,null,"","von Rönnen , Hans-Heinr.",39,6025,154.48717948717947]
[null,null,null,null,156,22433,143.80128205128204]
[null,null,"SGS","SG Stern Hamburg",null,null,""]
[null,null,"","Deede, Bernd",18,3621,201.16666666666666]
[null,null,{"$error":"#N/A"},"Deede, Elke",21,3325,158.33333333333334]
[null,null,"","Garbers, Ingo",27,3653,135.2962962962963]
[null,null,"","Hansen, Peter",12,1968,164]
[null,null,"","Sziedat, Simon",27,3862,143.03703703703704]
[null,null,{"$error":"#N/A"},"Wiechmann, Tanja",18,2360,131.11111111111111]
[null,null,"","Wiechmann, Thomas",21,3398,161.8095238095238]
[null,null,"","Zimmer, Carl-Heinz",21,2412,114.85714285714286]
[null,null,null,null,165,24599,149.08484848484849]
[null,null,"SHN","Stahlhandel Nord",null,null,""]
[null,null,"","Böge, Dennis",15,1913,127.53333333333333]
[null,null,"","Gelhaus, Sven",24,4717,196.54166666666666]
[null,null,"","Lutz-Melanchthon, Stefan",16,2670,166.875]
[null,null,15,"Schmidtke, Christoph",61,11334,185.80327868852459]
[null,null,2,"Schmidtke, Maren",58,10217,176.15517241379311]
[null,null,1,"Vogel, Meike",88,17422,197.97727272727272]
[null,null,null,null,262,48273,184.24809160305344]
[null,null,"SID","SV Signal Iduna",null,null,""]
[null,null,"","Beier, Thomas",33,5544,168]
[null,null,"","Burgdorf, Wolfgang",9,1266,140.66666666666666]
[null,null,{"$error":"#N/A"},"Carstensen, Elke",12,1331,110.91666666666667]
[null,null,"","Guth, Michael",36,5388,149.66666666666666]
[null,null,74,"Handel, Klaus",84,13321,158.58333333333334]
[null,null,{"$error":"#N/A"},"Harnack, Ingrid",21,2403,114.42857142857143]
[null,null,"","Matzke, Horst",18,2999,166.61111111111111]
[null,null,"","Mohr, Thorsten",24,3483,145.125]
[null,null,"","Rose, Horst",30,4738,157.93333333333334]
[null,null,"","Schmidt, Manfred",47,8129,172.95744680851064]
[null,null,3,"Schulze, Jenny",89,15499,174.14606741573033]
[null,null,6,"Schulze, Norbert",92,17918,194.7608695652174]
[null,null,50,"Smarsly, Detlev",88,14761,167.73863636363637]
[null,null,"","Sobczek, Matthias",24,3138,130.75]
[null,null,"","Thal, Thomas",33,4088,123.87878787878788]
[null,null,"","von Rönne, Jens",21,2910,138.57142857142858]
[null,null,"","Willhaus, Manfred",21,3121,148.61904761904762]
[null,null,null,null,682,110037,161.34457478005865]
[null,null,"SRH","Stadtreinigung",null,null,""]
[null,null,"","Freudenberg, Jürgen",33,5429,164.5151515151515]
[null,null,"","Hoffmeister, Jan",27,4602,170.44444444444446]
[null,null,"","Mättig, Rüdiger",33,4659,141.18181818181819]
[null,null,"","Mergel, Heiko",36,6373,177.02777777777777]
[null,null,{"$error":"#N/A"},"Schwarz, Cornelia",8,1203,150.375]
[null,null,8,"Stürmer, Rolf",89,17097,192.10112359550561]
[null,null,null,null,226,39363,174.17256637168143]
[null,null,"STI","Still",null,null,""]
[null,null,61,"Brack, Michael",73,11975,164.04109589041096]
[null,null,24,"Brack-Friedrich, Roswitha",58,8395,144.74137931034483]
[null,null,"","Ehrich, Jan",27,3640,134.81481481481481]
[null,null,"","Gschwill, Andreas",30,4577,152.56666666666666]
[null,null,20,"Jäger, Andrea",56,8325,148.66071428571428]
[null,null,24,"Jäger, Dirk",112,19972,178.32142857142858]
[null,null,{"$error":"#N/A"},"Lunau, Heike",22,2568,116.72727272727273]
[null,null,31,"Lunau, Norbert",96,16860,175.625]
[null,null,"","Nielsen, Karsten",38,5184,136.42105263157896]
[null,null,"","Pilß, Klaus",18,2702,150.11111111111111]
[null,null,"","Rumpf, Edgar",36,5340,148.33333333333334]
[null,null,73,"Schneider, Peter",108,17289,160.08333333333334]
[null,null,"","Sdzuy, Marc",3,402,134]
[null,null,"","Springer, Henning",9,989,109.88888888888889]
[null,null,"","Steudten, Oliver",24,3548,147.83333333333334]
[null,null,"","Wendefeuer, Jörn",42,5899,140.45238095238096]
[null,null,{"$error":"#N/A"},"Wieczorek, Vanessa",16,2272,142]
[null,null,null,null,768,119937,156.16796875]
[null,null,"ZPD","Zentrum für Personaldienste",null,null,""]
[null,null,{"$error":"#N/A"},"Kielhorn, Ute",18,1973,109.61111111111111]
[null,null,"","Klein, Mathias",30,4270,142.33333333333334]
[null,null,{"$error":"#N/A"},"Matulla, Sophie",3,260,86.666666666666671]
[null,null,"","Neumann, Nico",12,1221,101.75]
[null,null,"","Nörenberg, Martin",9,1287,143]
[null,null,"","Röpke, Jens",24,2742,114.25]
[null,null,"","Wilck, Gerhard",12,1517,126.41666666666667]
[null,null,null,null,108,13270,122.87037037037037]

{"sheet":"Spielbogen 11er","index":30,"n_rows":52,"n_cols":14,"rows_kept":52,"cut":false,"hidden":true,"merged":[[1,2,1,13]]}
["Start"]
["Rangliste",null,"       Betriebssportverband Hamburg e.V.  "]
[null,null,"       -  Sparte Bowling  -",null,null,null,null,null,"          -  Spielsystembogen  -"]
[]
[null,null,"Klasse   ",null,null,{"$f":"+'Hilfstabelle Mannschaften'!I4","v":"B2"},null,null,"Antritt","Bahn","      Datum",null,"    Ausrichter"]
[null,null,null,null,null,null,null,null,"1.","WB","2025-09-11",null,1,{"$f":"G8","v":"ELB 4"}]
[null,null," ","  B  S  G",null,null,"Kurzf.",null,"2.","OT","2025-09-25",null,2,"STI 3"]
[null,null,1,"Elbe-Sport 4",null,null,"ELB 4",null,"3.","WB","2025-10-09",null,3,"BAL 2"]
[null,null,2,"Still 3",null,null,"STI 3",null,"4.","OT","2025-10-23",null,4,"CLP 1"]
[null,null,3,"Baloise e.V. 2",null,null,"BAL 2",null,"5.","WB","2025-11-06",null,5,"HAS 7"]
[null,null,4,"Claudius Peters 1",null,null,"CLP 1",null,"6.","OT","2026-01-15",null,6,"KAH 1"]
[null,null,5,"HASPA 7",null,null,"HAS 7",null,"7.","WB","2026-01-29",null,7,"PAN 1"]
[null,null,6,"Amandus Kahl 1",null,null,"KAH 1",null,"8.","OT","2026-02-12",null,8,"SGS 1"]
[null,null,7,"Panasonic 1",null,null,"PAN 1",null,"9.","WB","2026-02-26",null,9,"ALL 3"]
[null,null,8,"SG Stern 1",null,null,"SGS 1",null,"10.","OT","2026-03-12",null,10,"SID 3"]
[null,null,9,"Allianz 3",null,null,"ALL 3",null,"11.","WB","2026-03-26",null,11,"ELB 3"]
[null,null,10,"Iduna 3",null,null,"SID 3",null,"12.","OT","2026-04-09",null,1,{"$f":"G8","v":"ELB 4"}]
[null,null,11,"Elbe-Sport 3",null,null,"ELB 3",null,"13.","WB","2026-04-23",null,2,{"$f":"G9","v":"STI 3"}]
[null,null,null,null,null,null,null,null,"14.","OT","2026-05-07",null,3,{"$f":"G10","v":"BAL 2"}]
[null,null,null,null,null,null,null,null," "]
[null,null,"Antritt"]
[null,null,"Halle"]
[null,null,"1 . A.",1,3,11,8,9,7,2,10,4,6,5]
[null,null," ",{"$f":"VLOOKUP(D23,$C$8:$G$19,5,0)","v":"ELB 4"},{"$f":"VLOOKUP(E23,$C$8:$G$19,5,0)","v":"BAL 2"},{"$f":"VLOOKUP(F23,$C$8:$G$19,5,0)","v":"ELB 3"},"SGS 1","ALL 3","PAN 1","STI 3","SID 3","CLP 1","KAH 1","HAS 7"]
[null,null,"2 . A.",2,9,10,1,6,8,5,4,11,7,3]
[null,null," ",{"$f":"VLOOKUP(D25,$C$8:$G$19,5,0)","v":"STI 3"},{"$f":"VLOOKUP(E25,$C$8:$G$19,5,0)","v":"ALL 3"},{"$f":"VLOOKUP(F25,$C$8:$G$19,5,0)","v":"SID 3"},"ELB 4","KAH 1","SGS 1","HAS 7","CLP 1","ELB 3","PAN 1","BAL 2"]
[null,null,"3 . A.",11,6,4,7,10,3,1,8,5,2,9]
[null,null," ",{"$f":"VLOOKUP(D27,$C$8:$G$19,5,0)","v":"ELB 3"},{"$f":"VLOOKUP(E27,$C$8:$G$19,5,0)","v":"KAH 1"},{"$f":"VLOOKUP(F27,$C$8:$G$19,5,0)","v":"CLP 1"},"PAN 1","SID 3","BAL 2","ELB 4","SGS 1","HAS 7","STI 3","ALL 3"]
[null,null,"4 . A.",7,5,3,6,1,4,9,11,10,8,2]
[null,null," ",{"$f":"VLOOKUP(D29,$C$8:$G$19,5,0)","v":"PAN 1"},{"$f":"VLOOKUP(E29,$C$8:$G$19,5,0)","v":"HAS 7"},{"$f":"VLOOKUP(F29,$C$8:$G$19,5,0)","v":"BAL 2"},"KAH 1","ELB 4","CLP 1","ALL 3","ELB 3","SID 3","SGS 1","STI 3"]
[null,null,"5 . A.",8,4,9,5,2,6,11,1,7,3,10]
[null,null," ",{"$f":"VLOOKUP(D31,$C$8:$G$19,5,0)","v":"SGS 1"},{"$f":"VLOOKUP(E31,$C$8:$G$19,5,0)","v":"CLP 1"},{"$f":"VLOOKUP(F31,$C$8:$G$19,5,0)","v":"ALL 3"},"HAS 7","STI 3","KAH 1","ELB 3","ELB 4","PAN 1","BAL 2","SID 3"]
[null,null,"6 . A.",1,7,8,2,11,5,3,9,6,10,4]
[null,null," ",{"$f":"VLOOKUP(D33,$C$8:$G$19,5,0)","v":"ELB 4"},{"$f":"VLOOKUP(E33,$C$8:$G$19,5,0)","v":"PAN 1"},{"$f":"VLOOKUP(F33,$C$8:$G$19,5,0)","v":"SGS 1"},"STI 3","ELB 3","HAS 7","BAL 2","ALL 3","KAH 1","SID 3","CLP 1"]
[null,null,"7 . A.",9,10,4,11,8,7,1,2,3,5,6]
[null,null," ",{"$f":"VLOOKUP(D35,$C$8:$G$19,5,0)","v":"ALL 3"},{"$f":"VLOOKUP(E35,$C$8:$G$19,5,0)","v":"SID 3"},{"$f":"VLOOKUP(F35,$C$8:$G$19,5,0)","v":"CLP 1"},"ELB 3","SGS 1","PAN 1","ELB 4","STI 3","BAL 2","HAS 7","KAH 1"]
[null,null,"8 . A.",3,8,6,9,5,1,10,4,2,11,7]
[null,null," ",{"$f":"VLOOKUP(D37,$C$8:$G$19,5,0)","v":"BAL 2"},{"$f":"VLOOKUP(E37,$C$8:$G$19,5,0)","v":"SGS 1"},{"$f":"VLOOKUP(F37,$C$8:$G$19,5,0)","v":"KAH 1"},"ALL 3","HAS 7","ELB 4","SID 3","CLP 1","STI 3","ELB 3","PAN 1"]
[null,null,"9 . A.",4,2,5,10,3,11,6,7,9,1,8]
[null,null," ",{"$f":"VLOOKUP(D39,$C$8:$G$19,5,0)","v":"CLP 1"},{"$f":"VLOOKUP(E39,$C$8:$G$19,5,0)","v":"STI 3"},{"$f":"VLOOKUP(F39,$C$8:$G$19,5,0)","v":"HAS 7"},"SID 3","BAL 2","ELB 3","KAH 1","PAN 1","ALL 3","ELB 4","SGS 1"]
[null,null,"10 . A.",6,1,2,3,4,9,8,5,7,10,11]
[null,null," ",{"$f":"VLOOKUP(D41,$C$8:$G$19,5,0)","v":"KAH 1"},{"$f":"VLOOKUP(E41,$C$8:$G$19,5,0)","v":"ELB 4"},{"$f":"VLOOKUP(F41,$C$8:$G$19,5,0)","v":"STI 3"},"BAL 2","CLP 1","ALL 3","SGS 1","HAS 7","PAN 1","SID 3","ELB 3"]
[null,null,"11 . A.",10,11,6,5,7,2,4,3,8,9,1]
[null,null," ",{"$f":"VLOOKUP(D43,$C$8:$G$19,5,0)","v":"SID 3"},{"$f":"VLOOKUP(E43,$C$8:$G$19,5,0)","v":"ELB 3"},{"$f":"VLOOKUP(F43,$C$8:$G$19,5,0)","v":"KAH 1"},"HAS 7","PAN 1","STI 3","CLP 1","BAL 2","SGS 1","ALL 3","ELB 4"]
[null,null,"12 . A.",9,3,1,11,6,10,7,8,5,4,2]
[null,null," ",{"$f":"VLOOKUP(D45,$C$8:$G$19,5,0)","v":"ALL 3"},{"$f":"VLOOKUP(E45,$C$8:$G$19,5,0)","v":"BAL 2"},{"$f":"VLOOKUP(F45,$C$8:$G$19,5,0)","v":"ELB 4"},"ELB 3","KAH 1","SID 3","PAN 1","SGS 1","HAS 7","CLP 1","STI 3"]
[null,null,"13 . A.",5,10,7,4,8,3,9,6,1,2,11]
[null,null," ",{"$f":"VLOOKUP(D47,$C$8:$G$19,5,0)","v":"HAS 7"},{"$f":"VLOOKUP(E47,$C$8:$G$19,5,0)","v":"SID 3"},{"$f":"VLOOKUP(F47,$C$8:$G$19,5,0)","v":"PAN 1"},"CLP 1","SGS 1","BAL 2","ALL 3","KAH 1","ELB 4","STI 3","ELB 3"]
[null,null,"14 . A.","9.","10.","5.","6.","1.","2.","3.","4.","7.","8.","11."]
[null,null," "]
[]
[null,null,null,null," "]

{"sheet":"\"Alters\"-Übersicht","index":31,"n_rows":17,"n_cols":9,"rows_kept":17,"cut":false,"hidden":false,"merged":[[3,7,3,8],[3,5,3,6],[3,3,3,4],[2,2,2,8]]}
["Start"]
["Rangliste"]
[null,null,"﻿\"Alters\"-Übersicht über alle in der Saison 2024-25 aktiven Spieler/innen"]
[null,null,"bis Ende des Jahres","Damen",null,"Herren",null,"Gesamt"]
[null,null,"80 und älter",6,3.6400000000000002E-2,13,2.9000000000000001E-2,19,3.09E-2]
[null,null,"70-79 Jahre",25,0.1515,102,0.22720000000000001,127,0.20680000000000001]
[null,null,"60-69 Jahre",61,0.36969999999999997,160,0.35630000000000001,221,0.3599]
[null,null,"50-59 Jahre",34,0.20610000000000001,83,0.18490000000000001,117,0.19059999999999999]
[null,null,"davon Senioren",{"$f":"SUM(D5:D8)","v":126},{"$f":"SUM(E5:E8)","v":0.76370000000000005},358,{"$f":"SUM(G5:G8)","v":0.79740000000000011},484,{"$f":"SUM(I5:I8)","v":0.78820000000000001}]
[null,null,"40-49 Jahre",24,0.14549999999999999,44,9.8000000000000004E-2,68,0.11070000000000001]
[null,null,"30-39 Jahre",10,6.0600000000000001E-2,33,7.3499999999999996E-2,43,7.0000000000000007E-2]
[null,null,"20-29 Jahre",5,3.0300000000000001E-2,12,2.6700000000000002E-2,17,2.7699999999999999E-2]
[null,null,"unter 20 Jahre",0,0,2,4.4999999999999997E-3,2,3.3E-3]
[null,null,"Keine Senioren",{"$f":"SUM(D10:D13)","v":39},0.2364,91,0.20269999999999999,130,0.21170000000000003]
[null,null,"Gesamt",{"$f":"+D14+D9","v":165},null,{"$f":"+F14+F9","v":449},null,{"$f":"+H14+H9","v":614}]
[]
[null,null,null,null,null,null,null," "]

{"sheet":"BSG-Kürzel 2025","index":32,"n_rows":101,"n_cols":6,"rows_kept":101,"cut":false,"hidden":false,"merged":[]}
["Start"]
["Rangliste",null,"BSV Hamburg  -  Betriebssportgemeinschaften der Sparte Bowling"]
[]
[null,null,null,"BSG-Nr.",{"$f":"COUNTA(E6:E159)","v":54},"BSG'en in dieser Saison"]
[]
[null,null,null,51021,"AAH","Agentur für Arbeit Hamburg"]
[null,null,null,55404,"ALL","SV Weiß Blau Allianz"]
[null,null,null,53405,"AU","Aurubis"]
[null,null,null,51026,"AXA","AXA Sportvereinigung"]
[null,null,null,51240,"B36","Berufgen. für Gesundheitsdienst"]
[null,null,null,51618,"Bal","Baloise e.V. "]
[null,null,null,53002,"BBK","Sportclub Dt. Bundesbank"]
[null,null,null,51211,"BWV","B W V L"]
[null,null,null,51409,"CLP","BMH-Claudius Peters AG"]
[null,null,null,51405,"COM","Commerzbank"]
[null,null,null,51406,"CON","Condor-Versicherung"]
[null,null,null,51609,"DA","Die Aktiven"]
[null,null,null,51602,"DAK","D A K"]
[null,null,null,53009,"DAT","Dataport Hamburg"]
[null,null,null,51613,"DB","SG Deutsche Bank Deutschland e.V."]
[null,null,null,51628,"DKY","Dakosy"]
[null,null,null,51624,"DSO","Die Socke"]
[null,null,null,51809,"EAG","Eppendorf AG"]
[null,null,null,51801,"ED","Edeka"]
[null,null,null,51003,"ELB","Elbe-Sport eV"]
[null,null,null,52408,"ERG","ERGO Sports Hamburg"]
[null,null,null,52440,"ESV","Energie Sportvereinigung"]
[null,null,null,52021,"FAH","LG Finanzämter Hamburg"]
[null,null,null,null,"FIT","Fit im BSV"]
[null,null,null,52002,"FW","Feuerwehr Hamburg"]
[null,null,null,52433,"GAS","Gasnetz-Hamburg"]
[null,null,null,55212,"GEN","Generali Versicherungen"]
[null,null,null,52419,"HAN","Hanse Merkur"]
[null,null,null,52411,"HAS","Hamburger Sparkasse"]
[null,null,null,52441,"HHA","Hamburger Hochbahn"]
[null,null,null,54807,"HLA","HHLA"]
[null,null,null,52410,"HMC","Hamburg Messe und Congress GmbH"]
[null,null,null,51211,"HPA","BWVL Hamburg Port Authority"]
[null,null,null,51019,"JH","Jungheinrich"]
[null,null,null,52621,"JUL","Jornitz u. Luth"]
[null,null,null,52613,"JUS","Justizbehörde"]
[null,null,null,51085,"KAH","Amandus Kahl"]
[null,null,null,52429,"KS","Körber Sports"]
[null,null,null,53016,"LSV","Lufthansa"]
[null,null,null,53602,"OIL","H+R Ölwerke Schindler GmbH"]
[null,null,null,53609,"OTT","Otto"]
[null,null,null,53823,"P 2","Postamt  2"]
[null,null,null,53807,"PAN","Panasonic"]
[null,null,null,53809,"PET","Peters Maschinenfabrik"]
[null,null,null,53819,"POL","Polizei Hamburg v. 1872"]
[null,null,null,52600,"SBC","Smart Blue Club Hamburg"]
[null,null,null,54608,"SGS","SG Stern Hamburg  "]
[null,null,null,54800,"SHN","Stahlhandel Nord"]
[null,null,null,52601,"SID","SV Signal Iduna"]
[null,null,null,54620,"SRH","Stadtreinigung"]
[null,null,null,54605,"STI","Still"]
[null,null,null,54607,"STW","Steinway & Sons"]
[null,null,null,54816,"TRE","Tretorn"]
[null,null,null,64607,"ZPD","Zentrum für Personaldienste"]
[]
[null,null,"",""]
[null,null,"",""]
[null,null,"",""]
[null,null,"",""]
[null,null,"",""]
[null,null,"",""]
[null,null,"",""]
[null,null,"",""]
[null,null,"",""]
[null,null,"",""]
[null,null,"",""]
[null,null,"",""]
[null,null,"",""]
[null,null,"",""]
[null,null,"",""]
[null,null,"",""]
[null,null,"",""]
[null,null,"",""]
[null,null,"",""]
[null,null,"",""]
[null,null,"",""]
[null,null,"",""]
[null,null,"",""]
[null,null,"",""]
[null,null,"",""]
[null,null,"",""]
[null,null,"",""]
[null,null,"",""]
[null,null,"",""]
[null,null,"",""]
[null,null,"",""]
[null,null,"",""]
[null,null,"",""]
[null,null,"",""]
[null,null,"",""]
[null,null,"",""]
[null,null,"",""]
[null,null,"",""]
[null,null,"",""]
[null,null,"",""]
[null,null,"",""]

{"sheet":"10er","index":33,"n_rows":50,"n_cols":11,"rows_kept":50,"cut":false,"hidden":true,"merged":[[0,0,0,10],[1,0,1,4],[1,6,1,10]]}
[" Betriebssportverband Hamburg e.V."]
["-  Sparte Bowling  -",null,null,null,null,null,"-  Spielsystembogen  -"]
[]
["Klasse       ",null,null,null,null,null,"Antritt","Bahn","Datum","    Ausrichter"]
[null,null,null,null,null,null,"1."," "," ",1,{"$f":"E9","v":"  "}]
[null,null,null,null,null,null,"2."," "," ",2,{"$f":"E10","v":" "}]
[null,null,null,null," ",null,"3."," "," ",3,{"$f":"E11","v":" "}]
[null,"BSG",null,null,"Kurzf.",null,"4."," "," ",4," "]
[1,null,null,null,"  ",null,"5."," "," ",5," "]
[2,null,null,null," ",null,"6."," "," ",6," "]
[3," ",null,null," ",null,"7."," "," ",7," "]
[4,null,null,null," ",null,"8."," "," ",8," "]
[5,null,null,null," ",null,"9."," "," ",9," "]
[6,null,null,null," ",null,"10."," "," ",10," "]
[7,null,null,null," ",null,"11."," "," ",1,{"$f":"E9","v":"  "}]
[8,null,null,null," ",null,"12."," "," ",2,{"$f":"E10","v":" "}]
[9,null,null,null," ",null,"13."," "," ",3," "]
[10,null,null,null," ",null,"14."," "," ",4,{"$f":"E12","v":" "}]
[null,null,null,null,null,null," "]
["Antritt"]
["Halle"]
["1 . A.",1,6,8,3,7,10,9,4,5,2]
[" ",{"$f":"VLOOKUP(B22,$A$7:$E$18,5,0)","v":"  "},{"$f":"VLOOKUP(C22,$A$7:$E$18,5,0)","v":" "},{"$f":"VLOOKUP(D22,$A$7:$E$18,5,0)","v":" "}," "," "," "," "," "," "," "]
["2 . A.",5,8,10,1,9,2,4,7,3,6]
[" ",{"$f":"VLOOKUP(B24,$A$7:$E$18,5,0)","v":" "},{"$f":"VLOOKUP(C24,$A$7:$E$18,5,0)","v":" "},{"$f":"VLOOKUP(D24,$A$7:$E$18,5,0)","v":" "},"  "," "," "," "," "," "," "]
["3 . A.",3,1,7,5,10,8,6,9,2,4]
[" ",{"$f":"VLOOKUP(B26,$A$7:$E$18,5,0)","v":" "},{"$f":"VLOOKUP(C26,$A$7:$E$18,5,0)","v":"  "},{"$f":"VLOOKUP(D26,$A$7:$E$18,5,0)","v":" "}," "," "," "," "," "," "," "]
["4 . A.",2,7,5,9,8,1,4,6,10,3]
[" ",{"$f":"VLOOKUP(B28,$A$7:$E$18,5,0)","v":" "},{"$f":"VLOOKUP(C28,$A$7:$E$18,5,0)","v":" "},{"$f":"VLOOKUP(D28,$A$7:$E$18,5,0)","v":" "}," "," ","  "," "," "," "," "]
["5 . A.",8,4,10,2,1,9,5,3,6,7]
[" ",{"$f":"VLOOKUP(B30,$A$7:$E$18,5,0)","v":" "},{"$f":"VLOOKUP(C30,$A$7:$E$18,5,0)","v":" "},{"$f":"VLOOKUP(D30,$A$7:$E$18,5,0)","v":" "}," ","  "," "," "," "," "," "]
["6 . A.",6,2,4,10,3,7,1,5,8,9]
[" ",{"$f":"VLOOKUP(B32,$A$7:$E$18,5,0)","v":" "},{"$f":"VLOOKUP(C32,$A$7:$E$18,5,0)","v":" "},{"$f":"VLOOKUP(D32,$A$7:$E$18,5,0)","v":" "}," "," "," ","  "," "," "," "]
["7 . A.",7,9,6,8,10,5,3,2,4,1]
[" ",{"$f":"VLOOKUP(B34,$A$7:$E$18,5,0)","v":" "},{"$f":"VLOOKUP(C34,$A$7:$E$18,5,0)","v":" "},{"$f":"VLOOKUP(D34,$A$7:$E$18,5,0)","v":" "}," "," "," "," "," "," ","  "]
["8 . A.",4,5,1,7,2,8,10,6,9,3]
[" ",{"$f":"VLOOKUP(B36,$A$7:$E$18,5,0)","v":" "},{"$f":"VLOOKUP(C36,$A$7:$E$18,5,0)","v":" "},{"$f":"VLOOKUP(D36,$A$7:$E$18,5,0)","v":"  "}," "," "," "," "," "," "," "]
["9 . A.",9,10,3,4,5,6,2,1,7,8]
[" ",{"$f":"VLOOKUP(B38,$A$7:$E$18,5,0)","v":" "},{"$f":"VLOOKUP(C38,$A$7:$E$18,5,0)","v":" "},{"$f":"VLOOKUP(D38,$A$7:$E$18,5,0)","v":" "}," "," "," "," ","  "," "," "]
["10 . A.",3,7,2,6,9,4,8,10,1,5]
[" ",{"$f":"VLOOKUP(B40,$A$7:$E$18,5,0)","v":" "},{"$f":"VLOOKUP(C40,$A$7:$E$18,5,0)","v":" "},{"$f":"VLOOKUP(D40,$A$7:$E$18,5,0)","v":" "}," "," "," "," "," ","  "," "]
["11 . A.",4,8,9,5,6,3,7,1,2,10]
[" ",{"$f":"VLOOKUP(B42,$A$7:$E$18,5,0)","v":" "},{"$f":"VLOOKUP(C42,$A$7:$E$18,5,0)","v":" "},{"$f":"VLOOKUP(D42,$A$7:$E$18,5,0)","v":" "}," "," "," "," ","  "," "," "]
["12 . A.",10,3,1,2,4,6,5,8,9,7]
[" ",{"$f":"VLOOKUP(B44,$A$7:$E$18,5,0)","v":" "},{"$f":"VLOOKUP(C44,$A$7:$E$18,5,0)","v":" "},{"$f":"VLOOKUP(D44,$A$7:$E$18,5,0)","v":"  "}," "," "," "," "," "," "," "]
["13 . A.",2,5,4,7,3,1,10,9,8,6]
[" ",{"$f":"VLOOKUP(B46,$A$7:$E$18,5,0)","v":" "},{"$f":"VLOOKUP(C46,$A$7:$E$18,5,0)","v":" "},{"$f":"VLOOKUP(D46,$A$7:$E$18,5,0)","v":" "}," "," ","  "," "," "," "," "]
["14 . A.","7.","8.","3.","4.","1.","2.","5.","6.","9.","10."]
[" "]
["Stand Mai 2015"]

{"sheet":"Spielbogen 8er","index":34,"n_rows":49,"n_cols":19,"rows_kept":49,"cut":false,"hidden":true,"merged":[[0,2,0,19],[1,2,1,9],[1,12,1,19],[21,14,21,15],[21,16,21,17],[21,18,21,19],[23,4,23,5],[23,6,23,7],[23,8,23,9],[23,10,23,11],[23,12,23,13],[23,14,23,15],[23,16,23,17],[21,4,21,5],[21,6,21,7],[21,8,21,9],[21,10,21,11],[21,12,21,13],[23,18,23,19],[25,4,25,5],[25,6,25,7],[25,8,25,9],[25,10,25,11],[25,12,25,13],[25,14,25,15],[25,16,25,17],[25,18,25,19],[27,16,27,17],[27,18,27,19],[29,4,29,5],[29,6,29,7],[29,8,29,9],[29,10,29,11],[29,12,29,13],[29,14,29,15],[29,16,29,17],[29,18,29,19],[27,4,27,5],[27,6,27,7],[27,8,27,9],[27,10,27,11],[27,12,27,13],[27,14,27,15],[31,16,31,17],[31,18,31,19],[33,4,33,5],[33,6,33,7],[33,8,33,9],[33,10,33,11],[33,12,33,13],[33,14,33,15],[33,16,33,17],[33,18,33,19],[31,4,31,5],[31,6,31,7],[31,8,31,9],[31,10,31,11],[31,12,31,13],[31,14,31,15],[35,16,35,17],[35,18,35,19],[37,4,37,5],[37,6,37,7],[37,8,37,9],[37,10,37,11],[37,12,37,13],[37,14,37,15],[37,16,37,17],[37,18,37,19],[35,4,35,5],[35,6,35,7],[35,8,35,9],[35,10,35,11],[35,12,35,13],[35,14,35,15],[43,14,43,15],[39,16,39,17],[39,18,39,19],[41,4,41,5],[41,6,41,7],[41,8,41,9],[41,10,41,11],[41,12,41,13],[41,14,41,15],[41,16,41,17],[41,18,41,19],[39,4,39,5],[39,6,39,7],[39,8,39,9],[39,10,39,11],[39,12,39,13],[39,14,39,15],[47,16,47,17],[47,18,47,19],[4,2,5,3],[47,4,47,5],[47,6,47,7],[47,8,47,9],[47,10,47,11],[47,12,47,13],[47,14,47,15],[43,16,43,17],[43,18,43,19],[45,4,45,5],[45,6,45,7],[45,8,45,9],[45,10,45,11],[45,12,45,13],[45,14,45,15],[45,16,45,17],[45,18,45,19],[43,4,43,5],[43,6,43,7],[43,8,43,9],[43,10,43,11],[43,12,43,13]]}
["Start",null,"Betriebssportverband Hamburg e.V."]
["Rangliste",null,"-  Sparte Bowling  -",null,null,null,null,null,null,null,null,null,"-  Spielsystembogen  -"]
[null,null,null,null,null,null,null,null,null,null," "," ","Antritt    Bahn",null,null,"Datum",null,"Ausrichter"]
[null,null,null,null,null,null,null,null,null,null,null,null,"1.","OT",null,"2024-09-12",null,1,{"$f":"I10","v":"PAN 1"}]
[null,null,"Klasse      ",null,null,null,null,null,null,null,null,null,"2.","OT",null,"2024-09-26",null,2,{"$f":"I11","v":"DB 3"}]
[null,null,null,null,null,null,null,null,null,null," ",null,"3.","WB",null,"2024-10-10",null,3,{"$f":"I12","v":"DAT 2"}]
[null,null,null,null,null,null,null,null,null,null,null,null,"4.","OT",null,"2024-10-24",null,4,"STI 3"]
[null,null,null,null,null,null,null,null,null," ",null,null,"5.","WB",null,"2024-11-07",null,5,"SGS 1"]
[null,null,null,"BSG",null,null,null,null,"Kurzf.",null,null,null,"6.","WB",null,"2025-01-16",null,6,"JUS 2"]
[null,null,1,"Panasonic 1",null,null,null,null,"PAN 1",null,null,null,"7.","OT",null,"2025-01-30",null,7,"P2 2"]
[null,null,2,"Deutsche Bank 3",null,null,null,null,"DB 3",null,null,null,"8.","WB",null,"2025-02-13",null,8,"KS 2"]
[null,null,3,"Dataport 2",null,null,null,null,"DAT 2",null,null,null,"9.","OT",null,"2025-02-27",null,1,{"$f":"I10","v":"PAN 1"}]
[null,null,4,"Still 3",null,null,null,null,"STI 3",null,null,null,"10.","WB",null,"2025-03-13",null,2,{"$f":"I11","v":"DB 3"}]
[null,null,5,"SG Stern Hamburg 1",null,null,null,null,"SGS 1",null,null,null,"11.","OT",null,"2025-03-27",null,3,"DAT 2"]
[null,null,6,"Justitzbehörde 2",null,null,null,null,"JUS 2",null,null,null,"12.","WB",null,"2025-04-10",null,4,"STI 3"]
[null,null,7,"Postamt 2",null,null,null,null,"P2 2",null,null,null,"13.","OT",null,"2025-04-24",null,5,"SGS 1"]
[null,null,8,"Körber Sports 2",null,null,null,null,"KS 2",null,null,null,"14.","WB",null,"2025-05-08",null,6,{"$f":"I15","v":"JUS 2"}]
[null,null,null,null,null,null,null,null,null,null,null,null,null," "]
[null,null,"Antritt","Halle"]
[null,null,"Datum"]
[null,null,"1 . A.","OT",6,null,7,null,5,null,8,null,4,null,1,null,3,null,2]
[null,null,"2024-09-12",null,{"$f":"VLOOKUP(E21,$C$10:$J$17,7,0)","v":"JUS 2"},null,{"$f":"VLOOKUP(G21,$C$10:$J$17,7,0)","v":"P2 2"},null,{"$f":"VLOOKUP(I21,$C$10:$J$17,7,0)","v":"SGS 1"},null,{"$f":"VLOOKUP(K21,$C$10:$J$17,7,0)","v":"KS 2"},null,{"$f":"VLOOKUP(M21,$C$10:$J$17,7,0)","v":"STI 3"},null,{"$f":"VLOOKUP(O21,$C$10:$J$17,7,0)","v":"PAN 1"},null,{"$f":"VLOOKUP(Q21,$C$10:$J$17,7,0)","v":"DAT 2"},null,{"$f":"VLOOKUP(S21,$C$10:$J$17,7,0)","v":"DB 3"}]
[null,null,"2 . A.","OT",1,null,2,null,3,null,4,null,5,null,6,null,8,null,7]
[null,null,"2024-09-16",null,{"$f":"VLOOKUP(E23,$C$10:$J$17,7,0)","v":"PAN 1"},null,{"$f":"VLOOKUP(G23,$C$10:$J$17,7,0)","v":"DB 3"},null,{"$f":"VLOOKUP(I23,$C$10:$J$17,7,0)","v":"DAT 2"},null,{"$f":"VLOOKUP(K23,$C$10:$J$17,7,0)","v":"STI 3"},null,{"$f":"VLOOKUP(M23,$C$10:$J$17,7,0)","v":"SGS 1"},null,{"$f":"VLOOKUP(O23,$C$10:$J$17,7,0)","v":"JUS 2"},null,{"$f":"VLOOKUP(Q23,$C$10:$J$17,7,0)","v":"KS 2"},null,{"$f":"VLOOKUP(S23,$C$10:$J$17,7,0)","v":"P2 2"}]
[null,null,"3 . A.","WB",5,null,4,null,7,null,2,null,1,null,8,null,6,null,3]
[null,null,"2024-10-10",null,{"$f":"VLOOKUP(E25,$C$10:$J$17,7,0)","v":"SGS 1"},null,{"$f":"VLOOKUP(G25,$C$10:$J$17,7,0)","v":"STI 3"},null,{"$f":"VLOOKUP(I25,$C$10:$J$17,7,0)","v":"P2 2"},null,{"$f":"VLOOKUP(K25,$C$10:$J$17,7,0)","v":"DB 3"},null,{"$f":"VLOOKUP(M25,$C$10:$J$17,7,0)","v":"PAN 1"},null,{"$f":"VLOOKUP(O25,$C$10:$J$17,7,0)","v":"KS 2"},null,{"$f":"VLOOKUP(Q25,$C$10:$J$17,7,0)","v":"JUS 2"},null,{"$f":"VLOOKUP(S25,$C$10:$J$17,7,0)","v":"DAT 2"}]
[null,null,"4 . A.",null,1,null,6,null,3,null,8,null,4,null,7,null,2,null,5]
[null,null,"2024-10-24",null,{"$f":"VLOOKUP(E27,$C$10:$J$17,7,0)","v":"PAN 1"},null,{"$f":"VLOOKUP(G27,$C$10:$J$17,7,0)","v":"JUS 2"},null,{"$f":"VLOOKUP(I27,$C$10:$J$17,7,0)","v":"DAT 2"},null,{"$f":"VLOOKUP(K27,$C$10:$J$17,7,0)","v":"KS 2"},null,{"$f":"VLOOKUP(M27,$C$10:$J$17,7,0)","v":"STI 3"},null,{"$f":"VLOOKUP(O27,$C$10:$J$17,7,0)","v":"P2 2"},null,{"$f":"VLOOKUP(Q27,$C$10:$J$17,7,0)","v":"DB 3"},null,{"$f":"VLOOKUP(S27,$C$10:$J$17,7,0)","v":"SGS 1"}]
[null,null,"5 . A.","WB",8,null,4,null,7,null,5,null,6,null,2,null,1,null,3]
[null,null,"2024-11-07",null,{"$f":"VLOOKUP(E29,$C$10:$J$17,7,0)","v":"KS 2"},null,{"$f":"VLOOKUP(G29,$C$10:$J$17,7,0)","v":"STI 3"},null,{"$f":"VLOOKUP(I29,$C$10:$J$17,7,0)","v":"P2 2"},null,{"$f":"VLOOKUP(K29,$C$10:$J$17,7,0)","v":"SGS 1"},null,{"$f":"VLOOKUP(M29,$C$10:$J$17,7,0)","v":"JUS 2"},null,{"$f":"VLOOKUP(O29,$C$10:$J$17,7,0)","v":"DB 3"},null,{"$f":"VLOOKUP(Q29,$C$10:$J$17,7,0)","v":"PAN 1"},null,{"$f":"VLOOKUP(S29,$C$10:$J$17,7,0)","v":"DAT 2"}]
[null,null,"6 . A.","WB",4,null,6,null,5,null,3,null,7,null,1,null,2,null,8]
[null,null,"2025-01-16",null,{"$f":"VLOOKUP(E31,$C$10:$J$17,7,0)","v":"STI 3"},null,{"$f":"VLOOKUP(G31,$C$10:$J$17,7,0)","v":"JUS 2"},null,{"$f":"VLOOKUP(I31,$C$10:$J$17,7,0)","v":"SGS 1"},null,{"$f":"VLOOKUP(K31,$C$10:$J$17,7,0)","v":"DAT 2"},null,{"$f":"VLOOKUP(M31,$C$10:$J$17,7,0)","v":"P2 2"},null,{"$f":"VLOOKUP(O31,$C$10:$J$17,7,0)","v":"PAN 1"},null,{"$f":"VLOOKUP(Q31,$C$10:$J$17,7,0)","v":"DB 3"},null,{"$f":"VLOOKUP(S31,$C$10:$J$17,7,0)","v":"KS 2"}]
[null,null,"7 . A.","OT",7,null,3,null,2,null,4,null,6,null,8,null,5,null,1]
[null,null,"2025-01-30",null,{"$f":"VLOOKUP(E33,$C$10:$J$17,7,0)","v":"P2 2"},null,{"$f":"VLOOKUP(G33,$C$10:$J$17,7,0)","v":"DAT 2"},null,{"$f":"VLOOKUP(I33,$C$10:$J$17,7,0)","v":"DB 3"},null,{"$f":"VLOOKUP(K33,$C$10:$J$17,7,0)","v":"STI 3"},null,{"$f":"VLOOKUP(M33,$C$10:$J$17,7,0)","v":"JUS 2"},null,{"$f":"VLOOKUP(O33,$C$10:$J$17,7,0)","v":"KS 2"},null,{"$f":"VLOOKUP(Q33,$C$10:$J$17,7,0)","v":"SGS 1"},null,{"$f":"VLOOKUP(S33,$C$10:$J$17,7,0)","v":"PAN 1"}]
[null,null,"8 . A.","WB",8,null,2,null,1,null,7,null,3,null,5,null,4,null,6]
[null,null,"2025-02-13",null,{"$f":"VLOOKUP(E35,$C$10:$J$17,7,0)","v":"KS 2"},null,{"$f":"VLOOKUP(G35,$C$10:$J$17,7,0)","v":"DB 3"},null,{"$f":"VLOOKUP(I35,$C$10:$J$17,7,0)","v":"PAN 1"},null,{"$f":"VLOOKUP(K35,$C$10:$J$17,7,0)","v":"P2 2"},null,{"$f":"VLOOKUP(M35,$C$10:$J$17,7,0)","v":"DAT 2"},null,{"$f":"VLOOKUP(O35,$C$10:$J$17,7,0)","v":"SGS 1"},null,{"$f":"VLOOKUP(Q35,$C$10:$J$17,7,0)","v":"STI 3"},null,{"$f":"VLOOKUP(S35,$C$10:$J$17,7,0)","v":"JUS 2"}]
[null,null,"9 . A.","OT",3,null,1,null,6,null,2,null,8,null,4,null,7,null,5]
[null,null,"2025-02-27",null,{"$f":"VLOOKUP(E37,$C$10:$J$17,7,0)","v":"DAT 2"},null,{"$f":"VLOOKUP(G37,$C$10:$J$17,7,0)","v":"PAN 1"},null,{"$f":"VLOOKUP(I37,$C$10:$J$17,7,0)","v":"JUS 2"},null,{"$f":"VLOOKUP(K37,$C$10:$J$17,7,0)","v":"DB 3"},null,{"$f":"VLOOKUP(M37,$C$10:$J$17,7,0)","v":"KS 2"},null,{"$f":"VLOOKUP(O37,$C$10:$J$17,7,0)","v":"STI 3"},null,{"$f":"VLOOKUP(Q37,$C$10:$J$17,7,0)","v":"P2 2"},null,{"$f":"VLOOKUP(S37,$C$10:$J$17,7,0)","v":"SGS 1"}]
[null,null,"10 . A.","WB",6,null,7,null,8,null,5,null,2,null,3,null,1,null,4]
[null,null,"2025-03-13",null,{"$f":"VLOOKUP(E39,$C$10:$J$17,7,0)","v":"JUS 2"},null,{"$f":"VLOOKUP(G39,$C$10:$J$17,7,0)","v":"P2 2"},null,{"$f":"VLOOKUP(I39,$C$10:$J$17,7,0)","v":"KS 2"},null,{"$f":"VLOOKUP(K39,$C$10:$J$17,7,0)","v":"SGS 1"},null,{"$f":"VLOOKUP(M39,$C$10:$J$17,7,0)","v":"DB 3"},null,{"$f":"VLOOKUP(O39,$C$10:$J$17,7,0)","v":"DAT 2"},null,{"$f":"VLOOKUP(Q39,$C$10:$J$17,7,0)","v":"PAN 1"},null,{"$f":"VLOOKUP(S39,$C$10:$J$17,7,0)","v":"STI 3"}]
[null,null,"11 . A.","OT",2,null,5,null,4,null,7,null,1,null,6,null,3,null,8]
[null,null,"2025-03-27",null,{"$f":"VLOOKUP(E41,$C$10:$J$17,7,0)","v":"DB 3"},null,{"$f":"VLOOKUP(G41,$C$10:$J$17,7,0)","v":"SGS 1"},null,{"$f":"VLOOKUP(I41,$C$10:$J$17,7,0)","v":"STI 3"},null,{"$f":"VLOOKUP(K41,$C$10:$J$17,7,0)","v":"P2 2"},null,{"$f":"VLOOKUP(M41,$C$10:$J$17,7,0)","v":"PAN 1"},null,{"$f":"VLOOKUP(O41,$C$10:$J$17,7,0)","v":"JUS 2"},null,{"$f":"VLOOKUP(Q41,$C$10:$J$17,7,0)","v":"DAT 2"},null,{"$f":"VLOOKUP(S41,$C$10:$J$17,7,0)","v":"KS 2"}]
[null,null,"12 . A.","WB",7,null,8,null,2,null,1,null,3,null,4,null,5,null,6]
[null,null,"2025-04-10",null,{"$f":"VLOOKUP(E43,$C$10:$J$17,7,0)","v":"P2 2"},null,{"$f":"VLOOKUP(G43,$C$10:$J$17,7,0)","v":"KS 2"},null,{"$f":"VLOOKUP(I43,$C$10:$J$17,7,0)","v":"DB 3"},null,{"$f":"VLOOKUP(K43,$C$10:$J$17,7,0)","v":"PAN 1"},null,{"$f":"VLOOKUP(M43,$C$10:$J$17,7,0)","v":"DAT 2"},null,{"$f":"VLOOKUP(O43,$C$10:$J$17,7,0)","v":"STI 3"},null,{"$f":"VLOOKUP(Q43,$C$10:$J$17,7,0)","v":"SGS 1"},null,{"$f":"VLOOKUP(S43,$C$10:$J$17,7,0)","v":"JUS 2"}]
[null,null,"13 . A.","OT",5,null,1,null,8,null,6,null,7,null,3,null,4,null,2]
[null,null,"2025-04-24",null,{"$f":"VLOOKUP(E45,$C$10:$J$17,7,0)","v":"SGS 1"},null,{"$f":"VLOOKUP(G45,$C$10:$J$17,7,0)","v":"PAN 1"},null,{"$f":"VLOOKUP(I45,$C$10:$J$17,7,0)","v":"KS 2"},null,{"$f":"VLOOKUP(K45,$C$10:$J$17,7,0)","v":"JUS 2"},null,{"$f":"VLOOKUP(M45,$C$10:$J$17,7,0)","v":"P2 2"},null,{"$f":"VLOOKUP(O45,$C$10:$J$17,7,0)","v":"DAT 2"},null,{"$f":"VLOOKUP(Q45,$C$10:$J$17,7,0)","v":"STI 3"},null,{"$f":"VLOOKUP(S45,$C$10:$J$17,7,0)","v":"DB 3"}]
[null,null,"14 . A.","WB","7 .",null,"8 .",null,"3 .",null,"4 .",null,"1 .",null,"2 .",null,"5 .",null,"6 ."]
[null,null,"2025-05-08",null," ",null," ",null," ",null," ",null," ",null," ",null," ",null," "]
[null,null,"Stand Mai 2015"]